{"text_format":"1","workbook":"xlsx","n_sheets":24,"sheets":["Úvod","Start","Kontakt","ZPV","V.l.ZPV","4x100m","PJ - S","PJ - T","PJ-T","PJ-V","PJ-VJ","PJ-VAll","PJ - P","PJ - PAll","PJ-P","PJ-PAll","PJ-C","TEST","PÚ","Výsledky","Tisk-v1","Tisk-v2","Pozn.","J"],"not_rendered":{"charts":0,"images":0,"macros":1,"external_links":0,"defined_names":35,"comments":2,"pivot_tables":0},"unopened":[],"bounds":{"document_bytes":16777216,"sheet_cells":100000,"rows_first":2000,"rows_last":500,"rows_between":2000,"halvings":0,"cell_chars":16384,"cell_head_chars":4096},"cells_cut":0,"cells_raw":0,"read":"whole","date_system":"1900"}

{"sheet":"Úvod","index":0,"n_rows":27,"n_cols":13,"rows_kept":27,"cut":false,"hidden":false,"merged":[[0,1,0,9],[1,1,1,9]]}
[null,"Program pro zpracování výsledků ",null,null,null,null,null,null,null,null,null,1,1]
[null,"DOROST - DRUŽSTVA"]
[]
[]
[]
[]
[]
[]
[]
[]
[]
[]
[]
[]
[]
[]
[]
[]
[]
[]
[]
[]
[]
[]
[null,"Autor programu:",null,"Ing. Milan Hoffmann"]
[null,"Oprávněný uživatel:",null,"SH ČMS"]
[null,"Verze programu: ",null,"2011/2 (16.05.2011)"]

{"sheet":"Start","index":1,"n_rows":31,"n_cols":5,"rows_kept":31,"cut":false,"hidden":false,"merged":[[0,1,0,5],[1,1,1,5],[2,1,2,5],[4,3,4,4]]}
[null,"Startovní listina soutěže"]
[null,"Krajské kolo dorostu"]
[null,"18.06.2022 Pardubice"]
[]
[null,null,"Kat.:","dorostenky"]
[null,null,"st.č.","SDH","OKRES"]
[null,null,1,"Kamenec","SY"]
[null,null,2,"Lukavice","CR"]
[null,null,3,"Lubná","SY"]
[null,null,4,"Skuteč","CR"]
[null,null,5,"Bystřec","UO"]
[null,null,6,"Letohrad Kunčice","UO"]
[null,null,7]
[null,null,8]
[null,null,9]
[null,null,10]
[null,null,11]
[null,null,12]
[null,null,13]
[null,null,14]
[null,null,15]
[null,null,16]
[null,null,17]
[null,null,18]
[null,null,19]
[null,null,20]
[null,null,21]
[null,null,22]
[null,null,23]
[null,null,24]
[null,null,25]

{"sheet":"Kontakt","index":2,"n_rows":15,"n_cols":3,"rows_kept":15,"cut":false,"hidden":false,"merged":[[0,1,0,14]]}
[null,"Kontakt"]
[]
[null,"Program na zpracování výsledků (DOROST - Družstva) pro SH ČMS vytvořil:"]
[]
[null,"Ing. Milan HOFFMANN"]
[null,"Vojanova 760/49"]
[null,"318 00 PLZEŇ"]
[]
[null,"tel.:","+420 373 540 062"]
[null,"mobil:","+420 606 916 333"]
[null,null,"+420 731 428 398"]
[]
[null,"mail:","milan.hoffmann@seznam.cz"]
[]
[null,"www:","www.dh.cz"]

{"sheet":"ZPV","index":3,"n_rows":30,"n_cols":22,"rows_kept":30,"cut":false,"hidden":false,"merged":[[3,3,4,3],[3,8,4,8],[3,9,3,12],[3,13,3,20],[0,1,0,20],[2,2,2,3],[3,1,4,1],[3,4,4,4],[3,5,4,5],[3,6,4,6],[3,7,4,7],[3,2,4,2]]}
[null," Závod požárické všestrannosti: DOROST - DRUŽSTVA"]
[]
[null,null,{"$f":"Start!$D$5","v":"dorostenky"}]
[null,"Číslo hlídky","název hlídky",{"$f":"Start!$E$6","v":"OKRES"}," čas startu (hh:mm:ss)"," čas cíle (hh:mm:ss)"," čistý čas na trati (mm:ss)","čekací čas (mm:ss)","výsledný čas na trati (mm:ss)","Výsledky soutěže",null,null,null,"tresný bod = 1 minuta "]
[null,null,null,null,null,null,null,null,null," trestné minuty (h:mm)"," výsledný čas (h:mm:ss)"," počet bodů za umístění"," součet tresných bodů"," přesun podle azimutu"," střelba ze vzduchovky"," šplh"," přeskok přes vodní příkop"," určování RHP"," určování věcných prostředků"," optická signalizace"," první pomoc"," * diskvalifikace (D)"]
[null,1,{"$f":"IF(Start!D7=\"\",\"\",Start!D7)","v":"Kamenec"},{"$f":"IF(C6=\"\",\"\",IF(Start!E7=\"\",\"\",Start!E7))","v":"SY"},null,null,{"$f":"IF(C6=\"\",\"\",IF(F6>0,IF(AND(E6>0,F6>0,(F6-E6)>0),F6-E6,\"chyba\"),\"X\"))","v":"X"},{"$f":"IF(C6=\"\",\"\",0)","v":"00:00:00"},{"$f":"IF(C6=\"\",\"\",IF(G6=\"chyba\",\"chyba\",IF(G6=\"X\",\"X\",IF((G6-H6)<0,\"chyba\",G6-H6))))","v":"X"},{"$f":"IF(C6=\"\",\"\",M6/1440)","v":"00:00:00"},{"$f":"IF(C6=\"\",\"\",IF(I6=\"chyba\",\"chyba\",IF(I6=\"X\",\"X\",IF(OR(N6=\"D\",V6=\"D\"),\"D\",ROUND(SUM(I6:J6),7)))))","v":"X"},{"$f":"IF(C6=\"\",\"\",IF(K6=\"chyba\",\"CH\",IF(K6=\"X\",\"X\",IF(K6=\"D\",\"D\",RANK(K6,K$6:K$30,1)))))","v":"X"},{"$f":"IF(C6=\"\",\"\",SUM(N6:U6))","v":0}]
[null,2,{"$f":"IF(Start!D8=\"\",\"\",Start!D8)","v":"Lukavice"},{"$f":"IF(C7=\"\",\"\",IF(Start!E8=\"\",\"\",Start!E8))","v":"CR"},null,null,{"$f":"IF(C7=\"\",\"\",IF(F7>0,IF(AND(E7>0,F7>0,(F7-E7)>0),F7-E7,\"chyba\"),\"X\"))","v":"X"},{"$f":"IF(C7=\"\",\"\",0)","v":"00:00:00"},{"$f":"IF(C7=\"\",\"\",IF(G7=\"chyba\",\"chyba\",IF(G7=\"X\",\"X\",IF((G7-H7)<0,\"chyba\",G7-H7))))","v":"X"},{"$f":"IF(C7=\"\",\"\",M7/1440)","v":"00:00:00"},{"$f":"IF(C7=\"\",\"\",IF(I7=\"chyba\",\"chyba\",IF(I7=\"X\",\"X\",IF(OR(N7=\"D\",V7=\"D\"),\"D\",ROUND(SUM(I7:J7),7)))))","v":"X"},{"$f":"IF(C7=\"\",\"\",IF(K7=\"chyba\",\"CH\",IF(K7=\"X\",\"X\",IF(K7=\"D\",\"D\",RANK(K7,K$6:K$30,1)))))","v":"X"},{"$f":"IF(C7=\"\",\"\",SUM(N7:U7))","v":0}]
[null,3,{"$f":"IF(Start!D9=\"\",\"\",Start!D9)","v":"Lubná"},{"$f":"IF(C8=\"\",\"\",IF(Start!E9=\"\",\"\",Start!E9))","v":"SY"},null,null,"X","00:00:00","X","00:00:00","X","X",0]
[null,4,{"$f":"IF(Start!D10=\"\",\"\",Start!D10)","v":"Skuteč"},{"$f":"IF(C9=\"\",\"\",IF(Start!E10=\"\",\"\",Start!E10))","v":"CR"},null,null,"X","00:00:00","X","00:00:00","X","X",0]
[null,5,{"$f":"IF(Start!D11=\"\",\"\",Start!D11)","v":"Bystřec"},{"$f":"IF(C10=\"\",\"\",IF(Start!E11=\"\",\"\",Start!E11))","v":"UO"},null,null,"X","00:00:00","X","00:00:00","X","X",0]
[null,6,{"$f":"IF(Start!D12=\"\",\"\",Start!D12)","v":"Letohrad Kunčice"},{"$f":"IF(C11=\"\",\"\",IF(Start!E12=\"\",\"\",Start!E12))","v":"UO"},null,null,"X","00:00:00","X","00:00:00","X","X",0]
[null,7,{"$f":"IF(Start!D13=\"\",\"\",Start!D13)","v":""},{"$f":"IF(C12=\"\",\"\",IF(Start!E13=\"\",\"\",Start!E13))","v":""},null,null,"",null,"","","","",""]
[null,8,{"$f":"IF(Start!D14=\"\",\"\",Start!D14)","v":""},{"$f":"IF(C13=\"\",\"\",IF(Start!E14=\"\",\"\",Start!E14))","v":""},null,null,"",null,"","","","",""]
[null,9,{"$f":"IF(Start!D15=\"\",\"\",Start!D15)","v":""},{"$f":"IF(C14=\"\",\"\",IF(Start!E15=\"\",\"\",Start!E15))","v":""},null,null,"",null,"","","","",""]
[null,10,{"$f":"IF(Start!D16=\"\",\"\",Start!D16)","v":""},{"$f":"IF(C15=\"\",\"\",IF(Start!E16=\"\",\"\",Start!E16))","v":""},null,null,"",null,"","","","",""]
[null,11,{"$f":"IF(Start!D17=\"\",\"\",Start!D17)","v":""},{"$f":"IF(C16=\"\",\"\",IF(Start!E17=\"\",\"\",Start!E17))","v":""},null,null,"",null,"","","","",""]
[null,12,{"$f":"IF(Start!D18=\"\",\"\",Start!D18)","v":""},{"$f":"IF(C17=\"\",\"\",IF(Start!E18=\"\",\"\",Start!E18))","v":""},null,null,"",null,"","","","",""]
[null,13,{"$f":"IF(Start!D19=\"\",\"\",Start!D19)","v":""},{"$f":"IF(C18=\"\",\"\",IF(Start!E19=\"\",\"\",Start!E19))","v":""},null,null,"","","","","","",""]
[null,14,{"$f":"IF(Start!D20=\"\",\"\",Start!D20)","v":""},{"$f":"IF(C19=\"\",\"\",IF(Start!E20=\"\",\"\",Start!E20))","v":""},null,null,"","","","","","",""]
[null,15,{"$f":"IF(Start!D21=\"\",\"\",Start!D21)","v":""},{"$f":"IF(C20=\"\",\"\",IF(Start!E21=\"\",\"\",Start!E21))","v":""},null,null,"","","","","","",""]
[null,16,{"$f":"IF(Start!D22=\"\",\"\",Start!D22)","v":""},{"$f":"IF(C21=\"\",\"\",IF(Start!E22=\"\",\"\",Start!E22))","v":""},null,null,"","","","","","",""]
[null,17,{"$f":"IF(Start!D23=\"\",\"\",Start!D23)","v":""},{"$f":"IF(C22=\"\",\"\",IF(Start!E23=\"\",\"\",Start!E23))","v":""},null,null,"","","","","","",""]
[null,18,{"$f":"IF(Start!D24=\"\",\"\",Start!D24)","v":""},{"$f":"IF(C23=\"\",\"\",IF(Start!E24=\"\",\"\",Start!E24))","v":""},null,null,"","","","","","",""]
[null,19,{"$f":"IF(Start!D25=\"\",\"\",Start!D25)","v":""},{"$f":"IF(C24=\"\",\"\",IF(Start!E25=\"\",\"\",Start!E25))","v":""},null,null,"","","","","","",""]
[null,20,{"$f":"IF(Start!D26=\"\",\"\",Start!D26)","v":""},{"$f":"IF(C25=\"\",\"\",IF(Start!E26=\"\",\"\",Start!E26))","v":""},null,null,"","","","","","",""]
[null,21,{"$f":"IF(Start!D27=\"\",\"\",Start!D27)","v":""},{"$f":"IF(C26=\"\",\"\",IF(Start!E27=\"\",\"\",Start!E27))","v":""},null,null,"","","","","","",""]
[null,22,{"$f":"IF(Start!D28=\"\",\"\",Start!D28)","v":""},{"$f":"IF(C27=\"\",\"\",IF(Start!E28=\"\",\"\",Start!E28))","v":""},null,null,"","","","","","",""]
[null,23,{"$f":"IF(Start!D29=\"\",\"\",Start!D29)","v":""},{"$f":"IF(C28=\"\",\"\",IF(Start!E29=\"\",\"\",Start!E29))","v":""},null,null,"","","","","","",""]
[null,24,{"$f":"IF(Start!D30=\"\",\"\",Start!D30)","v":""},{"$f":"IF(C29=\"\",\"\",IF(Start!E30=\"\",\"\",Start!E30))","v":""},null,null,"","","","","","",""]
[null,25,{"$f":"IF(Start!D31=\"\",\"\",Start!D31)","v":""},{"$f":"IF(C30=\"\",\"\",IF(Start!E31=\"\",\"\",Start!E31))","v":""},null,null,"","","","","","",""]

{"sheet":"V.l.ZPV","index":4,"n_rows":6,"n_cols":6,"rows_kept":6,"cut":false,"hidden":false,"merged":[[0,1,0,5],[2,3,2,4],[3,3,3,4]]}
[null,"Výsledková listina - ZPV"]
[]
[null,null,null,"Pořadí sborů"]
[null,null,null,{"$f":"Start!$D$5","v":"dorostenky"}]
[null,null,"Pořadí","SDH",{"$f":"Start!$E$6","v":"OKRES"}]
[null,null,null,null,null,"."]

{"sheet":"4x100m","index":5,"n_rows":29,"n_cols":16,"rows_kept":29,"cut":false,"hidden":false,"merged":[[0,1,0,15],[2,3,2,6],[2,7,2,10]]}
[null,"Štafeta 4x100 m s překážkami:"]
[]
[null,null,{"$f":"Start!$D$5","v":"dorostenky"},"I.p.",null,null,null,"II.p."]
[null,"st.č.","SDH",1,2,3,"čas",1,2,3,"čas","C.čas",null,"Poř.",null,"Poř."]
[null,{"$f":"Start!C7","v":1},{"$f":"IF(Start!D7=\"\",\"\",Start!D7)","v":"Kamenec"},74.3,null,null,{"$f":"IF($C5=\"\",\"\",IF(OR($D5=\"DNF\",$E5=\"DNF\",$F5=\"DNF\",AND($D5=\"\",$E5=\"\",$F5=\"\")),\"DNF\",IF(OR($D5=\"NP\",$E5=\"NP\",$F5=\"NP\"),\"NP\",IF(ISERROR(MEDIAN($D5:$F5)),\"DNF\",IF(OR($D5=\"X\",$E5=\"X\",$F5=\"X\",$D5=\"\",$E5=\"\",$F5=\"\",$D5=\"x\",$E5=\"x\",$F5=\"x\"),MAX($D5:$F5),MEDIAN($D5:$F5))))))","v":74.3},72.63,null,null,{"$f":"IF($C5=\"\",\"\",IF(OR($H5=\"DNF\",$I5=\"DNF\",$J5=\"DNF\",AND($H5=\"\",$I5=\"\",$J5=\"\")),\"DNF\",IF(OR($H5=\"NP\",$I5=\"NP\",$J5=\"NP\"),\"NP\",IF(ISERROR(MEDIAN($H5:$J5)),\"DNF\",IF(OR($H5=\"X\",$I5=\"X\",$J5=\"X\",$H5=\"\",$I5=\"\",$J5=\"\",$H5=\"x\",$I5=\"x\",$J5=\"x\"),MAX($H5:$J5),MEDIAN($H5:$J5))))))","v":72.63},{"$f":"IF(C5=\"\",\"\",IF(OR(AND(G5=\"NP\",K5=\"NP\"),AND(G5=\"DNF\",K5=\"DNF\")),G5,IF(AND(G5=\"NP\",K5=\"DNF\"),G5,IF(AND(G5=\"DNF\",K5=\"NP\"),K5,MIN(G5,K5)))))","v":72.63},null,{"$f":"IF(C5=\"\",\"\",IF(OR(L5=\"NP\",L5=\"DNF\"),L5,RANK(L5,L$5:L$29,1)))","v":3},null,{"$f":"IF(C5=\"\",\"\",IF(OR(N5=\"NP\",N5=\"DNF\"),IF(N5=\"NP\",MAX(N$5:N$29)+COUNTIF((N$5:N$29),MAX(N$5:N$29)),MAX(N$5:N$29)+COUNTIF((N$5:N$29),MAX(N$5:N$29))+COUNTIF((N$5:N$29),\"NP\")),N5))","v":3}]
[null,{"$f":"Start!C8","v":2},{"$f":"IF(Start!D8=\"\",\"\",Start!D8)","v":"Lukavice"},81.400000000000006,null,null,{"$f":"IF($C6=\"\",\"\",IF(OR($D6=\"DNF\",$E6=\"DNF\",$F6=\"DNF\",AND($D6=\"\",$E6=\"\",$F6=\"\")),\"DNF\",IF(OR($D6=\"NP\",$E6=\"NP\",$F6=\"NP\"),\"NP\",IF(ISERROR(MEDIAN($D6:$F6)),\"DNF\",IF(OR($D6=\"X\",$E6=\"X\",$F6=\"X\",$D6=\"\",$E6=\"\",$F6=\"\",$D6=\"x\",$E6=\"x\",$F6=\"x\"),MAX($D6:$F6),MEDIAN($D6:$F6))))))","v":81.400000000000006},95.81,"NP",null,{"$f":"IF($C6=\"\",\"\",IF(OR($H6=\"DNF\",$I6=\"DNF\",$J6=\"DNF\",AND($H6=\"\",$I6=\"\",$J6=\"\")),\"DNF\",IF(OR($H6=\"NP\",$I6=\"NP\",$J6=\"NP\"),\"NP\",IF(ISERROR(MEDIAN($H6:$J6)),\"DNF\",IF(OR($H6=\"X\",$I6=\"X\",$J6=\"X\",$H6=\"\",$I6=\"\",$J6=\"\",$H6=\"x\",$I6=\"x\",$J6=\"x\"),MAX($H6:$J6),MEDIAN($H6:$J6))))))","v":"NP"},{"$f":"IF(C6=\"\",\"\",IF(OR(AND(G6=\"NP\",K6=\"NP\"),AND(G6=\"DNF\",K6=\"DNF\")),G6,IF(AND(G6=\"NP\",K6=\"DNF\"),G6,IF(AND(G6=\"DNF\",K6=\"NP\"),K6,MIN(G6,K6)))))","v":81.400000000000006},null,{"$f":"IF(C6=\"\",\"\",IF(OR(L6=\"NP\",L6=\"DNF\"),L6,RANK(L6,L$5:L$29,1)))","v":6},null,{"$f":"IF(C6=\"\",\"\",IF(OR(N6=\"NP\",N6=\"DNF\"),IF(N6=\"NP\",MAX(N$5:N$29)+COUNTIF((N$5:N$29),MAX(N$5:N$29)),MAX(N$5:N$29)+COUNTIF((N$5:N$29),MAX(N$5:N$29))+COUNTIF((N$5:N$29),\"NP\")),N6))","v":6}]
[null,{"$f":"Start!C9","v":3},{"$f":"IF(Start!D9=\"\",\"\",Start!D9)","v":"Lubná"},69.41,null,null,69.41,"NP",null,null,"NP",69.41,null,2,null,2]
[null,{"$f":"Start!C10","v":4},{"$f":"IF(Start!D10=\"\",\"\",Start!D10)","v":"Skuteč"},67.17,null,null,67.17,68.83,null,null,68.83,67.17,null,1,null,1]
[null,{"$f":"Start!C11","v":5},{"$f":"IF(Start!D11=\"\",\"\",Start!D11)","v":"Bystřec"},81.05,null,null,81.05,82.65,null,null,82.65,81.05,null,5,null,5]
[null,{"$f":"Start!C12","v":6},{"$f":"IF(Start!D12=\"\",\"\",Start!D12)","v":"Letohrad Kunčice"},73.150000000000006,null,null,73.150000000000006,73.28,null,null,73.28,73.150000000000006,null,4,null,4]
[null,{"$f":"Start!C13","v":7},{"$f":"IF(Start!D13=\"\",\"\",Start!D13)","v":""},null,null,null,"",null,null,null,"","",null,"",null,""]
[null,{"$f":"Start!C14","v":8},{"$f":"IF(Start!D14=\"\",\"\",Start!D14)","v":""},null,null,null,"",null,null,null,"","",null,"",null,""]
[null,{"$f":"Start!C15","v":9},{"$f":"IF(Start!D15=\"\",\"\",Start!D15)","v":""},null,null,null,"",null,null,null,"","",null,"",null,""]
[null,{"$f":"Start!C16","v":10},{"$f":"IF(Start!D16=\"\",\"\",Start!D16)","v":""},null,null,null,"",null,null,null,"","",null,"",null,""]
[null,{"$f":"Start!C17","v":11},{"$f":"IF(Start!D17=\"\",\"\",Start!D17)","v":""},null,null,null,"",null,null,null,"","",null,"",null,""]
[null,{"$f":"Start!C18","v":12},{"$f":"IF(Start!D18=\"\",\"\",Start!D18)","v":""},null,null,null,"",null,null,null,"","",null,"",null,""]
[null,{"$f":"Start!C19","v":13},{"$f":"IF(Start!D19=\"\",\"\",Start!D19)","v":""},null,null,null,"",null,null,null,"","",null,"",null,""]
[null,{"$f":"Start!C20","v":14},{"$f":"IF(Start!D20=\"\",\"\",Start!D20)","v":""},null,null,null,"",null,null,null,"","",null,"",null,""]
[null,{"$f":"Start!C21","v":15},{"$f":"IF(Start!D21=\"\",\"\",Start!D21)","v":""},null,null,null,"",null,null,null,"","",null,"",null,""]
[null,{"$f":"Start!C22","v":16},{"$f":"IF(Start!D22=\"\",\"\",Start!D22)","v":""},null,null,null,"",null,null,null,"","",null,"",null,""]
[null,{"$f":"Start!C23","v":17},{"$f":"IF(Start!D23=\"\",\"\",Start!D23)","v":""},null,null,null,"",null,null,null,"","",null,"",null,""]
[null,{"$f":"Start!C24","v":18},{"$f":"IF(Start!D24=\"\",\"\",Start!D24)","v":""},null,null,null,"",null,null,null,"","",null,"",null,""]
[null,{"$f":"Start!C25","v":19},{"$f":"IF(Start!D25=\"\",\"\",Start!D25)","v":""},null,null,null,"",null,null,null,"","",null,"",null,""]
[null,{"$f":"Start!C26","v":20},{"$f":"IF(Start!D26=\"\",\"\",Start!D26)","v":""},null,null,null,"",null,null,null,"","",null,"",null,""]
[null,{"$f":"Start!C27","v":21},{"$f":"IF(Start!D27=\"\",\"\",Start!D27)","v":""},null,null,null,"",null,null,null,"","",null,"",null,""]
[null,{"$f":"Start!C28","v":22},{"$f":"IF(Start!D28=\"\",\"\",Start!D28)","v":""},null,null,null,"",null,null,null,"","",null,"",null,""]
[null,{"$f":"Start!C29","v":23},{"$f":"IF(Start!D29=\"\",\"\",Start!D29)","v":""},null,null,null,"",null,null,null,"","",null,"",null,""]
[null,{"$f":"Start!C30","v":24},{"$f":"IF(Start!D30=\"\",\"\",Start!D30)","v":""},null,null,null,"",null,null,null,"","",null,"",null,""]
[null,{"$f":"Start!C31","v":25},{"$f":"IF(Start!D31=\"\",\"\",Start!D31)","v":""},null,null,null,"",null,null,null,"","",null,"",null,""]

{"sheet":"PJ - S","index":6,"n_rows":29,"n_cols":10,"rows_kept":29,"cut":false,"hidden":false,"merged":[[0,1,0,9],[2,3,2,9]]}
[null,"Běh na 100m s překážkami - D - Seznam soutěžících"]
[]
[null,2,{"$f":"Start!$D$5","v":"dorostenky"},"Soutěžící"]
[null,"st.č.","Družstvo",1,2,3,4,5,6,7]
[null,{"$f":"Start!$C7","v":1},{"$f":"IF(Start!$D7=\"\",\"\",Start!$D7)","v":"Kamenec"},"Vraspírová Valerie","Cejpová Adéla","Andrlíková Vendula","Cejpová Jana","Bartoníčková Karolína","Andrlíková Anna","Němcová Barbora"]
[null,{"$f":"Start!$C8","v":2},{"$f":"IF(Start!$D8=\"\",\"\",Start!$D8)","v":"Lukavice"},"Štveráková Kristýna","Marečková Pavla","Bočková Sára","Zavoralová Klára","Marečková Veronika","Hospodková Tereza","Nováková Markéta"]
[null,{"$f":"Start!$C9","v":3},{"$f":"IF(Start!$D9=\"\",\"\",Start!$D9)","v":"Lubná"},"Zachová Lenka","Lorencová Veronika","Zachová Aneta","Silová Michaela","Faltysová Marketa","Brázdová Ilona","Kusá Kateřina"]
[null,{"$f":"Start!$C10","v":4},{"$f":"IF(Start!$D10=\"\",\"\",Start!$D10)","v":"Skuteč"},"Bubeníčková Denisa","Jonášová Andrea","Novotná Leona","Slezáková Nela","Šulcová Soňa","Zavoralová Aneta","Zavoralová Karolína"]
[null,{"$f":"Start!$C11","v":5},{"$f":"IF(Start!$D11=\"\",\"\",Start!$D11)","v":"Bystřec"},"Kumulová Eliška","Vaníčková Tereza","Černohorská Nikola ","Hrdinová Adéla","Hrdinová Lucie","Pfeiferová Valerie","Dolečková Kristýna"]
[null,{"$f":"Start!$C12","v":6},{"$f":"IF(Start!$D12=\"\",\"\",Start!$D12)","v":"Letohrad Kunčice"},"Sýkorová Kateřina","Majvaldová Tereza","Majvaldová Adela","Krejsová Nikola","Sýkorová Veronika","Strasmeierová Eliška","Dudková Martina"]
[null,{"$f":"Start!$C13","v":7},{"$f":"IF(Start!$D13=\"\",\"\",Start!$D13)","v":""}]
[null,{"$f":"Start!$C14","v":8},{"$f":"IF(Start!$D14=\"\",\"\",Start!$D14)","v":""}]
[null,{"$f":"Start!$C15","v":9},{"$f":"IF(Start!$D15=\"\",\"\",Start!$D15)","v":""}]
[null,{"$f":"Start!$C16","v":10},{"$f":"IF(Start!$D16=\"\",\"\",Start!$D16)","v":""}]
[null,{"$f":"Start!$C17","v":11},{"$f":"IF(Start!$D17=\"\",\"\",Start!$D17)","v":""}]
[null,{"$f":"Start!$C18","v":12},{"$f":"IF(Start!$D18=\"\",\"\",Start!$D18)","v":""}]
[null,{"$f":"Start!$C19","v":13},{"$f":"IF(Start!$D19=\"\",\"\",Start!$D19)","v":""}]
[null,{"$f":"Start!$C20","v":14},{"$f":"IF(Start!$D20=\"\",\"\",Start!$D20)","v":""}]
[null,{"$f":"Start!$C21","v":15},{"$f":"IF(Start!$D21=\"\",\"\",Start!$D21)","v":""}]
[null,{"$f":"Start!$C22","v":16},{"$f":"IF(Start!$D22=\"\",\"\",Start!$D22)","v":""}]
[null,{"$f":"Start!$C23","v":17},{"$f":"IF(Start!$D23=\"\",\"\",Start!$D23)","v":""}]
[null,{"$f":"Start!$C24","v":18},{"$f":"IF(Start!$D24=\"\",\"\",Start!$D24)","v":""}]
[null,{"$f":"Start!$C25","v":19},{"$f":"IF(Start!$D25=\"\",\"\",Start!$D25)","v":""}]
[null,{"$f":"Start!$C26","v":20},{"$f":"IF(Start!$D26=\"\",\"\",Start!$D26)","v":""}]
[null,{"$f":"Start!$C27","v":21},{"$f":"IF(Start!$D27=\"\",\"\",Start!$D27)","v":""}]
[null,{"$f":"Start!$C28","v":22},{"$f":"IF(Start!$D28=\"\",\"\",Start!$D28)","v":""}]
[null,{"$f":"Start!$C29","v":23},{"$f":"IF(Start!$D29=\"\",\"\",Start!$D29)","v":""}]
[null,{"$f":"Start!$C30","v":24},{"$f":"IF(Start!$D30=\"\",\"\",Start!$D30)","v":""}]
[null,{"$f":"Start!$C31","v":25},{"$f":"IF(Start!$D31=\"\",\"\",Start!$D31)","v":""}]

{"sheet":"PJ - T","index":7,"n_rows":179,"n_cols":15,"rows_kept":179,"cut":false,"hidden":false,"merged":[[0,1,0,14],[2,4,2,7],[2,10,2,13]]}
[null,"Běh na 100m s překážkami - Startovní listina"]
[]
[null,null,{"$f":"Start!$D$5","v":"dorostenky"},null,"I. pokus",null,null,null,null,null,"II. pokus"]
[null,"st.č.","Jméno","Kolektiv",1,2,3,"Čas","dr.",null,1,2,3,"Čas","dr."]
[null,1,"Vraspírová Valerie","Kamenec",null,null,null,null,1,null,null,null,null,null,2]
[null,2,"Štveráková Kristýna","Lukavice",null,null,null,null,2,null,null,null,null,null,1]
[null,3,"Zachová Lenka","Lubná",null,null,null,null,1,null,null,null,null,null,2]
[null,4,"Bubeníčková Denisa","Skuteč",null,null,null,null,2,null,null,null,null,null,1]
[null,5,"Kumulová Eliška","Bystřec",null,null,null,null,1,null,null,null,null,null,2]
[null,6,"Sýkorová Kateřina","Letohrad Kunčice",null,null,null,null,2,null,null,null,null,null,1]
[null,7,"Cejpová Adéla","Kamenec",null,null,null,null,1,null,null,null,null,null,2]
[null,8,"Marečková Pavla","Lukavice",null,null,null,null,2,null,null,null,null,null,1]
[null,9,"Lorencová Veronika","Lubná",null,null,null,null,1,null,null,null,null,null,2]
[null,10,"Jonášová Andrea","Skuteč",null,null,null,null,2,null,null,null,null,null,1]
[null,11,"Vaníčková Tereza","Bystřec",null,null,null,null,1,null,null,null,null,null,2]
[null,12,"Majvaldová Tereza","Letohrad Kunčice",null,null,null,null,2,null,null,null,null,null,1]
[null,13,"Andrlíková Vendula","Kamenec",null,null,null,null,1,null,null,null,null,null,2]
[null,14,"Bočková Sára","Lukavice",null,null,null,null,2,null,null,null,null,null,1]
[null,15,"Zachová Aneta","Lubná",null,null,null,null,1,null,null,null,null,null,2]
[null,16,"Novotná Leona","Skuteč",null,null,null,null,2,null,null,null,null,null,1]
[null,17,"Černohorská Nikola ","Bystřec",null,null,null,null,1,null,null,null,null,null,2]
[null,18,"Majvaldová Adela","Letohrad Kunčice",null,null,null,null,2,null,null,null,null,null,1]
[null,19,"Cejpová Jana","Kamenec",null,null,null,null,1,null,null,null,null,null,2]
[null,20,"Zavoralová Klára","Lukavice",null,null,null,null,2,null,null,null,null,null,1]
[null,21,"Silová Michaela","Lubná",null,null,null,null,1,null,null,null,null,null,2]
[null,22,"Slezáková Nela","Skuteč",null,null,null,null,2,null,null,null,null,null,1]
[null,23,"Hrdinová Adéla","Bystřec",null,null,null,null,1,null,null,null,null,null,2]
[null,24,"Krejsová Nikola","Letohrad Kunčice",null,null,null,null,2,null,null,null,null,null,1]
[null,25,"Bartoníčková Karolína","Kamenec",null,null,null,null,1,null,null,null,null,null,2]
[null,26,"Marečková Veronika","Lukavice",null,null,null,null,2,null,null,null,null,null,1]
[null,27,"Faltysová Marketa","Lubná",null,null,null,null,1,null,null,null,null,null,2]
[null,28,"Šulcová Soňa","Skuteč",null,null,null,null,2,null,null,null,null,null,1]
[null,29,"Hrdinová Lucie","Bystřec",null,null,null,null,1,null,null,null,null,null,2]
[null,30,"Sýkorová Veronika","Letohrad Kunčice",null,null,null,null,2,null,null,null,null,null,1]
[null,31,"Andrlíková Anna","Kamenec",null,null,null,null,1,null,null,null,null,null,2]
[null,32,"Hospodková Tereza","Lukavice",null,null,null,null,2,null,null,null,null,null,1]
[null,33,"Brázdová Ilona","Lubná",null,null,null,null,1,null,null,null,null,null,2]
[null,34,"Zavoralová Aneta","Skuteč",null,null,null,null,2,null,null,null,null,null,1]
[null,35,"Pfeiferová Valerie","Bystřec",null,null,null,null,1,null,null,null,null,null,2]
[null,36,"Strasmeierová Eliška","Letohrad Kunčice",null,null,null,null,2,null,null,null,null,null,1]
[null,37,"Němcová Barbora","Kamenec",null,null,null,null,1,null,null,null,null,null,2]
[null,38,"Nováková Markéta","Lukavice",null,null,null,null,2,null,null,null,null,null,1]
[null,39,"Kusá Kateřina","Lubná",null,null,null,null,1,null,null,null,null,null,2]
[null,40,"Zavoralová Karolína","Skuteč",null,null,null,null,2,null,null,null,null,null,1]
[null,41,"Dolečková Kristýna","Bystřec",null,null,null,null,1,null,null,null,null,null,2]
[null,42,"Dudková Martina","Letohrad Kunčice",null,null,null,null,2,null,null,null,null,null,1]
[null,null,null,null,null,null,null,null,1,null,null,null,null,null,2]
[null,null,null,null,null,null,null,null,2,null,null,null,null,null,1]
[null,null,null,null,null,null,null,null,1,null,null,null,null,null,2]
[null,null,null,null,null,null,null,null,2,null,null,null,null,null,1]
[null,null,null,null,null,null,null,null,1,null,null,null,null,null,2]
[null,null,null,null,null,null,null,null,2,null,null,null,null,null,1]
[null,null,null,null,null,null,null,null,1,null,null,null,null,null,2]
[null,null,null,null,null,null,null,null,2,null,null,null,null,null,1]
[null,null,null,null,null,null,null,null,1,null,null,null,null,null,2]
[null,null,null,null,null,null,null,null,2,null,null,null,null,null,1]
[null,null,null,null,null,null,null,null,1,null,null,null,null,null,2]
[null,null,null,null,null,null,null,null,2,null,null,null,null,null,1]
[null,null,null,null,null,null,null,null,1,null,null,null,null,null,2]
[null,null,null,null,null,null,null,null,2,null,null,null,null,null,1]
[null,null,null,null,null,null,null,null,1,null,null,null,null,null,2]
[null,null,null,null,null,null,null,null,2,null,null,null,null,null,1]
[null,null,null,null,null,null,null,null,1,null,null,null,null,null,2]
[null,null,null,null,null,null,null,null,2,null,null,null,null,null,1]
[null,null,null,null,null,null,null,null,1,null,null,null,null,null,2]
[null,null,null,null,null,null,null,null,2,null,null,null,null,null,1]
[null,null,null,null,null,null,null,null,1,null,null,null,null,null,2]
[null,null,null,null,null,null,null,null,2,null,null,null,null,null,1]
[null,null,null,null,null,null,null,null,1,null,null,null,null,null,2]
[null,null,null,null,null,null,null,null,2,null,null,null,null,null,1]
[null,null,null,null,null,null,null,null,1,null,null,null,null,null,2]
[null,null,null,null,null,null,null,null,2,null,null,null,null,null,1]
[null,null,null,null,null,null,null,null,1,null,null,null,null,null,2]
[null,null,null,null,null,null,null,null,2,null,null,null,null,null,1]
[null,null,null,null,null,null,null,null,1,null,null,null,null,null,2]
[null,null,null,null,null,null,null,null,2,null,null,null,null,null,1]
[null,null,null,null,null,null,null,null,1,null,null,null,null,null,2]
[null,null,null,null,null,null,null,null,2,null,null,null,null,null,1]
[null,null,null,null,null,null,null,null,1,null,null,null,null,null,2]
[null,null,null,null,null,null,null,null,2,null,null,null,null,null,1]
[null,null,null,null,null,null,null,null,1,null,null,null,null,null,2]
[null,null,null,null,null,null,null,null,2,null,null,null,null,null,1]
[null,null,null,null,null,null,null,null,1,null,null,null,null,null,2]
[null,null,null,null,null,null,null,null,2,null,null,null,null,null,1]
[null,null,null,null,null,null,null,null,1,null,null,null,null,null,2]
[null,null,null,null,null,null,null,null,2,null,null,null,null,null,1]
[null,null,null,null,null,null,null,null,1,null,null,null,null,null,2]
[null,null,null,null,null,null,null,null,2,null,null,null,null,null,1]
[null,null,null,null,null,null,null,null,1,null,null,null,null,null,2]
[null,null,null,null,null,null,null,null,2,null,null,null,null,null,1]
[null,null,null,null,null,null,null,null,1,null,null,null,null,null,2]
[null,null,null,null,null,null,null,null,2,null,null,null,null,null,1]
[null,null,null,null,null,null,null,null,1,null,null,null,null,null,2]
[null,null,null,null,null,null,null,null,2,null,null,null,null,null,1]
[null,null,null,null,null,null,null,null,1,null,null,null,null,null,2]
[null,null,null,null,null,null,null,null,2,null,null,null,null,null,1]
[null,null,null,null,null,null,null,null,1,null,null,null,null,null,2]
[null,null,null,null,null,null,null,null,2,null,null,null,null,null,1]
[null,null,null,null,null,null,null,null,1,null,null,null,null,null,2]
[null,null,null,null,null,null,null,null,2,null,null,null,null,null,1]
[null,null,null,null,null,null,null,null,1,null,null,null,null,null,2]
[null,null,null,null,null,null,null,null,2,null,null,null,null,null,1]
[null,null,null,null,null,null,null,null,1,null,null,null,null,null,2]
[null,null,null,null,null,null,null,null,2,null,null,null,null,null,1]
[null,null,null,null,null,null,null,null,1,null,null,null,null,null,2]
[null,null,null,null,null,null,null,null,2,null,null,null,null,null,1]
[null,null,null,null,null,null,null,null,1,null,null,null,null,null,2]
[null,null,null,null,null,null,null,null,2,null,null,null,null,null,1]
[null,null,null,null,null,null,null,null,1,null,null,null,null,null,2]
[null,null,null,null,null,null,null,null,2,null,null,null,null,null,1]
[null,null,null,null,null,null,null,null,1,null,null,null,null,null,2]
[null,null,null,null,null,null,null,null,2,null,null,null,null,null,1]
[null,null,null,null,null,null,null,null,1,null,null,null,null,null,2]
[null,null,null,null,null,null,null,null,2,null,null,null,null,null,1]
[null,null,null,null,null,null,null,null,1,null,null,null,null,null,2]
[null,null,null,null,null,null,null,null,2,null,null,null,null,null,1]
[null,null,null,null,null,null,null,null,1,null,null,null,null,null,2]
[null,null,null,null,null,null,null,null,2,null,null,null,null,null,1]
[null,null,null,null,null,null,null,null,1,null,null,null,null,null,2]
[null,null,null,null,null,null,null,null,2,null,null,null,null,null,1]
[null,null,null,null,null,null,null,null,1,null,null,null,null,null,2]
[null,null,null,null,null,null,null,null,2,null,null,null,null,null,1]
[null,null,null,null,null,null,null,null,1,null,null,null,null,null,2]
[null,null,null,null,null,null,null,null,2,null,null,null,null,null,1]
[null,null,null,null,null,null,null,null,1,null,null,null,null,null,2]
[null,null,null,null,null,null,null,null,2,null,null,null,null,null,1]
[null,null,null,null,null,null,null,null,1,null,null,null,null,null,2]
[null,null,null,null,null,null,null,null,2,null,null,null,null,null,1]
[null,null,null,null,null,null,null,null,1,null,null,null,null,null,2]
[null,null,null,null,null,null,null,null,2,null,null,null,null,null,1]
[null,null,null,null,null,null,null,null,1,null,null,null,null,null,2]
[null,null,null,null,null,null,null,null,2,null,null,null,null,null,1]
[null,null,null,null,null,null,null,null,1,null,null,null,null,null,2]
[null,null,null,null,null,null,null,null,2,null,null,null,null,null,1]
[null,null,null,null,null,null,null,null,1,null,null,null,null,null,2]
[null,null,null,null,null,null,null,null,2,null,null,null,null,null,1]
[null,null,null,null,null,null,null,null,1,null,null,null,null,null,2]
[null,null,null,null,null,null,null,null,2,null,null,null,null,null,1]
[null,null,null,null,null,null,null,null,1,null,null,null,null,null,2]
[null,null,null,null,null,null,null,null,2,null,null,null,null,null,1]
[null,null,null,null,null,null,null,null,1,null,null,null,null,null,2]
[null,null,null,null,null,null,null,null,2,null,null,null,null,null,1]
[null,null,null,null,null,null,null,null,1,null,null,null,null,null,2]
[null,null,null,null,null,null,null,null,2,null,null,null,null,null,1]
[null,null,null,null,null,null,null,null,1,null,null,null,null,null,2]
[null,null,null,null,null,null,null,null,2,null,null,null,null,null,1]
[null,null,null,null,null,null,null,null,1,null,null,null,null,null,2]
[null,null,null,null,null,null,null,null,2,null,null,null,null,null,1]
[null,null,null,null,null,null,null,null,1,null,null,null,null,null,2]
[null,null,null,null,null,null,null,null,2,null,null,null,null,null,1]
[null,null,null,null,null,null,null,null,1,null,null,null,null,null,2]
[null,null,null,null,null,null,null,null,2,null,null,null,null,null,1]
[null,null,null,null,null,null,null,null,1,null,null,null,null,null,2]
[null,null,null,null,null,null,null,null,2,null,null,null,null,null,1]
[null,null,null,null,null,null,null,null,1,null,null,null,null,null,2]
[null,null,null,null,null,null,null,null,2,null,null,null,null,null,1]
[null,null,null,null,null,null,null,null,1,null,null,null,null,null,2]
[null,null,null,null,null,null,null,null,2,null,null,null,null,null,1]
[null,null,null,null,null,null,null,null,1,null,null,null,null,null,2]
[null,null,null,null,null,null,null,null,2,null,null,null,null,null,1]
[null,null,null,null,null,null,null,null,1,null,null,null,null,null,2]
[null,null,null,null,null,null,null,null,2,null,null,null,null,null,1]
[null,null,null,null,null,null,null,null,1,null,null,null,null,null,2]
[null,null,null,null,null,null,null,null,2,null,null,null,null,null,1]
[null,null,null,null,null,null,null,null,1,null,null,null,null,null,2]
[null,null,null,null,null,null,null,null,2,null,null,null,null,null,1]
[null,null,null,null,null,null,null,null,1,null,null,null,null,null,2]
[null,null,null,null,null,null,null,null,2,null,null,null,null,null,1]
[null,null,null,null,null,null,null,null,1,null,null,null,null,null,2]
[null,null,null,null,null,null,null,null,2,null,null,null,null,null,1]
[null,null,null,null,null,null,null,null,1,null,null,null,null,null,2]
[null,null,null,null,null,null,null,null,2,null,null,null,null,null,1]
[null,null,null,null,null,null,null,null,1,null,null,null,null,null,2]
[null,null,null,null,null,null,null,null,2,null,null,null,null,null,1]
[null,null,null,null,null,null,null,null,1,null,null,null,null,null,2]
[null,null,null,null,null,null,null,null,2,null,null,null,null,null,1]
[null,null,null,null,null,null,null,null,1,null,null,null,null,null,2]
[null,null,null,null,null,null,null,null,2,null,null,null,null,null,1]
[null,null,null,null,null,null,null,null,1,null,null,null,null,null,2]

{"sheet":"PJ-T","index":8,"n_rows":205,"n_cols":15,"rows_kept":205,"cut":false,"hidden":false,"merged":[[126,1,126,14],[128,2,128,5],[128,6,128,13],[130,4,130,7],[130,10,130,13],[84,1,84,14],[86,2,86,5],[88,4,88,7],[88,10,88,13],[44,2,44,5],[44,6,44,13],[46,4,46,7],[46,10,46,13],[86,6,86,13],[0,1,0,14],[4,4,4,7],[4,10,4,13],[42,1,42,14],[2,2,2,5],[2,6,2,13],[168,1,168,14],[170,2,170,5],[170,6,170,13],[172,4,172,7],[172,10,172,13]]}
[null,"Běh na 100m s překážkami - D - Startovní listina"]
[]
[null,null,{"$f":"Start!$B$2","v":"Krajské kolo dorostu"},null,null,null,{"$f":"Start!$B$3","v":"18.06.2022 Pardubice"}]
[]
[null,null,{"$f":"Start!$D$5","v":"dorostenky"},null,"I. pokus",null,null,null,null,null,"II. pokus"]
[null,"st.č.","Jméno","Kolektiv",1,2,3,"Čas","dr.",null,1,2,3,"Čas","dr."]
[null,1,"Vraspírová Valerie","Kamenec",null,null,null,null,1,null,null,null,null,null,2]
[null,2,"Štveráková Kristýna","Lukavice",null,null,null,null,2,null,null,null,null,null,1]
[null,3,"Zachová Lenka","Lubná",null,null,null,null,1,null,null,null,null,null,2]
[null,4,"Bubeníčková Denisa","Skuteč",null,null,null,null,2,null,null,null,null,null,1]
[null,5,"Kumulová Eliška","Bystřec",null,null,null,null,1,null,null,null,null,null,2]
[null,6,"Sýkorová Kateřina","Letohrad Kunčice",null,null,null,null,2,null,null,null,null,null,1]
[null,7,"Cejpová Adéla","Kamenec",null,null,null,null,1,null,null,null,null,null,2]
[null,8,"Marečková Pavla","Lukavice",null,null,null,null,2,null,null,null,null,null,1]
[null,9,"Lorencová Veronika","Lubná",null,null,null,null,1,null,null,null,null,null,2]
[null,10,"Jonášová Andrea","Skuteč",null,null,null,null,2,null,null,null,null,null,1]
[null,11,"Vaníčková Tereza","Bystřec",null,null,null,null,1,null,null,null,null,null,2]
[null,12,"Majvaldová Tereza","Letohrad Kunčice",null,null,null,null,2,null,null,null,null,null,1]
[null,13,"Andrlíková Vendula","Kamenec",null,null,null,null,1,null,null,null,null,null,2]
[null,14,"Bočková Sára","Lukavice",null,null,null,null,2,null,null,null,null,null,1]
[null,15,"Zachová Aneta","Lubná",null,null,null,null,1,null,null,null,null,null,2]
[null,16,"Novotná Leona","Skuteč",null,null,null,null,2,null,null,null,null,null,1]
[null,17,"Černohorská Nikola ","Bystřec",null,null,null,null,1,null,null,null,null,null,2]
[null,18,"Majvaldová Adela","Letohrad Kunčice",null,null,null,null,2,null,null,null,null,null,1]
[null,19,"Cejpová Jana","Kamenec",null,null,null,null,1,null,null,null,null,null,2]
[null,20,"Zavoralová Klára","Lukavice",null,null,null,null,2,null,null,null,null,null,1]
[null,21,"Silová Michaela","Lubná",null,null,null,null,1,null,null,null,null,null,2]
[null,22,"Slezáková Nela","Skuteč",null,null,null,null,2,null,null,null,null,null,1]
[null,23,"Hrdinová Adéla","Bystřec",null,null,null,null,1,null,null,null,null,null,2]
[null,24,"Krejsová Nikola","Letohrad Kunčice",null,null,null,null,2,null,null,null,null,null,1]
[null,25,"Bartoníčková Karolína","Kamenec",null,null,null,null,1,null,null,null,null,null,2]
[null,26,"Marečková Veronika","Lukavice",null,null,null,null,2,null,null,null,null,null,1]
[null,27,"Faltysová Marketa","Lubná",null,null,null,null,1,null,null,null,null,null,2]
[null,28,"Šulcová Soňa","Skuteč",null,null,null,null,2,null,null,null,null,null,1]
[null,29,"Hrdinová Lucie","Bystřec",null,null,null,null,1,null,null,null,null,null,2]
[null,30,"Sýkorová Veronika","Letohrad Kunčice",null,null,null,null,2,null,null,null,null,null,1]
[null,31,"Andrlíková Anna","Kamenec",null,null,null,null,1,null,null,null,null,null,2]
[null,32,"Hospodková Tereza","Lukavice",null,null,null,null,2,null,null,null,null,null,1]
[null,33,"Brázdová Ilona","Lubná",null,null,null,null,1,null,null,null,null,null,2]
[null,34,"Zavoralová Aneta","Skuteč",null,null,null,null,2,null,null,null,null,null,1]
[null,35,"Pfeiferová Valerie","Bystřec",null,null,null,null,1,null,null,null,null,null,2]
[null,36,"Strasmeierová Eliška","Letohrad Kunčice",null,null,null,null,2,null,null,null,null,null,1]
[null,{"$f":"$B$1","v":"Běh na 100m s překážkami - D - Startovní listina"}]
[]
[null,null,{"$f":"$C$3","v":"Krajské kolo dorostu"},null,null,null,{"$f":"$G$3","v":"18.06.2022 Pardubice"}]
[]
[null,null,{"$f":"Start!$D$5","v":"dorostenky"},null,"I. pokus",null,null,null,null,null,"II. pokus"]
[null,"st.č.","Jméno","Kolektiv",1,2,3,"Čas","dr.",null,1,2,3,"Čas","dr."]
[null,37,"Němcová Barbora","Kamenec",null,null,null,null,1,null,null,null,null,null,2]
[null,38,"Nováková Markéta","Lukavice",null,null,null,null,2,null,null,null,null,null,1]
[null,39,"Kusá Kateřina","Lubná",null,null,null,null,1,null,null,null,null,null,2]
[null,40,"Zavoralová Karolína","Skuteč",null,null,null,null,2,null,null,null,null,null,1]
[null,41,"Dolečková Kristýna","Bystřec",null,null,null,null,1,null,null,null,null,null,2]
[null,42,"Dudková Martina","Letohrad Kunčice",null,null,null,null,2,null,null,null,null,null,1]
[null,null,null,null,null,null,null,null,1,null,null,null,null,null,2]
[null,null,null,null,null,null,null,null,2,null,null,null,null,null,1]
[null,null,null,null,null,null,null,null,1,null,null,null,null,null,2]
[null,null,null,null,null,null,null,null,2,null,null,null,null,null,1]
[null,null,null,null,null,null,null,null,1,null,null,null,null,null,2]
[null,null,null,null,null,null,null,null,2,null,null,null,null,null,1]
[null,null,null,null,null,null,null,null,1,null,null,null,null,null,2]
[null,null,null,null,null,null,null,null,2,null,null,null,null,null,1]
[null,null,null,null,null,null,null,null,1,null,null,null,null,null,2]
[null,null,null,null,null,null,null,null,2,null,null,null,null,null,1]
[null,null,null,null,null,null,null,null,1,null,null,null,null,null,2]
[null,null,null,null,null,null,null,null,2,null,null,null,null,null,1]
[null,null,null,null,null,null,null,null,1,null,null,null,null,null,2]
[null,null,null,null,null,null,null,null,2,null,null,null,null,null,1]
[null,null,null,null,null,null,null,null,1,null,null,null,null,null,2]
[null,null,null,null,null,null,null,null,2,null,null,null,null,null,1]
[null,null,null,null,null,null,null,null,1,null,null,null,null,null,2]
[null,null,null,null,null,null,null,null,2,null,null,null,null,null,1]
[null,null,null,null,null,null,null,null,1,null,null,null,null,null,2]
[null,null,null,null,null,null,null,null,2,null,null,null,null,null,1]
[null,null,null,null,null,null,null,null,1,null,null,null,null,null,2]
[null,null,null,null,null,null,null,null,2,null,null,null,null,null,1]
[null,null,null,null,null,null,null,null,1,null,null,null,null,null,2]
[null,null,null,null,null,null,null,null,2,null,null,null,null,null,1]
[null,null,null,null,null,null,null,null,1,null,null,null,null,null,2]
[null,null,null,null,null,null,null,null,2,null,null,null,null,null,1]
[null,null,null,null,null,null,null,null,1,null,null,null,null,null,2]
[null,null,null,null,null,null,null,null,2,null,null,null,null,null,1]
[null,null,null,null,null,null,null,null,1,null,null,null,null,null,2]
[null,null,null,null,null,null,null,null,2,null,null,null,null,null,1]
[null,{"$f":"$B$1","v":"Běh na 100m s překážkami - D - Startovní listina"}]
[]
[null,null,{"$f":"$C$3","v":"Krajské kolo dorostu"},null,null,null,{"$f":"$G$3","v":"18.06.2022 Pardubice"}]
[]
[null,null,{"$f":"Start!$D$5","v":"dorostenky"},null,"I. pokus",null,null,null,null,null,"II. pokus"]
[null,"st.č.","Jméno","Kolektiv",1,2,3,"Čas","dr.",null,1,2,3,"Čas","dr."]
[null,null,null,null,null,null,null,null,1,null,null,null,null,null,2]
[null,null,null,null,null,null,null,null,2,null,null,null,null,null,1]
[null,null,null,null,null,null,null,null,1,null,null,null,null,null,2]
[null,null,null,null,null,null,null,null,2,null,null,null,null,null,1]
[null,null,null,null,null,null,null,null,1,null,null,null,null,null,2]
[null,null,null,null,null,null,null,null,2,null,null,null,null,null,1]
[null,null,null,null,null,null,null,null,1,null,null,null,null,null,2]
[null,null,null,null,null,null,null,null,2,null,null,null,null,null,1]
[null,null,null,null,null,null,null,null,1,null,null,null,null,null,2]
[null,null,null,null,null,null,null,null,2,null,null,null,null,null,1]
[null,null,null,null,null,null,null,null,1,null,null,null,null,null,2]
[null,null,null,null,null,null,null,null,2,null,null,null,null,null,1]
[null,null,null,null,null,null,null,null,1,null,null,null,null,null,2]
[null,null,null,null,null,null,null,null,2,null,null,null,null,null,1]
[null,null,null,null,null,null,null,null,1,null,null,null,null,null,2]
[null,null,null,null,null,null,null,null,2,null,null,null,null,null,1]
[null,null,null,null,null,null,null,null,1,null,null,null,null,null,2]
[null,null,null,null,null,null,null,null,2,null,null,null,null,null,1]
[null,null,null,null,null,null,null,null,1,null,null,null,null,null,2]
[null,null,null,null,null,null,null,null,2,null,null,null,null,null,1]
[null,null,null,null,null,null,null,null,1,null,null,null,null,null,2]
[null,null,null,null,null,null,null,null,2,null,null,null,null,null,1]
[null,null,null,null,null,null,null,null,1,null,null,null,null,null,2]
[null,null,null,null,null,null,null,null,2,null,null,null,null,null,1]
[null,null,null,null,null,null,null,null,1,null,null,null,null,null,2]
[null,null,null,null,null,null,null,null,2,null,null,null,null,null,1]
[null,null,null,null,null,null,null,null,1,null,null,null,null,null,2]
[null,null,null,null,null,null,null,null,2,null,null,null,null,null,1]
[null,null,null,null,null,null,null,null,1,null,null,null,null,null,2]
[null,null,null,null,null,null,null,null,2,null,null,null,null,null,1]
[null,null,null,null,null,null,null,null,1,null,null,null,null,null,2]
[null,null,null,null,null,null,null,null,2,null,null,null,null,null,1]
[null,null,null,null,null,null,null,null,1,null,null,null,null,null,2]
[null,null,null,null,null,null,null,null,2,null,null,null,null,null,1]
[null,null,null,null,null,null,null,null,1,null,null,null,null,null,2]
[null,null,null,null,null,null,null,null,2,null,null,null,null,null,1]
[null,{"$f":"$B$1","v":"Běh na 100m s překážkami - D - Startovní listina"}]
[]
[null,null,{"$f":"$C$3","v":"Krajské kolo dorostu"},null,null,null,{"$f":"$G$3","v":"18.06.2022 Pardubice"}]
[]
[null,null,{"$f":"Start!$D$5","v":"dorostenky"},null,"I. pokus",null,null,null,null,null,"II. pokus"]
[null,"st.č.","Jméno","Kolektiv",1,2,3,"Čas","dr.",null,1,2,3,"Čas","dr."]
[null,null,null,null,null,null,null,null,1,null,null,null,null,null,2]
[null,null,null,null,null,null,null,null,2,null,null,null,null,null,1]
[null,null,null,null,null,null,null,null,1,null,null,null,null,null,2]
[null,null,null,null,null,null,null,null,2,null,null,null,null,null,1]
[null,null,null,null,null,null,null,null,1,null,null,null,null,null,2]
[null,null,null,null,null,null,null,null,2,null,null,null,null,null,1]
[null,null,null,null,null,null,null,null,1,null,null,null,null,null,2]
[null,null,null,null,null,null,null,null,2,null,null,null,null,null,1]
[null,null,null,null,null,null,null,null,1,null,null,null,null,null,2]
[null,null,null,null,null,null,null,null,2,null,null,null,null,null,1]
[null,null,null,null,null,null,null,null,1,null,null,null,null,null,2]
[null,null,null,null,null,null,null,null,2,null,null,null,null,null,1]
[null,null,null,null,null,null,null,null,1,null,null,null,null,null,2]
[null,null,null,null,null,null,null,null,2,null,null,null,null,null,1]
[null,null,null,null,null,null,null,null,1,null,null,null,null,null,2]
[null,null,null,null,null,null,null,null,2,null,null,null,null,null,1]
[null,null,null,null,null,null,null,null,1,null,null,null,null,null,2]
[null,null,null,null,null,null,null,null,2,null,null,null,null,null,1]
[null,null,null,null,null,null,null,null,1,null,null,null,null,null,2]
[null,null,null,null,null,null,null,null,2,null,null,null,null,null,1]
[null,null,null,null,null,null,null,null,1,null,null,null,null,null,2]
[null,null,null,null,null,null,null,null,2,null,null,null,null,null,1]
[null,null,null,null,null,null,null,null,1,null,null,null,null,null,2]
[null,null,null,null,null,null,null,null,2,null,null,null,null,null,1]
[null,null,null,null,null,null,null,null,1,null,null,null,null,null,2]
[null,null,null,null,null,null,null,null,2,null,null,null,null,null,1]
[null,null,null,null,null,null,null,null,1,null,null,null,null,null,2]
[null,null,null,null,null,null,null,null,2,null,null,null,null,null,1]
[null,null,null,null,null,null,null,null,1,null,null,null,null,null,2]
[null,null,null,null,null,null,null,null,2,null,null,null,null,null,1]
[null,null,null,null,null,null,null,null,1,null,null,null,null,null,2]
[null,null,null,null,null,null,null,null,2,null,null,null,null,null,1]
[null,null,null,null,null,null,null,null,1,null,null,null,null,null,2]
[null,null,null,null,null,null,null,null,2,null,null,null,null,null,1]
[null,null,null,null,null,null,null,null,1,null,null,null,null,null,2]
[null,null,null,null,null,null,null,null,2,null,null,null,null,null,1]
[null,{"$f":"$B$1","v":"Běh na 100m s překážkami - D - Startovní listina"}]
[]
[null,null,{"$f":"$C$3","v":"Krajské kolo dorostu"},null,null,null,{"$f":"$G$3","v":"18.06.2022 Pardubice"}]
[]
[null,null,{"$f":"Start!$D$5","v":"dorostenky"},null,"I. pokus",null,null,null,null,null,"II. pokus"]
[null,"st.č.","Jméno","Kolektiv",1,2,3,"Čas","dr.",null,1,2,3,"Čas","dr."]
[null,null,null,null,null,null,null,null,1,null,null,null,null,null,2]
[null,null,null,null,null,null,null,null,2,null,null,null,null,null,1]
[null,null,null,null,null,null,null,null,1,null,null,null,null,null,2]
[null,null,null,null,null,null,null,null,2,null,null,null,null,null,1]
[null,null,null,null,null,null,null,null,1,null,null,null,null,null,2]
[null,null,null,null,null,null,null,null,2,null,null,null,null,null,1]
[null,null,null,null,null,null,null,null,1,null,null,null,null,null,2]
[null,null,null,null,null,null,null,null,2,null,null,null,null,null,1]
[null,null,null,null,null,null,null,null,1,null,null,null,null,null,2]
[null,null,null,null,null,null,null,null,2,null,null,null,null,null,1]
[null,null,null,null,null,null,null,null,1,null,null,null,null,null,2]
[null,null,null,null,null,null,null,null,2,null,null,null,null,null,1]
[null,null,null,null,null,null,null,null,1,null,null,null,null,null,2]
[null,null,null,null,null,null,null,null,2,null,null,null,null,null,1]
[null,null,null,null,null,null,null,null,1,null,null,null,null,null,2]
[null,null,null,null,null,null,null,null,2,null,null,null,null,null,1]
[null,null,null,null,null,null,null,null,1,null,null,null,null,null,2]
[null,null,null,null,null,null,null,null,2,null,null,null,null,null,1]
[null,null,null,null,null,null,null,null,1,null,null,null,null,null,2]
[null,null,null,null,null,null,null,null,2,null,null,null,null,null,1]
[null,null,null,null,null,null,null,null,1,null,null,null,null,null,2]
[null,null,null,null,null,null,null,null,2,null,null,null,null,null,1]
[null,null,null,null,null,null,null,null,1,null,null,null,null,null,2]
[null,null,null,null,null,null,null,null,2,null,null,null,null,null,1]
[null,null,null,null,null,null,null,null,1,null,null,null,null,null,2]
[null,null,null,null,null,null,null,null,2,null,null,null,null,null,1]
[null,null,null,null,null,null,null,null,1,null,null,null,null,null,2]
[null,null,null,null,null,null,null,null,2,null,null,null,null,null,1]
[null,null,null,null,null,null,null,null,1,null,null,null,null,null,2]
[null,null,null,null,null,null,null,null,2,null,null,null,null,null,1]
[null,null,null,null,null,null,null,null,1,null,null,null,null,null,2]

{"sheet":"PJ-V","index":9,"n_rows":179,"n_cols":21,"rows_kept":179,"cut":false,"hidden":false,"merged":[[2,4,2,7],[2,9,2,12],[0,1,0,14]]}
[null,"Běh na 100m s překážkami - D - Zadání výsledků"]
[]
[null,null,{"$f":"Start!$D$5","v":"dorostenky"},null,"I.",null,null,null,null,"II."]
[null,"St.č.","Jméno","kolektiv",1,2,3,"Čas",null,1,2,3,"Čas",null,"C.",null,"P.",null,"B.",null,"X."]
[null,{"$f":"J!E1","v":1},{"$f":"IF(AND(J!A1=\"\",J!B1<>\"\"),\"NESTARTOVALO\",IF(AND(J!A1=\"\",J!B1=\"\"),\"\",J!A1))","v":"Vraspírová Valerie"},{"$f":"IF(AND(J!A1=\"\",J!B1=\"\"),\"\",J!B1)","v":"Kamenec"},21.33,null,null,{"$f":"IF($C5=\"\",\"\",IF(OR($E5=\"DNF\",$F5=\"DNF\",$G5=\"DNF\",AND($E5=\"\",$F5=\"\",$G5=\"\")),\"DNF\",IF(OR($E5=\"NP\",$F5=\"NP\",$G5=\"NP\"),\"NP\",IF(ISERROR(MEDIAN($E5:$G5)),\"DNF\",IF(OR($E5=\"X\",$F5=\"X\",$G5=\"X\",$E5=\"\",$F5=\"\",$G5=\"\",$E5=\"x\",$F5=\"x\",$G5=\"x\"),MAX($E5:$G5),MEDIAN($E5:$G5))))))","v":21.33},null,20.77,null,null,{"$f":"IF($C5=\"\",\"\",IF(OR($J5=\"DNF\",$K5=\"DNF\",$L5=\"DNF\",AND($J5=\"\",$K5=\"\",$L5=\"\")),\"DNF\",IF(OR($J5=\"NP\",$K5=\"NP\",$L5=\"NP\"),\"NP\",IF(ISERROR(MEDIAN($J5:$L5)),\"DNF\",IF(OR($J5=\"X\",$K5=\"X\",$L5=\"X\",$J5=\"\",$K5=\"\",$L5=\"\",$J5=\"x\",$K5=\"x\",$L5=\"x\"),MAX($J5:$L5),MEDIAN($J5:$L5))))))","v":20.77},null,{"$f":"IF(C5=\"\",\"\",IF(OR(AND(H5=\"NP\",M5=\"NP\"),AND(H5=\"DNF\",M5=\"DNF\")),H5,IF(AND(H5=\"NP\",M5=\"DNF\"),H5,IF(AND(H5=\"DNF\",M5=\"NP\"),M5,MIN(H5,M5)))))","v":20.77},null,{"$f":"IF(C5=\"\",\"\",IF(OR(O5=\"NP\",O5=\"DNF\"),O5,RANK(O5,O$5:O$179,1)))","v":11},null,{"$f":"IF(C5=\"\",\"\",IF(O5=\"NP\",MAX(Q$5:Q$179)+1,IF(O5=\"DNF\",MAX(Q$5:Q$179)+COUNTIF(Q$5:Q$179,\"NP\")+1,RANK(O5,O$5:O$179,1))))","v":11},null,{"$f":"IF($C5=\"\",9000,MAX(H5,M5)+(COUNTIF($H5:$H5,\"NP\")*600)+(COUNTIF($M5:$M5,\"NP\")*600)+(COUNTIF($H5:$H5,\"DNF\")*3600)+(COUNTIF($M5:$M5,\"DNF\")*3600))","v":21.33}]
[null,{"$f":"J!E2","v":2},{"$f":"IF(AND(J!A2=\"\",J!B2<>\"\"),\"NESTARTOVALO\",IF(AND(J!A2=\"\",J!B2=\"\"),\"\",J!A2))","v":"Štveráková Kristýna"},{"$f":"IF(AND(J!A2=\"\",J!B2=\"\"),\"\",J!B2)","v":"Lukavice"},23.16,null,null,{"$f":"IF($C6=\"\",\"\",IF(OR($E6=\"DNF\",$F6=\"DNF\",$G6=\"DNF\",AND($E6=\"\",$F6=\"\",$G6=\"\")),\"DNF\",IF(OR($E6=\"NP\",$F6=\"NP\",$G6=\"NP\"),\"NP\",IF(ISERROR(MEDIAN($E6:$G6)),\"DNF\",IF(OR($E6=\"X\",$F6=\"X\",$G6=\"X\",$E6=\"\",$F6=\"\",$G6=\"\",$E6=\"x\",$F6=\"x\",$G6=\"x\"),MAX($E6:$G6),MEDIAN($E6:$G6))))))","v":23.16},null,24.21,null,null,{"$f":"IF($C6=\"\",\"\",IF(OR($J6=\"DNF\",$K6=\"DNF\",$L6=\"DNF\",AND($J6=\"\",$K6=\"\",$L6=\"\")),\"DNF\",IF(OR($J6=\"NP\",$K6=\"NP\",$L6=\"NP\"),\"NP\",IF(ISERROR(MEDIAN($J6:$L6)),\"DNF\",IF(OR($J6=\"X\",$K6=\"X\",$L6=\"X\",$J6=\"\",$K6=\"\",$L6=\"\",$J6=\"x\",$K6=\"x\",$L6=\"x\"),MAX($J6:$L6),MEDIAN($J6:$L6))))))","v":24.21},null,{"$f":"IF(C6=\"\",\"\",IF(OR(AND(H6=\"NP\",M6=\"NP\"),AND(H6=\"DNF\",M6=\"DNF\")),H6,IF(AND(H6=\"NP\",M6=\"DNF\"),H6,IF(AND(H6=\"DNF\",M6=\"NP\"),M6,MIN(H6,M6)))))","v":23.16},null,{"$f":"IF(C6=\"\",\"\",IF(OR(O6=\"NP\",O6=\"DNF\"),O6,RANK(O6,O$5:O$179,1)))","v":28},null,{"$f":"IF(C6=\"\",\"\",IF(O6=\"NP\",MAX(Q$5:Q$179)+1,IF(O6=\"DNF\",MAX(Q$5:Q$179)+COUNTIF(Q$5:Q$179,\"NP\")+1,RANK(O6,O$5:O$179,1))))","v":28},null,{"$f":"IF($C6=\"\",9000,MAX(H6,M6)+(COUNTIF($H6:$H6,\"NP\")*600)+(COUNTIF($M6:$M6,\"NP\")*600)+(COUNTIF($H6:$H6,\"DNF\")*3600)+(COUNTIF($M6:$M6,\"DNF\")*3600))","v":24.21}]
[null,{"$f":"J!E3","v":3},{"$f":"IF(AND(J!A3=\"\",J!B3<>\"\"),\"NESTARTOVALO\",IF(AND(J!A3=\"\",J!B3=\"\"),\"\",J!A3))","v":"Zachová Lenka"},{"$f":"IF(AND(J!A3=\"\",J!B3=\"\"),\"\",J!B3)","v":"Lubná"},24.87,null,null,24.87,null,22.98,null,null,22.98,null,22.98,null,26,null,26,null,24.87]
[null,{"$f":"J!E4","v":4},{"$f":"IF(AND(J!A4=\"\",J!B4<>\"\"),\"NESTARTOVALO\",IF(AND(J!A4=\"\",J!B4=\"\"),\"\",J!A4))","v":"Bubeníčková Denisa"},{"$f":"IF(AND(J!A4=\"\",J!B4=\"\"),\"\",J!B4)","v":"Skuteč"},19.68,null,null,19.68,null,19.68,null,null,19.68,null,19.68,null,5,null,5,null,19.68]
[null,{"$f":"J!E5","v":5},{"$f":"IF(AND(J!A5=\"\",J!B5<>\"\"),\"NESTARTOVALO\",IF(AND(J!A5=\"\",J!B5=\"\"),\"\",J!A5))","v":"Kumulová Eliška"},{"$f":"IF(AND(J!A5=\"\",J!B5=\"\"),\"\",J!B5)","v":"Bystřec"},30.64,"NP",null,"NP",null,28.66,null,null,28.66,null,28.66,null,40,null,40,null,628.66]
[null,{"$f":"J!E6","v":6},{"$f":"IF(AND(J!A6=\"\",J!B6<>\"\"),\"NESTARTOVALO\",IF(AND(J!A6=\"\",J!B6=\"\"),\"\",J!A6))","v":"Sýkorová Kateřina"},{"$f":"IF(AND(J!A6=\"\",J!B6=\"\"),\"\",J!B6)","v":"Letohrad Kunčice"},22.79,null,null,22.79,null,21.57,null,null,21.57,null,21.57,null,17,null,17,null,22.79]
[null,{"$f":"J!E7","v":7},{"$f":"IF(AND(J!A7=\"\",J!B7<>\"\"),\"NESTARTOVALO\",IF(AND(J!A7=\"\",J!B7=\"\"),\"\",J!A7))","v":"Cejpová Adéla"},{"$f":"IF(AND(J!A7=\"\",J!B7=\"\"),\"\",J!B7)","v":"Kamenec"},25.1,null,null,25.1,null,22.48,null,null,22.48,null,22.48,null,23,null,23,null,25.1]
[null,{"$f":"J!E8","v":8},{"$f":"IF(AND(J!A8=\"\",J!B8<>\"\"),\"NESTARTOVALO\",IF(AND(J!A8=\"\",J!B8=\"\"),\"\",J!A8))","v":"Marečková Pavla"},{"$f":"IF(AND(J!A8=\"\",J!B8=\"\"),\"\",J!B8)","v":"Lukavice"},25.14,null,null,25.14,null,24.92,null,null,24.92,null,24.92,null,38,null,38,null,25.14]
[null,{"$f":"J!E9","v":9},{"$f":"IF(AND(J!A9=\"\",J!B9<>\"\"),\"NESTARTOVALO\",IF(AND(J!A9=\"\",J!B9=\"\"),\"\",J!A9))","v":"Lorencová Veronika"},{"$f":"IF(AND(J!A9=\"\",J!B9=\"\"),\"\",J!B9)","v":"Lubná"},"NP",null,null,"NP",null,24.73,null,null,24.73,null,24.73,null,37,null,37,null,624.73]
[null,{"$f":"J!E10","v":10},{"$f":"IF(AND(J!A10=\"\",J!B10<>\"\"),\"NESTARTOVALO\",IF(AND(J!A10=\"\",J!B10=\"\"),\"\",J!A10))","v":"Jonášová Andrea"},{"$f":"IF(AND(J!A10=\"\",J!B10=\"\"),\"\",J!B10)","v":"Skuteč"},21.81,"NP",null,"NP",null,21.57,null,null,21.57,null,21.57,null,17,null,17,null,621.57000000000005]
[null,{"$f":"J!E11","v":11},{"$f":"IF(AND(J!A11=\"\",J!B11<>\"\"),\"NESTARTOVALO\",IF(AND(J!A11=\"\",J!B11=\"\"),\"\",J!A11))","v":"Vaníčková Tereza"},{"$f":"IF(AND(J!A11=\"\",J!B11=\"\"),\"\",J!B11)","v":"Bystřec"},24.27,null,null,24.27,null,23.93,null,null,23.93,null,23.93,null,33,null,33,null,24.27]
[null,{"$f":"J!E12","v":12},{"$f":"IF(AND(J!A12=\"\",J!B12<>\"\"),\"NESTARTOVALO\",IF(AND(J!A12=\"\",J!B12=\"\"),\"\",J!A12))","v":"Majvaldová Tereza"},{"$f":"IF(AND(J!A12=\"\",J!B12=\"\"),\"\",J!B12)","v":"Letohrad Kunčice"},19.510000000000002,null,null,19.510000000000002,null,19.3,null,null,19.3,null,19.3,null,2,null,2,null,19.510000000000002]
[null,{"$f":"J!E13","v":13},{"$f":"IF(AND(J!A13=\"\",J!B13<>\"\"),\"NESTARTOVALO\",IF(AND(J!A13=\"\",J!B13=\"\"),\"\",J!A13))","v":"Andrlíková Vendula"},{"$f":"IF(AND(J!A13=\"\",J!B13=\"\"),\"\",J!B13)","v":"Kamenec"},21.85,null,null,21.85,null,20.92,null,null,20.92,null,20.92,null,13,null,13,null,21.85]
[null,{"$f":"J!E14","v":14},{"$f":"IF(AND(J!A14=\"\",J!B14<>\"\"),\"NESTARTOVALO\",IF(AND(J!A14=\"\",J!B14=\"\"),\"\",J!A14))","v":"Bočková Sára"},{"$f":"IF(AND(J!A14=\"\",J!B14=\"\"),\"\",J!B14)","v":"Lukavice"},24.39,null,null,24.39,null,34.31,null,null,34.31,null,24.39,null,36,null,36,null,34.31]
[null,{"$f":"J!E15","v":15},{"$f":"IF(AND(J!A15=\"\",J!B15<>\"\"),\"NESTARTOVALO\",IF(AND(J!A15=\"\",J!B15=\"\"),\"\",J!A15))","v":"Zachová Aneta"},{"$f":"IF(AND(J!A15=\"\",J!B15=\"\"),\"\",J!B15)","v":"Lubná"},22.55,null,null,22.55,null,22.38,null,null,22.38,null,22.38,null,22,null,22,null,22.55]
[null,{"$f":"J!E16","v":16},{"$f":"IF(AND(J!A16=\"\",J!B16<>\"\"),\"NESTARTOVALO\",IF(AND(J!A16=\"\",J!B16=\"\"),\"\",J!A16))","v":"Novotná Leona"},{"$f":"IF(AND(J!A16=\"\",J!B16=\"\"),\"\",J!B16)","v":"Skuteč"},19.68,null,null,19.68,null,20.39,null,null,20.39,null,19.68,null,5,null,5,null,20.39]
[null,{"$f":"J!E17","v":17},{"$f":"IF(AND(J!A17=\"\",J!B17<>\"\"),\"NESTARTOVALO\",IF(AND(J!A17=\"\",J!B17=\"\"),\"\",J!A17))","v":"Černohorská Nikola "},{"$f":"IF(AND(J!A17=\"\",J!B17=\"\"),\"\",J!B17)","v":"Bystřec"},22.15,null,null,22.15,null,28.73,null,null,28.73,null,22.15,null,19,null,19,null,28.73]
[null,{"$f":"J!E18","v":18},{"$f":"IF(AND(J!A18=\"\",J!B18<>\"\"),\"NESTARTOVALO\",IF(AND(J!A18=\"\",J!B18=\"\"),\"\",J!A18))","v":"Majvaldová Adela"},{"$f":"IF(AND(J!A18=\"\",J!B18=\"\"),\"\",J!B18)","v":"Letohrad Kunčice"},24.47,null,null,24.47,null,21.13,null,null,21.13,null,21.13,null,14,null,14,null,24.47]
[null,{"$f":"J!E19","v":19},{"$f":"IF(AND(J!A19=\"\",J!B19<>\"\"),\"NESTARTOVALO\",IF(AND(J!A19=\"\",J!B19=\"\"),\"\",J!A19))","v":"Cejpová Jana"},{"$f":"IF(AND(J!A19=\"\",J!B19=\"\"),\"\",J!B19)","v":"Kamenec"},22.31,null,null,22.31,null,25.49,null,null,25.49,null,22.31,null,21,null,21,null,25.49]
[null,{"$f":"J!E20","v":20},{"$f":"IF(AND(J!A20=\"\",J!B20<>\"\"),\"NESTARTOVALO\",IF(AND(J!A20=\"\",J!B20=\"\"),\"\",J!A20))","v":"Zavoralová Klára"},{"$f":"IF(AND(J!A20=\"\",J!B20=\"\"),\"\",J!B20)","v":"Lukavice"},23.23,null,null,23.23,null,22.96,null,null,22.96,null,22.96,null,25,null,25,null,23.23]
[null,{"$f":"J!E21","v":21},{"$f":"IF(AND(J!A21=\"\",J!B21<>\"\"),\"NESTARTOVALO\",IF(AND(J!A21=\"\",J!B21=\"\"),\"\",J!A21))","v":"Silová Michaela"},{"$f":"IF(AND(J!A21=\"\",J!B21=\"\"),\"\",J!B21)","v":"Lubná"},21.28,null,null,21.28,null,20.89,null,null,20.89,null,20.89,null,12,null,12,null,21.28]
[null,{"$f":"J!E22","v":22},{"$f":"IF(AND(J!A22=\"\",J!B22<>\"\"),\"NESTARTOVALO\",IF(AND(J!A22=\"\",J!B22=\"\"),\"\",J!A22))","v":"Slezáková Nela"},{"$f":"IF(AND(J!A22=\"\",J!B22=\"\"),\"\",J!B22)","v":"Skuteč"},22.21,null,null,22.21,null,19.309999999999999,null,null,19.309999999999999,null,19.309999999999999,null,3,null,3,null,22.21]
[null,{"$f":"J!E23","v":23},{"$f":"IF(AND(J!A23=\"\",J!B23<>\"\"),\"NESTARTOVALO\",IF(AND(J!A23=\"\",J!B23=\"\"),\"\",J!A23))","v":"Hrdinová Adéla"},{"$f":"IF(AND(J!A23=\"\",J!B23=\"\"),\"\",J!B23)","v":"Bystřec"},23.3,null,null,23.3,null,23.84,null,null,23.84,null,23.3,null,29,null,29,null,23.84]
[null,{"$f":"J!E24","v":24},{"$f":"IF(AND(J!A24=\"\",J!B24<>\"\"),\"NESTARTOVALO\",IF(AND(J!A24=\"\",J!B24=\"\"),\"\",J!A24))","v":"Krejsová Nikola"},{"$f":"IF(AND(J!A24=\"\",J!B24=\"\"),\"\",J!B24)","v":"Letohrad Kunčice"},23.57,null,null,23.57,null,24.32,null,null,24.32,null,23.57,null,31,null,31,null,24.32]
[null,{"$f":"J!E25","v":25},{"$f":"IF(AND(J!A25=\"\",J!B25<>\"\"),\"NESTARTOVALO\",IF(AND(J!A25=\"\",J!B25=\"\"),\"\",J!A25))","v":"Bartoníčková Karolína"},{"$f":"IF(AND(J!A25=\"\",J!B25=\"\"),\"\",J!B25)","v":"Kamenec"},20.72,null,null,20.72,null,"NP",null,null,"NP",null,20.72,null,10,null,10,null,620.72]
[null,{"$f":"J!E26","v":26},{"$f":"IF(AND(J!A26=\"\",J!B26<>\"\"),\"NESTARTOVALO\",IF(AND(J!A26=\"\",J!B26=\"\"),\"\",J!A26))","v":"Marečková Veronika"},{"$f":"IF(AND(J!A26=\"\",J!B26=\"\"),\"\",J!B26)","v":"Lukavice"},26.76,null,null,26.76,null,26.2,null,null,26.2,null,26.2,null,39,null,39,null,26.76]
[null,{"$f":"J!E27","v":27},{"$f":"IF(AND(J!A27=\"\",J!B27<>\"\"),\"NESTARTOVALO\",IF(AND(J!A27=\"\",J!B27=\"\"),\"\",J!A27))","v":"Faltysová Marketa"},{"$f":"IF(AND(J!A27=\"\",J!B27=\"\"),\"\",J!B27)","v":"Lubná"},19.739999999999998,null,null,19.739999999999998,null,19.510000000000002,"NP",null,"NP",null,19.739999999999998,null,8,null,8,null,619.74]
[null,{"$f":"J!E28","v":28},{"$f":"IF(AND(J!A28=\"\",J!B28<>\"\"),\"NESTARTOVALO\",IF(AND(J!A28=\"\",J!B28=\"\"),\"\",J!A28))","v":"Šulcová Soňa"},{"$f":"IF(AND(J!A28=\"\",J!B28=\"\"),\"\",J!B28)","v":"Skuteč"},21.3,null,null,21.3,null,22.01,null,null,22.01,null,21.3,null,15,null,15,null,22.01]
[null,{"$f":"J!E29","v":29},{"$f":"IF(AND(J!A29=\"\",J!B29<>\"\"),\"NESTARTOVALO\",IF(AND(J!A29=\"\",J!B29=\"\"),\"\",J!A29))","v":"Hrdinová Lucie"},{"$f":"IF(AND(J!A29=\"\",J!B29=\"\"),\"\",J!B29)","v":"Bystřec"},24.03,null,null,24.03,null,24.53,null,null,24.53,null,24.03,null,34,null,34,null,24.53]
[null,{"$f":"J!E30","v":30},{"$f":"IF(AND(J!A30=\"\",J!B30<>\"\"),\"NESTARTOVALO\",IF(AND(J!A30=\"\",J!B30=\"\"),\"\",J!A30))","v":"Sýkorová Veronika"},{"$f":"IF(AND(J!A30=\"\",J!B30=\"\"),\"\",J!B30)","v":"Letohrad Kunčice"},23.86,null,null,23.86,null,23.02,null,null,23.02,null,23.02,null,27,null,27,null,23.86]
[null,{"$f":"J!E31","v":31},{"$f":"IF(AND(J!A31=\"\",J!B31<>\"\"),\"NESTARTOVALO\",IF(AND(J!A31=\"\",J!B31=\"\"),\"\",J!A31))","v":"Andrlíková Anna"},{"$f":"IF(AND(J!A31=\"\",J!B31=\"\"),\"\",J!B31)","v":"Kamenec"},23.02,null,null,23.02,null,22.73,null,null,22.73,null,22.73,null,24,null,24,null,23.02]
[null,{"$f":"J!E32","v":32},{"$f":"IF(AND(J!A32=\"\",J!B32<>\"\"),\"NESTARTOVALO\",IF(AND(J!A32=\"\",J!B32=\"\"),\"\",J!A32))","v":"Hospodková Tereza"},{"$f":"IF(AND(J!A32=\"\",J!B32=\"\"),\"\",J!B32)","v":"Lukavice"},31.29,"NP",null,"NP",null,23.45,null,null,23.45,null,23.45,null,30,null,30,null,623.45000000000005]
[null,{"$f":"J!E33","v":33},{"$f":"IF(AND(J!A33=\"\",J!B33<>\"\"),\"NESTARTOVALO\",IF(AND(J!A33=\"\",J!B33=\"\"),\"\",J!A33))","v":"Brázdová Ilona"},{"$f":"IF(AND(J!A33=\"\",J!B33=\"\"),\"\",J!B33)","v":"Lubná"},32.89,"NP",null,"NP",null,23.58,null,null,23.58,null,23.58,null,32,null,32,null,623.58000000000004]
[null,{"$f":"J!E34","v":34},{"$f":"IF(AND(J!A34=\"\",J!B34<>\"\"),\"NESTARTOVALO\",IF(AND(J!A34=\"\",J!B34=\"\"),\"\",J!A34))","v":"Zavoralová Aneta"},{"$f":"IF(AND(J!A34=\"\",J!B34=\"\"),\"\",J!B34)","v":"Skuteč"},19.690000000000001,null,null,19.690000000000001,null,19.57,null,null,19.57,null,19.57,null,4,null,4,null,19.690000000000001]
[null,{"$f":"J!E35","v":35},{"$f":"IF(AND(J!A35=\"\",J!B35<>\"\"),\"NESTARTOVALO\",IF(AND(J!A35=\"\",J!B35=\"\"),\"\",J!A35))","v":"Pfeiferová Valerie"},{"$f":"IF(AND(J!A35=\"\",J!B35=\"\"),\"\",J!B35)","v":"Bystřec"},33.090000000000003,"NP",null,"NP",null,34.83,null,null,34.83,null,34.83,null,41,null,41,null,634.83000000000004]
[null,{"$f":"J!E36","v":36},{"$f":"IF(AND(J!A36=\"\",J!B36<>\"\"),\"NESTARTOVALO\",IF(AND(J!A36=\"\",J!B36=\"\"),\"\",J!A36))","v":"Strasmeierová Eliška"},{"$f":"IF(AND(J!A36=\"\",J!B36=\"\"),\"\",J!B36)","v":"Letohrad Kunčice"},24.06,null,null,24.06,null,25.68,null,null,25.68,null,24.06,null,35,null,35,null,25.68]
[null,{"$f":"J!E37","v":37},{"$f":"IF(AND(J!A37=\"\",J!B37<>\"\"),\"NESTARTOVALO\",IF(AND(J!A37=\"\",J!B37=\"\"),\"\",J!A37))","v":"Němcová Barbora"},{"$f":"IF(AND(J!A37=\"\",J!B37=\"\"),\"\",J!B37)","v":"Kamenec"},"NP",null,null,"NP",null,"DNF",null,null,"DNF",null,"NP",null,"NP",null,42,null,4200]
[null,{"$f":"J!E38","v":38},{"$f":"IF(AND(J!A38=\"\",J!B38<>\"\"),\"NESTARTOVALO\",IF(AND(J!A38=\"\",J!B38=\"\"),\"\",J!A38))","v":"Nováková Markéta"},{"$f":"IF(AND(J!A38=\"\",J!B38=\"\"),\"\",J!B38)","v":"Lukavice"},21.35,null,null,21.35,null,34.270000000000003,null,null,34.270000000000003,null,21.35,null,16,null,16,null,34.270000000000003]
[null,{"$f":"J!E39","v":39},{"$f":"IF(AND(J!A39=\"\",J!B39<>\"\"),\"NESTARTOVALO\",IF(AND(J!A39=\"\",J!B39=\"\"),\"\",J!A39))","v":"Kusá Kateřina"},{"$f":"IF(AND(J!A39=\"\",J!B39=\"\"),\"\",J!B39)","v":"Lubná"},20.8,null,null,20.8,null,19.68,null,null,19.68,null,19.68,null,5,null,5,null,20.8]
[null,{"$f":"J!E40","v":40},{"$f":"IF(AND(J!A40=\"\",J!B40<>\"\"),\"NESTARTOVALO\",IF(AND(J!A40=\"\",J!B40=\"\"),\"\",J!A40))","v":"Zavoralová Karolína"},{"$f":"IF(AND(J!A40=\"\",J!B40=\"\"),\"\",J!B40)","v":"Skuteč"},18.05,null,null,18.05,null,19.739999999999998,"NP",null,"NP",null,18.05,null,1,null,1,null,618.04999999999995]
[null,{"$f":"J!E41","v":41},{"$f":"IF(AND(J!A41=\"\",J!B41<>\"\"),\"NESTARTOVALO\",IF(AND(J!A41=\"\",J!B41=\"\"),\"\",J!A41))","v":"Dolečková Kristýna"},{"$f":"IF(AND(J!A41=\"\",J!B41=\"\"),\"\",J!B41)","v":"Bystřec"},22.25,null,null,22.25,null,22.72,null,null,22.72,null,22.25,null,20,null,20,null,22.72]
[null,{"$f":"J!E42","v":42},{"$f":"IF(AND(J!A42=\"\",J!B42<>\"\"),\"NESTARTOVALO\",IF(AND(J!A42=\"\",J!B42=\"\"),\"\",J!A42))","v":"Dudková Martina"},{"$f":"IF(AND(J!A42=\"\",J!B42=\"\"),\"\",J!B42)","v":"Letohrad Kunčice"},19.809999999999999,null,null,19.809999999999999,null,25.95,null,null,25.95,null,19.809999999999999,null,9,null,9,null,25.95]
[null,{"$f":"J!E43","v":43},{"$f":"IF(AND(J!A43=\"\",J!B43<>\"\"),\"NESTARTOVALO\",IF(AND(J!A43=\"\",J!B43=\"\"),\"\",J!A43))","v":""},{"$f":"IF(AND(J!A43=\"\",J!B43=\"\"),\"\",J!B43)","v":""},null,null,null,"",null,null,null,null,"",null,"",null,"",null,"",null,9000]
[null,{"$f":"J!E44","v":44},{"$f":"IF(AND(J!A44=\"\",J!B44<>\"\"),\"NESTARTOVALO\",IF(AND(J!A44=\"\",J!B44=\"\"),\"\",J!A44))","v":""},{"$f":"IF(AND(J!A44=\"\",J!B44=\"\"),\"\",J!B44)","v":""},null,null,null,"",null,null,null,null,"",null,"",null,"",null,"",null,9000]
[null,{"$f":"J!E45","v":45},{"$f":"IF(AND(J!A45=\"\",J!B45<>\"\"),\"NESTARTOVALO\",IF(AND(J!A45=\"\",J!B45=\"\"),\"\",J!A45))","v":""},{"$f":"IF(AND(J!A45=\"\",J!B45=\"\"),\"\",J!B45)","v":""},null,null,null,"",null,null,null,null,"",null,"",null,"",null,"",null,9000]
[null,{"$f":"J!E46","v":46},{"$f":"IF(AND(J!A46=\"\",J!B46<>\"\"),\"NESTARTOVALO\",IF(AND(J!A46=\"\",J!B46=\"\"),\"\",J!A46))","v":""},{"$f":"IF(AND(J!A46=\"\",J!B46=\"\"),\"\",J!B46)","v":""},null,null,null,"",null,null,null,null,"",null,"",null,"",null,"",null,9000]
[null,{"$f":"J!E47","v":47},{"$f":"IF(AND(J!A47=\"\",J!B47<>\"\"),\"NESTARTOVALO\",IF(AND(J!A47=\"\",J!B47=\"\"),\"\",J!A47))","v":""},{"$f":"IF(AND(J!A47=\"\",J!B47=\"\"),\"\",J!B47)","v":""},null,null,null,"",null,null,null,null,"",null,"",null,"",null,"",null,9000]
[null,{"$f":"J!E48","v":48},{"$f":"IF(AND(J!A48=\"\",J!B48<>\"\"),\"NESTARTOVALO\",IF(AND(J!A48=\"\",J!B48=\"\"),\"\",J!A48))","v":""},{"$f":"IF(AND(J!A48=\"\",J!B48=\"\"),\"\",J!B48)","v":""},null,null,null,"",null,null,null,null,"",null,"",null,"",null,"",null,9000]
[null,{"$f":"J!E49","v":49},{"$f":"IF(AND(J!A49=\"\",J!B49<>\"\"),\"NESTARTOVALO\",IF(AND(J!A49=\"\",J!B49=\"\"),\"\",J!A49))","v":""},{"$f":"IF(AND(J!A49=\"\",J!B49=\"\"),\"\",J!B49)","v":""},null,null,null,"",null,null,null,null,"",null,"",null,"",null,"",null,9000]
[null,{"$f":"J!E50","v":50},{"$f":"IF(AND(J!A50=\"\",J!B50<>\"\"),\"NESTARTOVALO\",IF(AND(J!A50=\"\",J!B50=\"\"),\"\",J!A50))","v":""},{"$f":"IF(AND(J!A50=\"\",J!B50=\"\"),\"\",J!B50)","v":""},null,null,null,"",null,null,null,null,"",null,"",null,"",null,"",null,9000]
[null,{"$f":"J!E51","v":51},{"$f":"IF(AND(J!A51=\"\",J!B51<>\"\"),\"NESTARTOVALO\",IF(AND(J!A51=\"\",J!B51=\"\"),\"\",J!A51))","v":""},{"$f":"IF(AND(J!A51=\"\",J!B51=\"\"),\"\",J!B51)","v":""},null,null,null,"",null,null,null,null,"",null,"",null,"",null,"",null,9000]
[null,{"$f":"J!E52","v":52},{"$f":"IF(AND(J!A52=\"\",J!B52<>\"\"),\"NESTARTOVALO\",IF(AND(J!A52=\"\",J!B52=\"\"),\"\",J!A52))","v":""},{"$f":"IF(AND(J!A52=\"\",J!B52=\"\"),\"\",J!B52)","v":""},null,null,null,"",null,null,null,null,"",null,"",null,"",null,"",null,9000]
[null,{"$f":"J!E53","v":53},{"$f":"IF(AND(J!A53=\"\",J!B53<>\"\"),\"NESTARTOVALO\",IF(AND(J!A53=\"\",J!B53=\"\"),\"\",J!A53))","v":""},{"$f":"IF(AND(J!A53=\"\",J!B53=\"\"),\"\",J!B53)","v":""},null,null,null,"",null,null,null,null,"",null,"",null,"",null,"",null,9000]
[null,{"$f":"J!E54","v":54},{"$f":"IF(AND(J!A54=\"\",J!B54<>\"\"),\"NESTARTOVALO\",IF(AND(J!A54=\"\",J!B54=\"\"),\"\",J!A54))","v":""},{"$f":"IF(AND(J!A54=\"\",J!B54=\"\"),\"\",J!B54)","v":""},null,null,null,"",null,null,null,null,"",null,"",null,"",null,"",null,9000]
[null,{"$f":"J!E55","v":55},{"$f":"IF(AND(J!A55=\"\",J!B55<>\"\"),\"NESTARTOVALO\",IF(AND(J!A55=\"\",J!B55=\"\"),\"\",J!A55))","v":""},{"$f":"IF(AND(J!A55=\"\",J!B55=\"\"),\"\",J!B55)","v":""},null,null,null,"",null,null,null,null,"",null,"",null,"",null,"",null,9000]
[null,{"$f":"J!E56","v":56},{"$f":"IF(AND(J!A56=\"\",J!B56<>\"\"),\"NESTARTOVALO\",IF(AND(J!A56=\"\",J!B56=\"\"),\"\",J!A56))","v":""},{"$f":"IF(AND(J!A56=\"\",J!B56=\"\"),\"\",J!B56)","v":""},null,null,null,"",null,null,null,null,"",null,"",null,"",null,"",null,9000]
[null,{"$f":"J!E57","v":57},{"$f":"IF(AND(J!A57=\"\",J!B57<>\"\"),\"NESTARTOVALO\",IF(AND(J!A57=\"\",J!B57=\"\"),\"\",J!A57))","v":""},{"$f":"IF(AND(J!A57=\"\",J!B57=\"\"),\"\",J!B57)","v":""},null,null,null,"",null,null,null,null,"",null,"",null,"",null,"",null,9000]
[null,{"$f":"J!E58","v":58},{"$f":"IF(AND(J!A58=\"\",J!B58<>\"\"),\"NESTARTOVALO\",IF(AND(J!A58=\"\",J!B58=\"\"),\"\",J!A58))","v":""},{"$f":"IF(AND(J!A58=\"\",J!B58=\"\"),\"\",J!B58)","v":""},null,null,null,"",null,null,null,null,"",null,"",null,"",null,"",null,9000]
[null,{"$f":"J!E59","v":59},{"$f":"IF(AND(J!A59=\"\",J!B59<>\"\"),\"NESTARTOVALO\",IF(AND(J!A59=\"\",J!B59=\"\"),\"\",J!A59))","v":""},{"$f":"IF(AND(J!A59=\"\",J!B59=\"\"),\"\",J!B59)","v":""},null,null,null,"",null,null,null,null,"",null,"",null,"",null,"",null,9000]
[null,{"$f":"J!E60","v":60},{"$f":"IF(AND(J!A60=\"\",J!B60<>\"\"),\"NESTARTOVALO\",IF(AND(J!A60=\"\",J!B60=\"\"),\"\",J!A60))","v":""},{"$f":"IF(AND(J!A60=\"\",J!B60=\"\"),\"\",J!B60)","v":""},null,null,null,"",null,null,null,null,"",null,"",null,"",null,"",null,9000]
[null,{"$f":"J!E61","v":61},{"$f":"IF(AND(J!A61=\"\",J!B61<>\"\"),\"NESTARTOVALO\",IF(AND(J!A61=\"\",J!B61=\"\"),\"\",J!A61))","v":""},{"$f":"IF(AND(J!A61=\"\",J!B61=\"\"),\"\",J!B61)","v":""},null,null,null,"",null,null,null,null,"",null,"",null,"",null,"",null,9000]
[null,{"$f":"J!E62","v":62},{"$f":"IF(AND(J!A62=\"\",J!B62<>\"\"),\"NESTARTOVALO\",IF(AND(J!A62=\"\",J!B62=\"\"),\"\",J!A62))","v":""},{"$f":"IF(AND(J!A62=\"\",J!B62=\"\"),\"\",J!B62)","v":""},null,null,null,"",null,null,null,null,"",null,"",null,"",null,"",null,9000]
[null,{"$f":"J!E63","v":63},{"$f":"IF(AND(J!A63=\"\",J!B63<>\"\"),\"NESTARTOVALO\",IF(AND(J!A63=\"\",J!B63=\"\"),\"\",J!A63))","v":""},{"$f":"IF(AND(J!A63=\"\",J!B63=\"\"),\"\",J!B63)","v":""},null,null,null,"",null,null,null,null,"",null,"",null,"",null,"",null,9000]
[null,{"$f":"J!E64","v":64},{"$f":"IF(AND(J!A64=\"\",J!B64<>\"\"),\"NESTARTOVALO\",IF(AND(J!A64=\"\",J!B64=\"\"),\"\",J!A64))","v":""},{"$f":"IF(AND(J!A64=\"\",J!B64=\"\"),\"\",J!B64)","v":""},null,null,null,"",null,null,null,null,"",null,"",null,"",null,"",null,9000]
[null,{"$f":"J!E65","v":65},{"$f":"IF(AND(J!A65=\"\",J!B65<>\"\"),\"NESTARTOVALO\",IF(AND(J!A65=\"\",J!B65=\"\"),\"\",J!A65))","v":""},{"$f":"IF(AND(J!A65=\"\",J!B65=\"\"),\"\",J!B65)","v":""},null,null,null,"",null,null,null,null,"",null,"",null,"",null,"",null,9000]
[null,{"$f":"J!E66","v":66},{"$f":"IF(AND(J!A66=\"\",J!B66<>\"\"),\"NESTARTOVALO\",IF(AND(J!A66=\"\",J!B66=\"\"),\"\",J!A66))","v":""},{"$f":"IF(AND(J!A66=\"\",J!B66=\"\"),\"\",J!B66)","v":""},null,null,null,{"$f":"IF($C70=\"\",\"\",IF(OR($E70=\"DNF\",$F70=\"DNF\",$G70=\"DNF\",AND($E70=\"\",$F70=\"\",$G70=\"\")),\"DNF\",IF(OR($E70=\"NP\",$F70=\"NP\",$G70=\"NP\"),\"NP\",IF(ISERROR(MEDIAN($E70:$G70)),\"DNF\",IF(OR($E70=\"X\",$F70=\"X\",$G70=\"X\",$E70=\"\",$F70=\"\",$G70=\"\",$E70=\"x\",$F70=\"x\",$G70=\"x\"),MAX($E70:$G70),MEDIAN($E70:$G70))))))","v":""},null,null,null,null,{"$f":"IF($C70=\"\",\"\",IF(OR($J70=\"DNF\",$K70=\"DNF\",$L70=\"DNF\",AND($J70=\"\",$K70=\"\",$L70=\"\")),\"DNF\",IF(OR($J70=\"NP\",$K70=\"NP\",$L70=\"NP\"),\"NP\",IF(ISERROR(MEDIAN($J70:$L70)),\"DNF\",IF(OR($J70=\"X\",$K70=\"X\",$L70=\"X\",$J70=\"\",$K70=\"\",$L70=\"\",$J70=\"x\",$K70=\"x\",$L70=\"x\"),MAX($J70:$L70),MEDIAN($J70:$L70))))))","v":""},null,{"$f":"IF(C70=\"\",\"\",IF(OR(AND(H70=\"NP\",M70=\"NP\"),AND(H70=\"DNF\",M70=\"DNF\")),H70,IF(AND(H70=\"NP\",M70=\"DNF\"),H70,IF(AND(H70=\"DNF\",M70=\"NP\"),M70,MIN(H70,M70)))))","v":""},null,{"$f":"IF(C70=\"\",\"\",IF(OR(O70=\"NP\",O70=\"DNF\"),O70,RANK(O70,O$5:O$179,1)))","v":""},null,{"$f":"IF(C70=\"\",\"\",IF(O70=\"NP\",MAX(Q$5:Q$179)+1,IF(O70=\"DNF\",MAX(Q$5:Q$179)+COUNTIF(Q$5:Q$179,\"NP\")+1,RANK(O70,O$5:O$179,1))))","v":""},null,{"$f":"IF($C70=\"\",9000,MAX(H70,M70)+(COUNTIF($H70:$H70,\"NP\")*600)+(COUNTIF($M70:$M70,\"NP\")*600)+(COUNTIF($H70:$H70,\"DNF\")*3600)+(COUNTIF($M70:$M70,\"DNF\")*3600))","v":9000}]
[null,{"$f":"J!E67","v":67},{"$f":"IF(AND(J!A67=\"\",J!B67<>\"\"),\"NESTARTOVALO\",IF(AND(J!A67=\"\",J!B67=\"\"),\"\",J!A67))","v":""},{"$f":"IF(AND(J!A67=\"\",J!B67=\"\"),\"\",J!B67)","v":""},null,null,null,"",null,null,null,null,"",null,"",null,"",null,"",null,9000]
[null,{"$f":"J!E68","v":68},{"$f":"IF(AND(J!A68=\"\",J!B68<>\"\"),\"NESTARTOVALO\",IF(AND(J!A68=\"\",J!B68=\"\"),\"\",J!A68))","v":""},{"$f":"IF(AND(J!A68=\"\",J!B68=\"\"),\"\",J!B68)","v":""},null,null,null,"",null,null,null,null,"",null,"",null,"",null,"",null,9000]
[null,{"$f":"J!E69","v":69},{"$f":"IF(AND(J!A69=\"\",J!B69<>\"\"),\"NESTARTOVALO\",IF(AND(J!A69=\"\",J!B69=\"\"),\"\",J!A69))","v":""},{"$f":"IF(AND(J!A69=\"\",J!B69=\"\"),\"\",J!B69)","v":""},null,null,null,"",null,null,null,null,"",null,"",null,"",null,"",null,9000]
[null,{"$f":"J!E70","v":70},{"$f":"IF(AND(J!A70=\"\",J!B70<>\"\"),\"NESTARTOVALO\",IF(AND(J!A70=\"\",J!B70=\"\"),\"\",J!A70))","v":""},{"$f":"IF(AND(J!A70=\"\",J!B70=\"\"),\"\",J!B70)","v":""},null,null,null,"",null,null,null,null,"",null,"",null,"",null,"",null,9000]
[null,{"$f":"J!E71","v":71},{"$f":"IF(AND(J!A71=\"\",J!B71<>\"\"),\"NESTARTOVALO\",IF(AND(J!A71=\"\",J!B71=\"\"),\"\",J!A71))","v":""},{"$f":"IF(AND(J!A71=\"\",J!B71=\"\"),\"\",J!B71)","v":""},null,null,null,"",null,null,null,null,"",null,"",null,"",null,"",null,9000]
[null,{"$f":"J!E72","v":72},{"$f":"IF(AND(J!A72=\"\",J!B72<>\"\"),\"NESTARTOVALO\",IF(AND(J!A72=\"\",J!B72=\"\"),\"\",J!A72))","v":""},{"$f":"IF(AND(J!A72=\"\",J!B72=\"\"),\"\",J!B72)","v":""},null,null,null,"",null,null,null,null,"",null,"",null,"",null,"",null,9000]
[null,{"$f":"J!E73","v":73},{"$f":"IF(AND(J!A73=\"\",J!B73<>\"\"),\"NESTARTOVALO\",IF(AND(J!A73=\"\",J!B73=\"\"),\"\",J!A73))","v":""},{"$f":"IF(AND(J!A73=\"\",J!B73=\"\"),\"\",J!B73)","v":""},null,null,null,"",null,null,null,null,"",null,"",null,"",null,"",null,9000]
[null,{"$f":"J!E74","v":74},{"$f":"IF(AND(J!A74=\"\",J!B74<>\"\"),\"NESTARTOVALO\",IF(AND(J!A74=\"\",J!B74=\"\"),\"\",J!A74))","v":""},{"$f":"IF(AND(J!A74=\"\",J!B74=\"\"),\"\",J!B74)","v":""},null,null,null,"",null,null,null,null,"",null,"",null,"",null,"",null,9000]
[null,{"$f":"J!E75","v":75},{"$f":"IF(AND(J!A75=\"\",J!B75<>\"\"),\"NESTARTOVALO\",IF(AND(J!A75=\"\",J!B75=\"\"),\"\",J!A75))","v":""},{"$f":"IF(AND(J!A75=\"\",J!B75=\"\"),\"\",J!B75)","v":""},null,null,null,"",null,null,null,null,"",null,"",null,"",null,"",null,9000]
[null,{"$f":"J!E76","v":76},{"$f":"IF(AND(J!A76=\"\",J!B76<>\"\"),\"NESTARTOVALO\",IF(AND(J!A76=\"\",J!B76=\"\"),\"\",J!A76))","v":""},{"$f":"IF(AND(J!A76=\"\",J!B76=\"\"),\"\",J!B76)","v":""},null,null,null,"",null,null,null,null,"",null,"",null,"",null,"",null,9000]
[null,{"$f":"J!E77","v":77},{"$f":"IF(AND(J!A77=\"\",J!B77<>\"\"),\"NESTARTOVALO\",IF(AND(J!A77=\"\",J!B77=\"\"),\"\",J!A77))","v":""},{"$f":"IF(AND(J!A77=\"\",J!B77=\"\"),\"\",J!B77)","v":""},null,null,null,"",null,null,null,null,"",null,"",null,"",null,"",null,9000]
[null,{"$f":"J!E78","v":78},{"$f":"IF(AND(J!A78=\"\",J!B78<>\"\"),\"NESTARTOVALO\",IF(AND(J!A78=\"\",J!B78=\"\"),\"\",J!A78))","v":""},{"$f":"IF(AND(J!A78=\"\",J!B78=\"\"),\"\",J!B78)","v":""},null,null,null,"",null,null,null,null,"",null,"",null,"",null,"",null,9000]
[null,{"$f":"J!E79","v":79},{"$f":"IF(AND(J!A79=\"\",J!B79<>\"\"),\"NESTARTOVALO\",IF(AND(J!A79=\"\",J!B79=\"\"),\"\",J!A79))","v":""},{"$f":"IF(AND(J!A79=\"\",J!B79=\"\"),\"\",J!B79)","v":""},null,null,null,"",null,null,null,null,"",null,"",null,"",null,"",null,9000]
[null,{"$f":"J!E80","v":80},{"$f":"IF(AND(J!A80=\"\",J!B80<>\"\"),\"NESTARTOVALO\",IF(AND(J!A80=\"\",J!B80=\"\"),\"\",J!A80))","v":""},{"$f":"IF(AND(J!A80=\"\",J!B80=\"\"),\"\",J!B80)","v":""},null,null,null,"",null,null,null,null,"",null,"",null,"",null,"",null,9000]
[null,{"$f":"J!E81","v":81},{"$f":"IF(AND(J!A81=\"\",J!B81<>\"\"),\"NESTARTOVALO\",IF(AND(J!A81=\"\",J!B81=\"\"),\"\",J!A81))","v":""},{"$f":"IF(AND(J!A81=\"\",J!B81=\"\"),\"\",J!B81)","v":""},null,null,null,"",null,null,null,null,"",null,"",null,"",null,"",null,9000]
[null,{"$f":"J!E82","v":82},{"$f":"IF(AND(J!A82=\"\",J!B82<>\"\"),\"NESTARTOVALO\",IF(AND(J!A82=\"\",J!B82=\"\"),\"\",J!A82))","v":""},{"$f":"IF(AND(J!A82=\"\",J!B82=\"\"),\"\",J!B82)","v":""},null,null,null,"",null,null,null,null,"",null,"",null,"",null,"",null,9000]
[null,{"$f":"J!E83","v":83},{"$f":"IF(AND(J!A83=\"\",J!B83<>\"\"),\"NESTARTOVALO\",IF(AND(J!A83=\"\",J!B83=\"\"),\"\",J!A83))","v":""},{"$f":"IF(AND(J!A83=\"\",J!B83=\"\"),\"\",J!B83)","v":""},null,null,null,"",null,null,null,null,"",null,"",null,"",null,"",null,9000]
[null,{"$f":"J!E84","v":84},{"$f":"IF(AND(J!A84=\"\",J!B84<>\"\"),\"NESTARTOVALO\",IF(AND(J!A84=\"\",J!B84=\"\"),\"\",J!A84))","v":""},{"$f":"IF(AND(J!A84=\"\",J!B84=\"\"),\"\",J!B84)","v":""},null,null,null,"",null,null,null,null,"",null,"",null,"",null,"",null,9000]
[null,{"$f":"J!E85","v":85},{"$f":"IF(AND(J!A85=\"\",J!B85<>\"\"),\"NESTARTOVALO\",IF(AND(J!A85=\"\",J!B85=\"\"),\"\",J!A85))","v":""},{"$f":"IF(AND(J!A85=\"\",J!B85=\"\"),\"\",J!B85)","v":""},null,null,null,"",null,null,null,null,"",null,"",null,"",null,"",null,9000]
[null,{"$f":"J!E86","v":86},{"$f":"IF(AND(J!A86=\"\",J!B86<>\"\"),\"NESTARTOVALO\",IF(AND(J!A86=\"\",J!B86=\"\"),\"\",J!A86))","v":""},{"$f":"IF(AND(J!A86=\"\",J!B86=\"\"),\"\",J!B86)","v":""},null,null,null,"",null,null,null,null,"",null,"",null,"",null,"",null,9000]
[null,{"$f":"J!E87","v":87},{"$f":"IF(AND(J!A87=\"\",J!B87<>\"\"),\"NESTARTOVALO\",IF(AND(J!A87=\"\",J!B87=\"\"),\"\",J!A87))","v":""},{"$f":"IF(AND(J!A87=\"\",J!B87=\"\"),\"\",J!B87)","v":""},null,null,null,"",null,null,null,null,"",null,"",null,"",null,"",null,9000]
[null,{"$f":"J!E88","v":88},{"$f":"IF(AND(J!A88=\"\",J!B88<>\"\"),\"NESTARTOVALO\",IF(AND(J!A88=\"\",J!B88=\"\"),\"\",J!A88))","v":""},{"$f":"IF(AND(J!A88=\"\",J!B88=\"\"),\"\",J!B88)","v":""},null,null,null,"",null,null,null,null,"",null,"",null,"",null,"",null,9000]
[null,{"$f":"J!E89","v":89},{"$f":"IF(AND(J!A89=\"\",J!B89<>\"\"),\"NESTARTOVALO\",IF(AND(J!A89=\"\",J!B89=\"\"),\"\",J!A89))","v":""},{"$f":"IF(AND(J!A89=\"\",J!B89=\"\"),\"\",J!B89)","v":""},null,null,null,"",null,null,null,null,"",null,"",null,"",null,"",null,9000]
[null,{"$f":"J!E90","v":90},{"$f":"IF(AND(J!A90=\"\",J!B90<>\"\"),\"NESTARTOVALO\",IF(AND(J!A90=\"\",J!B90=\"\"),\"\",J!A90))","v":""},{"$f":"IF(AND(J!A90=\"\",J!B90=\"\"),\"\",J!B90)","v":""},null,null,null,"",null,null,null,null,"",null,"",null,"",null,"",null,9000]
[null,{"$f":"J!E91","v":91},{"$f":"IF(AND(J!A91=\"\",J!B91<>\"\"),\"NESTARTOVALO\",IF(AND(J!A91=\"\",J!B91=\"\"),\"\",J!A91))","v":""},{"$f":"IF(AND(J!A91=\"\",J!B91=\"\"),\"\",J!B91)","v":""},null,null,null,"",null,null,null,null,"",null,"",null,"",null,"",null,9000]
[null,{"$f":"J!E92","v":92},{"$f":"IF(AND(J!A92=\"\",J!B92<>\"\"),\"NESTARTOVALO\",IF(AND(J!A92=\"\",J!B92=\"\"),\"\",J!A92))","v":""},{"$f":"IF(AND(J!A92=\"\",J!B92=\"\"),\"\",J!B92)","v":""},null,null,null,"",null,null,null,null,"",null,"",null,"",null,"",null,9000]
[null,{"$f":"J!E93","v":93},{"$f":"IF(AND(J!A93=\"\",J!B93<>\"\"),\"NESTARTOVALO\",IF(AND(J!A93=\"\",J!B93=\"\"),\"\",J!A93))","v":""},{"$f":"IF(AND(J!A93=\"\",J!B93=\"\"),\"\",J!B93)","v":""},null,null,null,"",null,null,null,null,"",null,"",null,"",null,"",null,9000]
[null,{"$f":"J!E94","v":94},{"$f":"IF(AND(J!A94=\"\",J!B94<>\"\"),\"NESTARTOVALO\",IF(AND(J!A94=\"\",J!B94=\"\"),\"\",J!A94))","v":""},{"$f":"IF(AND(J!A94=\"\",J!B94=\"\"),\"\",J!B94)","v":""},null,null,null,"",null,null,null,null,"",null,"",null,"",null,"",null,9000]
[null,{"$f":"J!E95","v":95},{"$f":"IF(AND(J!A95=\"\",J!B95<>\"\"),\"NESTARTOVALO\",IF(AND(J!A95=\"\",J!B95=\"\"),\"\",J!A95))","v":""},{"$f":"IF(AND(J!A95=\"\",J!B95=\"\"),\"\",J!B95)","v":""},null,null,null,"",null,null,null,null,"",null,"",null,"",null,"",null,9000]
[null,{"$f":"J!E96","v":96},{"$f":"IF(AND(J!A96=\"\",J!B96<>\"\"),\"NESTARTOVALO\",IF(AND(J!A96=\"\",J!B96=\"\"),\"\",J!A96))","v":""},{"$f":"IF(AND(J!A96=\"\",J!B96=\"\"),\"\",J!B96)","v":""},null,null,null,"",null,null,null,null,"",null,"",null,"",null,"",null,9000]
[null,{"$f":"J!E97","v":97},{"$f":"IF(AND(J!A97=\"\",J!B97<>\"\"),\"NESTARTOVALO\",IF(AND(J!A97=\"\",J!B97=\"\"),\"\",J!A97))","v":""},{"$f":"IF(AND(J!A97=\"\",J!B97=\"\"),\"\",J!B97)","v":""},null,null,null,"",null,null,null,null,"",null,"",null,"",null,"",null,9000]
[null,{"$f":"J!E98","v":98},{"$f":"IF(AND(J!A98=\"\",J!B98<>\"\"),\"NESTARTOVALO\",IF(AND(J!A98=\"\",J!B98=\"\"),\"\",J!A98))","v":""},{"$f":"IF(AND(J!A98=\"\",J!B98=\"\"),\"\",J!B98)","v":""},null,null,null,"",null,null,null,null,"",null,"",null,"",null,"",null,9000]
[null,{"$f":"J!E99","v":99},{"$f":"IF(AND(J!A99=\"\",J!B99<>\"\"),\"NESTARTOVALO\",IF(AND(J!A99=\"\",J!B99=\"\"),\"\",J!A99))","v":""},{"$f":"IF(AND(J!A99=\"\",J!B99=\"\"),\"\",J!B99)","v":""},null,null,null,"",null,null,null,null,"",null,{"$f":"IF(C103=\"\",\"\",IF(OR(AND(H103=\"NP\",M103=\"NP\"),AND(H103=\"DNF\",M103=\"DNF\")),H103,IF(AND(H103=\"NP\",M103=\"DNF\"),H103,IF(AND(H103=\"DNF\",M103=\"NP\"),M103,MIN(H103,M103)))))","v":""},null,"",null,"",null,9000]
[null,{"$f":"J!E100","v":100},{"$f":"IF(AND(J!A100=\"\",J!B100<>\"\"),\"NESTARTOVALO\",IF(AND(J!A100=\"\",J!B100=\"\"),\"\",J!A100))","v":""},{"$f":"IF(AND(J!A100=\"\",J!B100=\"\"),\"\",J!B100)","v":""},null,null,null,"",null,null,null,null,"",null,"",null,"",null,"",null,9000]
[null,{"$f":"J!E101","v":101},{"$f":"IF(AND(J!A101=\"\",J!B101<>\"\"),\"NESTARTOVALO\",IF(AND(J!A101=\"\",J!B101=\"\"),\"\",J!A101))","v":""},{"$f":"IF(AND(J!A101=\"\",J!B101=\"\"),\"\",J!B101)","v":""},null,null,null,"",null,null,null,null,"",null,"",null,"",null,"",null,9000]
[null,{"$f":"J!E102","v":102},{"$f":"IF(AND(J!A102=\"\",J!B102<>\"\"),\"NESTARTOVALO\",IF(AND(J!A102=\"\",J!B102=\"\"),\"\",J!A102))","v":""},{"$f":"IF(AND(J!A102=\"\",J!B102=\"\"),\"\",J!B102)","v":""},null,null,null,"",null,null,null,null,"",null,"",null,"",null,"",null,9000]
[null,{"$f":"J!E103","v":103},{"$f":"IF(AND(J!A103=\"\",J!B103<>\"\"),\"NESTARTOVALO\",IF(AND(J!A103=\"\",J!B103=\"\"),\"\",J!A103))","v":""},{"$f":"IF(AND(J!A103=\"\",J!B103=\"\"),\"\",J!B103)","v":""},null,null,null,"",null,null,null,null,"",null,"",null,"",null,"",null,9000]
[null,{"$f":"J!E104","v":104},{"$f":"IF(AND(J!A104=\"\",J!B104<>\"\"),\"NESTARTOVALO\",IF(AND(J!A104=\"\",J!B104=\"\"),\"\",J!A104))","v":""},{"$f":"IF(AND(J!A104=\"\",J!B104=\"\"),\"\",J!B104)","v":""},null,null,null,"",null,null,null,null,"",null,"",null,"",null,"",null,9000]
[null,{"$f":"J!E105","v":105},{"$f":"IF(AND(J!A105=\"\",J!B105<>\"\"),\"NESTARTOVALO\",IF(AND(J!A105=\"\",J!B105=\"\"),\"\",J!A105))","v":""},{"$f":"IF(AND(J!A105=\"\",J!B105=\"\"),\"\",J!B105)","v":""},null,null,null,"",null,null,null,null,"",null,"",null,"",null,"",null,9000]
[null,{"$f":"J!E106","v":106},{"$f":"IF(AND(J!A106=\"\",J!B106<>\"\"),\"NESTARTOVALO\",IF(AND(J!A106=\"\",J!B106=\"\"),\"\",J!A106))","v":""},{"$f":"IF(AND(J!A106=\"\",J!B106=\"\"),\"\",J!B106)","v":""},null,null,null,"",null,null,null,null,"",null,"",null,"",null,"",null,9000]
[null,{"$f":"J!E107","v":107},{"$f":"IF(AND(J!A107=\"\",J!B107<>\"\"),\"NESTARTOVALO\",IF(AND(J!A107=\"\",J!B107=\"\"),\"\",J!A107))","v":""},{"$f":"IF(AND(J!A107=\"\",J!B107=\"\"),\"\",J!B107)","v":""},null,null,null,"",null,null,null,null,"",null,"",null,"",null,"",null,9000]
[null,{"$f":"J!E108","v":108},{"$f":"IF(AND(J!A108=\"\",J!B108<>\"\"),\"NESTARTOVALO\",IF(AND(J!A108=\"\",J!B108=\"\"),\"\",J!A108))","v":""},{"$f":"IF(AND(J!A108=\"\",J!B108=\"\"),\"\",J!B108)","v":""},null,null,null,"",null,null,null,null,"",null,"",null,"",null,"",null,9000]
[null,{"$f":"J!E109","v":109},{"$f":"IF(AND(J!A109=\"\",J!B109<>\"\"),\"NESTARTOVALO\",IF(AND(J!A109=\"\",J!B109=\"\"),\"\",J!A109))","v":""},{"$f":"IF(AND(J!A109=\"\",J!B109=\"\"),\"\",J!B109)","v":""},null,null,null,"",null,null,null,null,"",null,"",null,"",null,"",null,9000]
[null,{"$f":"J!E110","v":110},{"$f":"IF(AND(J!A110=\"\",J!B110<>\"\"),\"NESTARTOVALO\",IF(AND(J!A110=\"\",J!B110=\"\"),\"\",J!A110))","v":""},{"$f":"IF(AND(J!A110=\"\",J!B110=\"\"),\"\",J!B110)","v":""},null,null,null,"",null,null,null,null,"",null,"",null,"",null,"",null,9000]
[null,{"$f":"J!E111","v":111},{"$f":"IF(AND(J!A111=\"\",J!B111<>\"\"),\"NESTARTOVALO\",IF(AND(J!A111=\"\",J!B111=\"\"),\"\",J!A111))","v":""},{"$f":"IF(AND(J!A111=\"\",J!B111=\"\"),\"\",J!B111)","v":""},null,null,null,"",null,null,null,null,"",null,"",null,"",null,"",null,9000]
[null,{"$f":"J!E112","v":112},{"$f":"IF(AND(J!A112=\"\",J!B112<>\"\"),\"NESTARTOVALO\",IF(AND(J!A112=\"\",J!B112=\"\"),\"\",J!A112))","v":""},{"$f":"IF(AND(J!A112=\"\",J!B112=\"\"),\"\",J!B112)","v":""},null,null,null,"",null,null,null,null,"",null,"",null,"",null,"",null,9000]
[null,{"$f":"J!E113","v":113},{"$f":"IF(AND(J!A113=\"\",J!B113<>\"\"),\"NESTARTOVALO\",IF(AND(J!A113=\"\",J!B113=\"\"),\"\",J!A113))","v":""},{"$f":"IF(AND(J!A113=\"\",J!B113=\"\"),\"\",J!B113)","v":""},null,null,null,"",null,null,null,null,"",null,"",null,"",null,"",null,9000]
[null,{"$f":"J!E114","v":114},{"$f":"IF(AND(J!A114=\"\",J!B114<>\"\"),\"NESTARTOVALO\",IF(AND(J!A114=\"\",J!B114=\"\"),\"\",J!A114))","v":""},{"$f":"IF(AND(J!A114=\"\",J!B114=\"\"),\"\",J!B114)","v":""},null,null,null,"",null,null,null,null,"",null,"",null,"",null,"",null,9000]
[null,{"$f":"J!E115","v":115},{"$f":"IF(AND(J!A115=\"\",J!B115<>\"\"),\"NESTARTOVALO\",IF(AND(J!A115=\"\",J!B115=\"\"),\"\",J!A115))","v":""},{"$f":"IF(AND(J!A115=\"\",J!B115=\"\"),\"\",J!B115)","v":""},null,null,null,"",null,null,null,null,"",null,"",null,"",null,"",null,9000]
[null,{"$f":"J!E116","v":116},{"$f":"IF(AND(J!A116=\"\",J!B116<>\"\"),\"NESTARTOVALO\",IF(AND(J!A116=\"\",J!B116=\"\"),\"\",J!A116))","v":""},{"$f":"IF(AND(J!A116=\"\",J!B116=\"\"),\"\",J!B116)","v":""},null,null,null,"",null,null,null,null,"",null,"",null,"",null,"",null,9000]
[null,{"$f":"J!E117","v":117},{"$f":"IF(AND(J!A117=\"\",J!B117<>\"\"),\"NESTARTOVALO\",IF(AND(J!A117=\"\",J!B117=\"\"),\"\",J!A117))","v":""},{"$f":"IF(AND(J!A117=\"\",J!B117=\"\"),\"\",J!B117)","v":""},null,null,null,"",null,null,null,null,"",null,"",null,"",null,"",null,9000]
[null,{"$f":"J!E118","v":118},{"$f":"IF(AND(J!A118=\"\",J!B118<>\"\"),\"NESTARTOVALO\",IF(AND(J!A118=\"\",J!B118=\"\"),\"\",J!A118))","v":""},{"$f":"IF(AND(J!A118=\"\",J!B118=\"\"),\"\",J!B118)","v":""},null,null,null,"",null,null,null,null,"",null,"",null,"",null,"",null,9000]
[null,{"$f":"J!E119","v":119},{"$f":"IF(AND(J!A119=\"\",J!B119<>\"\"),\"NESTARTOVALO\",IF(AND(J!A119=\"\",J!B119=\"\"),\"\",J!A119))","v":""},{"$f":"IF(AND(J!A119=\"\",J!B119=\"\"),\"\",J!B119)","v":""},null,null,null,"",null,null,null,null,"",null,"",null,"",null,"",null,9000]
[null,{"$f":"J!E120","v":120},{"$f":"IF(AND(J!A120=\"\",J!B120<>\"\"),\"NESTARTOVALO\",IF(AND(J!A120=\"\",J!B120=\"\"),\"\",J!A120))","v":""},{"$f":"IF(AND(J!A120=\"\",J!B120=\"\"),\"\",J!B120)","v":""},null,null,null,"",null,null,null,null,"",null,"",null,"",null,"",null,9000]
[null,{"$f":"J!E121","v":121},{"$f":"IF(AND(J!A121=\"\",J!B121<>\"\"),\"NESTARTOVALO\",IF(AND(J!A121=\"\",J!B121=\"\"),\"\",J!A121))","v":""},{"$f":"IF(AND(J!A121=\"\",J!B121=\"\"),\"\",J!B121)","v":""},null,null,null,"",null,null,null,null,"",null,"",null,"",null,"",null,9000]
[null,{"$f":"J!E122","v":122},{"$f":"IF(AND(J!A122=\"\",J!B122<>\"\"),\"NESTARTOVALO\",IF(AND(J!A122=\"\",J!B122=\"\"),\"\",J!A122))","v":""},{"$f":"IF(AND(J!A122=\"\",J!B122=\"\"),\"\",J!B122)","v":""},null,null,null,"",null,null,null,null,"",null,"",null,"",null,"",null,9000]
[null,{"$f":"J!E123","v":123},{"$f":"IF(AND(J!A123=\"\",J!B123<>\"\"),\"NESTARTOVALO\",IF(AND(J!A123=\"\",J!B123=\"\"),\"\",J!A123))","v":""},{"$f":"IF(AND(J!A123=\"\",J!B123=\"\"),\"\",J!B123)","v":""},null,null,null,"",null,null,null,null,"",null,"",null,"",null,"",null,9000]
[null,{"$f":"J!E124","v":124},{"$f":"IF(AND(J!A124=\"\",J!B124<>\"\"),\"NESTARTOVALO\",IF(AND(J!A124=\"\",J!B124=\"\"),\"\",J!A124))","v":""},{"$f":"IF(AND(J!A124=\"\",J!B124=\"\"),\"\",J!B124)","v":""},null,null,null,"",null,null,null,null,"",null,"",null,"",null,"",null,9000]
[null,{"$f":"J!E125","v":125},{"$f":"IF(AND(J!A125=\"\",J!B125<>\"\"),\"NESTARTOVALO\",IF(AND(J!A125=\"\",J!B125=\"\"),\"\",J!A125))","v":""},{"$f":"IF(AND(J!A125=\"\",J!B125=\"\"),\"\",J!B125)","v":""},null,null,null,"",null,null,null,null,"",null,"",null,"",null,"",null,9000]
[null,{"$f":"J!E126","v":126},{"$f":"IF(AND(J!A126=\"\",J!B126<>\"\"),\"NESTARTOVALO\",IF(AND(J!A126=\"\",J!B126=\"\"),\"\",J!A126))","v":""},{"$f":"IF(AND(J!A126=\"\",J!B126=\"\"),\"\",J!B126)","v":""},null,null,null,"",null,null,null,null,"",null,"",null,"",null,"",null,9000]
[null,{"$f":"J!E127","v":127},{"$f":"IF(AND(J!A127=\"\",J!B127<>\"\"),\"NESTARTOVALO\",IF(AND(J!A127=\"\",J!B127=\"\"),\"\",J!A127))","v":""},{"$f":"IF(AND(J!A127=\"\",J!B127=\"\"),\"\",J!B127)","v":""},null,null,null,"",null,null,null,null,"",null,"",null,"",null,"",null,9000]
[null,{"$f":"J!E128","v":128},{"$f":"IF(AND(J!A128=\"\",J!B128<>\"\"),\"NESTARTOVALO\",IF(AND(J!A128=\"\",J!B128=\"\"),\"\",J!A128))","v":""},{"$f":"IF(AND(J!A128=\"\",J!B128=\"\"),\"\",J!B128)","v":""},null,null,null,"",null,null,null,null,"",null,"",null,"",null,"",null,9000]
[null,{"$f":"J!E129","v":129},{"$f":"IF(AND(J!A129=\"\",J!B129<>\"\"),\"NESTARTOVALO\",IF(AND(J!A129=\"\",J!B129=\"\"),\"\",J!A129))","v":""},{"$f":"IF(AND(J!A129=\"\",J!B129=\"\"),\"\",J!B129)","v":""},null,null,null,"",null,null,null,null,"",null,"",null,"",null,"",null,9000]
[null,{"$f":"J!E130","v":130},{"$f":"IF(AND(J!A130=\"\",J!B130<>\"\"),\"NESTARTOVALO\",IF(AND(J!A130=\"\",J!B130=\"\"),\"\",J!A130))","v":""},{"$f":"IF(AND(J!A130=\"\",J!B130=\"\"),\"\",J!B130)","v":""},null,null,null,{"$f":"IF($C134=\"\",\"\",IF(OR($E134=\"DNF\",$F134=\"DNF\",$G134=\"DNF\",AND($E134=\"\",$F134=\"\",$G134=\"\")),\"DNF\",IF(OR($E134=\"NP\",$F134=\"NP\",$G134=\"NP\"),\"NP\",IF(ISERROR(MEDIAN($E134:$G134)),\"DNF\",IF(OR($E134=\"X\",$F134=\"X\",$G134=\"X\",$E134=\"\",$F134=\"\",$G134=\"\",$E134=\"x\",$F134=\"x\",$G134=\"x\"),MAX($E134:$G134),MEDIAN($E134:$G134))))))","v":""},null,null,null,null,{"$f":"IF($C134=\"\",\"\",IF(OR($J134=\"DNF\",$K134=\"DNF\",$L134=\"DNF\",AND($J134=\"\",$K134=\"\",$L134=\"\")),\"DNF\",IF(OR($J134=\"NP\",$K134=\"NP\",$L134=\"NP\"),\"NP\",IF(ISERROR(MEDIAN($J134:$L134)),\"DNF\",IF(OR($J134=\"X\",$K134=\"X\",$L134=\"X\",$J134=\"\",$K134=\"\",$L134=\"\",$J134=\"x\",$K134=\"x\",$L134=\"x\"),MAX($J134:$L134),MEDIAN($J134:$L134))))))","v":""},null,"",null,{"$f":"IF(C134=\"\",\"\",IF(OR(O134=\"NP\",O134=\"DNF\"),O134,RANK(O134,O$5:O$179,1)))","v":""},null,{"$f":"IF(C134=\"\",\"\",IF(O134=\"NP\",MAX(Q$5:Q$179)+1,IF(O134=\"DNF\",MAX(Q$5:Q$179)+COUNTIF(Q$5:Q$179,\"NP\")+1,RANK(O134,O$5:O$179,1))))","v":""},null,{"$f":"IF($C134=\"\",9000,MAX(H134,M134)+(COUNTIF($H134:$H134,\"NP\")*600)+(COUNTIF($M134:$M134,\"NP\")*600)+(COUNTIF($H134:$H134,\"DNF\")*3600)+(COUNTIF($M134:$M134,\"DNF\")*3600))","v":9000}]
[null,{"$f":"J!E131","v":131},{"$f":"IF(AND(J!A131=\"\",J!B131<>\"\"),\"NESTARTOVALO\",IF(AND(J!A131=\"\",J!B131=\"\"),\"\",J!A131))","v":""},{"$f":"IF(AND(J!A131=\"\",J!B131=\"\"),\"\",J!B131)","v":""},null,null,null,"",null,null,null,null,"",null,"",null,"",null,"",null,9000]
[null,{"$f":"J!E132","v":132},{"$f":"IF(AND(J!A132=\"\",J!B132<>\"\"),\"NESTARTOVALO\",IF(AND(J!A132=\"\",J!B132=\"\"),\"\",J!A132))","v":""},{"$f":"IF(AND(J!A132=\"\",J!B132=\"\"),\"\",J!B132)","v":""},null,null,null,"",null,null,null,null,"",null,"",null,"",null,"",null,9000]
[null,{"$f":"J!E133","v":133},{"$f":"IF(AND(J!A133=\"\",J!B133<>\"\"),\"NESTARTOVALO\",IF(AND(J!A133=\"\",J!B133=\"\"),\"\",J!A133))","v":""},{"$f":"IF(AND(J!A133=\"\",J!B133=\"\"),\"\",J!B133)","v":""},null,null,null,"",null,null,null,null,"",null,"",null,"",null,"",null,9000]
[null,{"$f":"J!E134","v":134},{"$f":"IF(AND(J!A134=\"\",J!B134<>\"\"),\"NESTARTOVALO\",IF(AND(J!A134=\"\",J!B134=\"\"),\"\",J!A134))","v":""},{"$f":"IF(AND(J!A134=\"\",J!B134=\"\"),\"\",J!B134)","v":""},null,null,null,"",null,null,null,null,"",null,"",null,"",null,"",null,9000]
[null,{"$f":"J!E135","v":135},{"$f":"IF(AND(J!A135=\"\",J!B135<>\"\"),\"NESTARTOVALO\",IF(AND(J!A135=\"\",J!B135=\"\"),\"\",J!A135))","v":""},{"$f":"IF(AND(J!A135=\"\",J!B135=\"\"),\"\",J!B135)","v":""},null,null,null,"",null,null,null,null,"",null,"",null,"",null,"",null,9000]
[null,{"$f":"J!E136","v":136},{"$f":"IF(AND(J!A136=\"\",J!B136<>\"\"),\"NESTARTOVALO\",IF(AND(J!A136=\"\",J!B136=\"\"),\"\",J!A136))","v":""},{"$f":"IF(AND(J!A136=\"\",J!B136=\"\"),\"\",J!B136)","v":""},null,null,null,"",null,null,null,null,"",null,"",null,"",null,"",null,9000]
[null,{"$f":"J!E137","v":137},{"$f":"IF(AND(J!A137=\"\",J!B137<>\"\"),\"NESTARTOVALO\",IF(AND(J!A137=\"\",J!B137=\"\"),\"\",J!A137))","v":""},{"$f":"IF(AND(J!A137=\"\",J!B137=\"\"),\"\",J!B137)","v":""},null,null,null,"",null,null,null,null,"",null,"",null,"",null,"",null,9000]
[null,{"$f":"J!E138","v":138},{"$f":"IF(AND(J!A138=\"\",J!B138<>\"\"),\"NESTARTOVALO\",IF(AND(J!A138=\"\",J!B138=\"\"),\"\",J!A138))","v":""},{"$f":"IF(AND(J!A138=\"\",J!B138=\"\"),\"\",J!B138)","v":""},null,null,null,"",null,null,null,null,"",null,"",null,"",null,"",null,9000]
[null,{"$f":"J!E139","v":139},{"$f":"IF(AND(J!A139=\"\",J!B139<>\"\"),\"NESTARTOVALO\",IF(AND(J!A139=\"\",J!B139=\"\"),\"\",J!A139))","v":""},{"$f":"IF(AND(J!A139=\"\",J!B139=\"\"),\"\",J!B139)","v":""},null,null,null,"",null,null,null,null,"",null,"",null,"",null,"",null,9000]
[null,{"$f":"J!E140","v":140},{"$f":"IF(AND(J!A140=\"\",J!B140<>\"\"),\"NESTARTOVALO\",IF(AND(J!A140=\"\",J!B140=\"\"),\"\",J!A140))","v":""},{"$f":"IF(AND(J!A140=\"\",J!B140=\"\"),\"\",J!B140)","v":""},null,null,null,"",null,null,null,null,"",null,"",null,"",null,"",null,9000]
[null,{"$f":"J!E141","v":141},{"$f":"IF(AND(J!A141=\"\",J!B141<>\"\"),\"NESTARTOVALO\",IF(AND(J!A141=\"\",J!B141=\"\"),\"\",J!A141))","v":""},{"$f":"IF(AND(J!A141=\"\",J!B141=\"\"),\"\",J!B141)","v":""},null,null,null,"",null,null,null,null,"",null,"",null,"",null,"",null,9000]
[null,{"$f":"J!E142","v":142},{"$f":"IF(AND(J!A142=\"\",J!B142<>\"\"),\"NESTARTOVALO\",IF(AND(J!A142=\"\",J!B142=\"\"),\"\",J!A142))","v":""},{"$f":"IF(AND(J!A142=\"\",J!B142=\"\"),\"\",J!B142)","v":""},null,null,null,"",null,null,null,null,"",null,"",null,"",null,"",null,9000]
[null,{"$f":"J!E143","v":143},{"$f":"IF(AND(J!A143=\"\",J!B143<>\"\"),\"NESTARTOVALO\",IF(AND(J!A143=\"\",J!B143=\"\"),\"\",J!A143))","v":""},{"$f":"IF(AND(J!A143=\"\",J!B143=\"\"),\"\",J!B143)","v":""},null,null,null,"",null,null,null,null,"",null,"",null,"",null,"",null,9000]
[null,{"$f":"J!E144","v":144},{"$f":"IF(AND(J!A144=\"\",J!B144<>\"\"),\"NESTARTOVALO\",IF(AND(J!A144=\"\",J!B144=\"\"),\"\",J!A144))","v":""},{"$f":"IF(AND(J!A144=\"\",J!B144=\"\"),\"\",J!B144)","v":""},null,null,null,"",null,null,null,null,"",null,"",null,"",null,"",null,9000]
[null,{"$f":"J!E145","v":145},{"$f":"IF(AND(J!A145=\"\",J!B145<>\"\"),\"NESTARTOVALO\",IF(AND(J!A145=\"\",J!B145=\"\"),\"\",J!A145))","v":""},{"$f":"IF(AND(J!A145=\"\",J!B145=\"\"),\"\",J!B145)","v":""},null,null,null,"",null,null,null,null,"",null,"",null,"",null,"",null,9000]
[null,{"$f":"J!E146","v":146},{"$f":"IF(AND(J!A146=\"\",J!B146<>\"\"),\"NESTARTOVALO\",IF(AND(J!A146=\"\",J!B146=\"\"),\"\",J!A146))","v":""},{"$f":"IF(AND(J!A146=\"\",J!B146=\"\"),\"\",J!B146)","v":""},null,null,null,{"$f":"IF($C150=\"\",\"\",IF(OR($E150=\"DNF\",$F150=\"DNF\",$G150=\"DNF\",AND($E150=\"\",$F150=\"\",$G150=\"\")),\"DNF\",IF(OR($E150=\"NP\",$F150=\"NP\",$G150=\"NP\"),\"NP\",IF(ISERROR(MEDIAN($E150:$G150)),\"DNF\",IF(OR($E150=\"X\",$F150=\"X\",$G150=\"X\",$E150=\"\",$F150=\"\",$G150=\"\",$E150=\"x\",$F150=\"x\",$G150=\"x\"),MAX($E150:$G150),MEDIAN($E150:$G150))))))","v":""},null,null,null,null,{"$f":"IF($C150=\"\",\"\",IF(OR($J150=\"DNF\",$K150=\"DNF\",$L150=\"DNF\",AND($J150=\"\",$K150=\"\",$L150=\"\")),\"DNF\",IF(OR($J150=\"NP\",$K150=\"NP\",$L150=\"NP\"),\"NP\",IF(ISERROR(MEDIAN($J150:$L150)),\"DNF\",IF(OR($J150=\"X\",$K150=\"X\",$L150=\"X\",$J150=\"\",$K150=\"\",$L150=\"\",$J150=\"x\",$K150=\"x\",$L150=\"x\"),MAX($J150:$L150),MEDIAN($J150:$L150))))))","v":""},null,{"$f":"IF(C150=\"\",\"\",IF(OR(AND(H150=\"NP\",M150=\"NP\"),AND(H150=\"DNF\",M150=\"DNF\")),H150,IF(AND(H150=\"NP\",M150=\"DNF\"),H150,IF(AND(H150=\"DNF\",M150=\"NP\"),M150,MIN(H150,M150)))))","v":""},null,"",null,"",null,9000]
[null,{"$f":"J!E147","v":147},{"$f":"IF(AND(J!A147=\"\",J!B147<>\"\"),\"NESTARTOVALO\",IF(AND(J!A147=\"\",J!B147=\"\"),\"\",J!A147))","v":""},{"$f":"IF(AND(J!A147=\"\",J!B147=\"\"),\"\",J!B147)","v":""},null,null,null,"",null,null,null,null,"",null,"",null,"",null,"",null,9000]
[null,{"$f":"J!E148","v":148},{"$f":"IF(AND(J!A148=\"\",J!B148<>\"\"),\"NESTARTOVALO\",IF(AND(J!A148=\"\",J!B148=\"\"),\"\",J!A148))","v":""},{"$f":"IF(AND(J!A148=\"\",J!B148=\"\"),\"\",J!B148)","v":""},null,null,null,"",null,null,null,null,"",null,"",null,"",null,"",null,9000]
[null,{"$f":"J!E149","v":149},{"$f":"IF(AND(J!A149=\"\",J!B149<>\"\"),\"NESTARTOVALO\",IF(AND(J!A149=\"\",J!B149=\"\"),\"\",J!A149))","v":""},{"$f":"IF(AND(J!A149=\"\",J!B149=\"\"),\"\",J!B149)","v":""},null,null,null,"",null,null,null,null,"",null,"",null,"",null,"",null,9000]
[null,{"$f":"J!E150","v":150},{"$f":"IF(AND(J!A150=\"\",J!B150<>\"\"),\"NESTARTOVALO\",IF(AND(J!A150=\"\",J!B150=\"\"),\"\",J!A150))","v":""},{"$f":"IF(AND(J!A150=\"\",J!B150=\"\"),\"\",J!B150)","v":""},null,null,null,"",null,null,null,null,"",null,"",null,"",null,"",null,9000]
[null,{"$f":"J!E151","v":151},{"$f":"IF(AND(J!A151=\"\",J!B151<>\"\"),\"NESTARTOVALO\",IF(AND(J!A151=\"\",J!B151=\"\"),\"\",J!A151))","v":""},{"$f":"IF(AND(J!A151=\"\",J!B151=\"\"),\"\",J!B151)","v":""},null,null,null,"",null,null,null,null,"",null,"",null,"",null,"",null,9000]
[null,{"$f":"J!E152","v":152},{"$f":"IF(AND(J!A152=\"\",J!B152<>\"\"),\"NESTARTOVALO\",IF(AND(J!A152=\"\",J!B152=\"\"),\"\",J!A152))","v":""},{"$f":"IF(AND(J!A152=\"\",J!B152=\"\"),\"\",J!B152)","v":""},null,null,null,"",null,null,null,null,"",null,"",null,"",null,"",null,9000]
[null,{"$f":"J!E153","v":153},{"$f":"IF(AND(J!A153=\"\",J!B153<>\"\"),\"NESTARTOVALO\",IF(AND(J!A153=\"\",J!B153=\"\"),\"\",J!A153))","v":""},{"$f":"IF(AND(J!A153=\"\",J!B153=\"\"),\"\",J!B153)","v":""},null,null,null,"",null,null,null,null,"",null,"",null,"",null,"",null,9000]
[null,{"$f":"J!E154","v":154},{"$f":"IF(AND(J!A154=\"\",J!B154<>\"\"),\"NESTARTOVALO\",IF(AND(J!A154=\"\",J!B154=\"\"),\"\",J!A154))","v":""},{"$f":"IF(AND(J!A154=\"\",J!B154=\"\"),\"\",J!B154)","v":""},null,null,null,"",null,null,null,null,"",null,"",null,"",null,"",null,9000]
[null,{"$f":"J!E155","v":155},{"$f":"IF(AND(J!A155=\"\",J!B155<>\"\"),\"NESTARTOVALO\",IF(AND(J!A155=\"\",J!B155=\"\"),\"\",J!A155))","v":""},{"$f":"IF(AND(J!A155=\"\",J!B155=\"\"),\"\",J!B155)","v":""},null,null,null,"",null,null,null,null,"",null,"",null,"",null,"",null,9000]
[null,{"$f":"J!E156","v":156},{"$f":"IF(AND(J!A156=\"\",J!B156<>\"\"),\"NESTARTOVALO\",IF(AND(J!A156=\"\",J!B156=\"\"),\"\",J!A156))","v":""},{"$f":"IF(AND(J!A156=\"\",J!B156=\"\"),\"\",J!B156)","v":""},null,null,null,"",null,null,null,null,"",null,"",null,"",null,"",null,9000]
[null,{"$f":"J!E157","v":157},{"$f":"IF(AND(J!A157=\"\",J!B157<>\"\"),\"NESTARTOVALO\",IF(AND(J!A157=\"\",J!B157=\"\"),\"\",J!A157))","v":""},{"$f":"IF(AND(J!A157=\"\",J!B157=\"\"),\"\",J!B157)","v":""},null,null,null,"",null,null,null,null,"",null,"",null,"",null,"",null,9000]
[null,{"$f":"J!E158","v":158},{"$f":"IF(AND(J!A158=\"\",J!B158<>\"\"),\"NESTARTOVALO\",IF(AND(J!A158=\"\",J!B158=\"\"),\"\",J!A158))","v":""},{"$f":"IF(AND(J!A158=\"\",J!B158=\"\"),\"\",J!B158)","v":""},null,null,null,"",null,null,null,null,"",null,"",null,"",null,"",null,9000]
[null,{"$f":"J!E159","v":159},{"$f":"IF(AND(J!A159=\"\",J!B159<>\"\"),\"NESTARTOVALO\",IF(AND(J!A159=\"\",J!B159=\"\"),\"\",J!A159))","v":""},{"$f":"IF(AND(J!A159=\"\",J!B159=\"\"),\"\",J!B159)","v":""},null,null,null,"",null,null,null,null,"",null,"",null,"",null,"",null,9000]
[null,{"$f":"J!E160","v":160},{"$f":"IF(AND(J!A160=\"\",J!B160<>\"\"),\"NESTARTOVALO\",IF(AND(J!A160=\"\",J!B160=\"\"),\"\",J!A160))","v":""},{"$f":"IF(AND(J!A160=\"\",J!B160=\"\"),\"\",J!B160)","v":""},null,null,null,"",null,null,null,null,"",null,"",null,"",null,"",null,9000]
[null,{"$f":"J!E161","v":161},{"$f":"IF(AND(J!A161=\"\",J!B161<>\"\"),\"NESTARTOVALO\",IF(AND(J!A161=\"\",J!B161=\"\"),\"\",J!A161))","v":""},{"$f":"IF(AND(J!A161=\"\",J!B161=\"\"),\"\",J!B161)","v":""},null,null,null,"",null,null,null,null,"",null,"",null,"",null,"",null,9000]
[null,{"$f":"J!E162","v":162},{"$f":"IF(AND(J!A162=\"\",J!B162<>\"\"),\"NESTARTOVALO\",IF(AND(J!A162=\"\",J!B162=\"\"),\"\",J!A162))","v":""},{"$f":"IF(AND(J!A162=\"\",J!B162=\"\"),\"\",J!B162)","v":""},null,null,null,"",null,null,null,null,"",null,"",null,"",null,"",null,9000]
[null,{"$f":"J!E163","v":163},{"$f":"IF(AND(J!A163=\"\",J!B163<>\"\"),\"NESTARTOVALO\",IF(AND(J!A163=\"\",J!B163=\"\"),\"\",J!A163))","v":""},{"$f":"IF(AND(J!A163=\"\",J!B163=\"\"),\"\",J!B163)","v":""},null,null,null,"",null,null,null,null,"",null,"",null,"",null,"",null,9000]
[null,{"$f":"J!E164","v":164},{"$f":"IF(AND(J!A164=\"\",J!B164<>\"\"),\"NESTARTOVALO\",IF(AND(J!A164=\"\",J!B164=\"\"),\"\",J!A164))","v":""},{"$f":"IF(AND(J!A164=\"\",J!B164=\"\"),\"\",J!B164)","v":""},null,null,null,"",null,null,null,null,"",null,"",null,"",null,"",null,9000]
[null,{"$f":"J!E165","v":165},{"$f":"IF(AND(J!A165=\"\",J!B165<>\"\"),\"NESTARTOVALO\",IF(AND(J!A165=\"\",J!B165=\"\"),\"\",J!A165))","v":""},{"$f":"IF(AND(J!A165=\"\",J!B165=\"\"),\"\",J!B165)","v":""},null,null,null,"",null,null,null,null,"",null,"",null,"",null,"",null,9000]
[null,{"$f":"J!E166","v":166},{"$f":"IF(AND(J!A166=\"\",J!B166<>\"\"),\"NESTARTOVALO\",IF(AND(J!A166=\"\",J!B166=\"\"),\"\",J!A166))","v":""},{"$f":"IF(AND(J!A166=\"\",J!B166=\"\"),\"\",J!B166)","v":""},null,null,null,"",null,null,null,null,"",null,"",null,"",null,"",null,9000]
[null,{"$f":"J!E167","v":167},{"$f":"IF(AND(J!A167=\"\",J!B167<>\"\"),\"NESTARTOVALO\",IF(AND(J!A167=\"\",J!B167=\"\"),\"\",J!A167))","v":""},{"$f":"IF(AND(J!A167=\"\",J!B167=\"\"),\"\",J!B167)","v":""},null,null,null,"",null,null,null,null,"",null,"",null,"",null,"",null,9000]
[null,{"$f":"J!E168","v":168},{"$f":"IF(AND(J!A168=\"\",J!B168<>\"\"),\"NESTARTOVALO\",IF(AND(J!A168=\"\",J!B168=\"\"),\"\",J!A168))","v":""},{"$f":"IF(AND(J!A168=\"\",J!B168=\"\"),\"\",J!B168)","v":""},null,null,null,"",null,null,null,null,"",null,"",null,"",null,"",null,9000]
[null,{"$f":"J!E169","v":169},{"$f":"IF(AND(J!A169=\"\",J!B169<>\"\"),\"NESTARTOVALO\",IF(AND(J!A169=\"\",J!B169=\"\"),\"\",J!A169))","v":""},{"$f":"IF(AND(J!A169=\"\",J!B169=\"\"),\"\",J!B169)","v":""},null,null,null,"",null,null,null,null,"",null,"",null,"",null,"",null,9000]
[null,{"$f":"J!E170","v":170},{"$f":"IF(AND(J!A170=\"\",J!B170<>\"\"),\"NESTARTOVALO\",IF(AND(J!A170=\"\",J!B170=\"\"),\"\",J!A170))","v":""},{"$f":"IF(AND(J!A170=\"\",J!B170=\"\"),\"\",J!B170)","v":""},null,null,null,"",null,null,null,null,"",null,"",null,"",null,"",null,9000]
[null,{"$f":"J!E171","v":171},{"$f":"IF(AND(J!A171=\"\",J!B171<>\"\"),\"NESTARTOVALO\",IF(AND(J!A171=\"\",J!B171=\"\"),\"\",J!A171))","v":""},{"$f":"IF(AND(J!A171=\"\",J!B171=\"\"),\"\",J!B171)","v":""},null,null,null,"",null,null,null,null,"",null,"",null,"",null,"",null,9000]
[null,{"$f":"J!E172","v":172},{"$f":"IF(AND(J!A172=\"\",J!B172<>\"\"),\"NESTARTOVALO\",IF(AND(J!A172=\"\",J!B172=\"\"),\"\",J!A172))","v":""},{"$f":"IF(AND(J!A172=\"\",J!B172=\"\"),\"\",J!B172)","v":""},null,null,null,"",null,null,null,null,"",null,"",null,"",null,"",null,9000]
[null,{"$f":"J!E173","v":173},{"$f":"IF(AND(J!A173=\"\",J!B173<>\"\"),\"NESTARTOVALO\",IF(AND(J!A173=\"\",J!B173=\"\"),\"\",J!A173))","v":""},{"$f":"IF(AND(J!A173=\"\",J!B173=\"\"),\"\",J!B173)","v":""},null,null,null,"",null,null,null,null,"",null,"",null,"",null,"",null,9000]
[null,{"$f":"J!E174","v":174},{"$f":"IF(AND(J!A174=\"\",J!B174<>\"\"),\"NESTARTOVALO\",IF(AND(J!A174=\"\",J!B174=\"\"),\"\",J!A174))","v":""},{"$f":"IF(AND(J!A174=\"\",J!B174=\"\"),\"\",J!B174)","v":""},null,null,null,"",null,null,null,null,"",null,"",null,"",null,"",null,9000]
[null,{"$f":"J!E175","v":175},{"$f":"IF(AND(J!A175=\"\",J!B175<>\"\"),\"NESTARTOVALO\",IF(AND(J!A175=\"\",J!B175=\"\"),\"\",J!A175))","v":""},{"$f":"IF(AND(J!A175=\"\",J!B175=\"\"),\"\",J!B175)","v":""},null,null,null,"",null,null,null,null,"",null,"",null,"",null,"",null,9000]

{"sheet":"PJ-VJ","index":10,"n_rows":54,"n_cols":21,"rows_kept":54,"cut":false,"hidden":false,"merged":[[0,1,0,14],[2,4,2,7],[2,9,2,12]]}
[null,"Běh na 100m s překážkami - J - Zadání výsledků"]
[null,null,{"$f":"COUNTA(C5:C54)","v":0}]
[null,null,{"$f":"Start!$D$5","v":"dorostenky"},null,"I.",null,null,null,null,"II."]
[null,"St.č.","Jméno","kolektiv",1,2,3,"Čas",null,1,2,3,"Čas",null,"C.",null,"P.",null,"B.",null,"X."]
[null,"J1",null,null,null,null,null,{"$f":"IF($C5=\"\",\"\",IF(OR($E5=\"DNF\",$F5=\"DNF\",$G5=\"DNF\",AND($E5=\"\",$F5=\"\",$G5=\"\")),\"DNF\",IF(OR($E5=\"NP\",$F5=\"NP\",$G5=\"NP\"),\"NP\",IF(ISERROR(MEDIAN($E5:$G5)),\"DNF\",IF(OR($E5=\"X\",$F5=\"X\",$G5=\"X\",$E5=\"\",$F5=\"\",$G5=\"\",$E5=\"x\",$F5=\"x\",$G5=\"x\"),MAX($E5:$G5),MEDIAN($E5:$G5))))))","v":""},null,null,null,null,{"$f":"IF($C5=\"\",\"\",IF(OR($J5=\"DNF\",$K5=\"DNF\",$L5=\"DNF\",AND($J5=\"\",$K5=\"\",$L5=\"\")),\"DNF\",IF(OR($J5=\"NP\",$K5=\"NP\",$L5=\"NP\"),\"NP\",IF(ISERROR(MEDIAN($J5:$L5)),\"DNF\",IF(OR($J5=\"X\",$K5=\"X\",$L5=\"X\",$J5=\"\",$K5=\"\",$L5=\"\",$J5=\"x\",$K5=\"x\",$L5=\"x\"),MAX($J5:$L5),MEDIAN($J5:$L5))))))","v":""},null,{"$f":"IF(C5=\"\",\"\",IF(OR(AND(H5=\"NP\",M5=\"NP\"),AND(H5=\"DNF\",M5=\"DNF\")),H5,IF(AND(H5=\"NP\",M5=\"DNF\"),H5,IF(AND(H5=\"DNF\",M5=\"NP\"),M5,MIN(H5,M5)))))","v":""},null,{"$f":"IF(C5=\"\",\"\",IF(OR(O5=\"NP\",O5=\"DNF\"),O5,RANK(O5,O$5:O$28,1)))","v":""},null,{"$f":"IF(C5=\"\",\"\",IF(O5=\"NP\",MAX(Q$5:Q$28)+1,IF(O5=\"DNF\",MAX(Q$5:Q$28)+COUNTIF(Q$5:Q$28,\"NP\")+1,RANK(O5,O$5:O$28,1))))","v":""},null,{"$f":"IF($C5=\"\",9000,MAX(H5,M5)+(COUNTIF($H5:$H5,\"NP\")*600)+(COUNTIF($M5:$M5,\"NP\")*600)+(COUNTIF($H5:$H5,\"DNF\")*3600)+(COUNTIF($M5:$M5,\"DNF\")*3600))","v":9000}]
[null,"J2",null,null,null,null,null,{"$f":"IF($C6=\"\",\"\",IF(OR($E6=\"DNF\",$F6=\"DNF\",$G6=\"DNF\",AND($E6=\"\",$F6=\"\",$G6=\"\")),\"DNF\",IF(OR($E6=\"NP\",$F6=\"NP\",$G6=\"NP\"),\"NP\",IF(ISERROR(MEDIAN($E6:$G6)),\"DNF\",IF(OR($E6=\"X\",$F6=\"X\",$G6=\"X\",$E6=\"\",$F6=\"\",$G6=\"\",$E6=\"x\",$F6=\"x\",$G6=\"x\"),MAX($E6:$G6),MEDIAN($E6:$G6))))))","v":""},null,null,null,null,{"$f":"IF($C6=\"\",\"\",IF(OR($J6=\"DNF\",$K6=\"DNF\",$L6=\"DNF\",AND($J6=\"\",$K6=\"\",$L6=\"\")),\"DNF\",IF(OR($J6=\"NP\",$K6=\"NP\",$L6=\"NP\"),\"NP\",IF(ISERROR(MEDIAN($J6:$L6)),\"DNF\",IF(OR($J6=\"X\",$K6=\"X\",$L6=\"X\",$J6=\"\",$K6=\"\",$L6=\"\",$J6=\"x\",$K6=\"x\",$L6=\"x\"),MAX($J6:$L6),MEDIAN($J6:$L6))))))","v":""},null,{"$f":"IF(C6=\"\",\"\",IF(OR(AND(H6=\"NP\",M6=\"NP\"),AND(H6=\"DNF\",M6=\"DNF\")),H6,IF(AND(H6=\"NP\",M6=\"DNF\"),H6,IF(AND(H6=\"DNF\",M6=\"NP\"),M6,MIN(H6,M6)))))","v":""},null,"",null,"",null,{"$f":"IF($C6=\"\",9000,MAX(H6,M6)+(COUNTIF($H6:$H6,\"NP\")*600)+(COUNTIF($M6:$M6,\"NP\")*600)+(COUNTIF($H6:$H6,\"DNF\")*3600)+(COUNTIF($M6:$M6,\"DNF\")*3600))","v":9000}]
[null,"J3",null,null,null,null,null,"",null,null,null,null,"",null,"",null,"",null,"",null,9000]
[null,"J4",null,null,null,null,null,"",null,null,null,null,"",null,"",null,"",null,"",null,9000]
[null,"J5",null,null,null,null,null,"",null,null,null,null,"",null,"",null,"",null,"",null,9000]
[null,"J6",null,null,null,null,null,"",null,null,null,null,"",null,"",null,"",null,"",null,9000]
[null,"J7",null,null,null,null,null,"",null,null,null,null,"",null,"",null,"",null,"",null,9000]
[null,"J8",null,null,null,null,null,"",null,null,null,null,"",null,"",null,"",null,"",null,9000]
[null,"J9",null,null,null,null,null,"",null,null,null,null,"",null,"",null,"",null,"",null,9000]
[null,"J10",null,null,null,null,null,"",null,null,null,null,"",null,"",null,"",null,"",null,9000]
[null,"J11",null,null,null,null,null,"",null,null,null,null,"",null,"",null,"",null,"",null,9000]
[null,"J12",null,null,null,null,null,"",null,null,null,null,"",null,"",null,"",null,"",null,9000]
[null,"J13",null,null,null,null,null,"",null,null,null,null,"",null,"",null,"",null,"",null,9000]
[null,"J14",null,null,null,null,null,"",null,null,null,null,"",null,"",null,"",null,"",null,9000]
[null,"J15",null,null,null,null,null,"",null,null,null,null,"",null,"",null,"",null,"",null,9000]
[null,"J16",null,null,null,null,null,"",null,null,null,null,"",null,"",null,"",null,"",null,9000]
[null,"J17",null,null,null,null,null,"",null,null,null,null,"",null,"",null,"",null,"",null,9000]
[null,"J18",null,null,null,null,null,"",null,null,null,null,"",null,"",null,"",null,"",null,9000]
[null,"J19",null,null,null,null,null,"",null,null,null,null,"",null,"",null,"",null,"",null,9000]
[null,"J20",null,null,null,null,null,"",null,null,null,null,"",null,"",null,"",null,"",null,9000]
[null,"J21",null,null,null,null,null,"",null,null,null,null,"",null,"",null,"",null,"",null,9000]
[null,"J22",null,null,null,null,null,"",null,null,null,null,"",null,"",null,"",null,"",null,9000]
[null,"J23",null,null,null,null,null,"",null,null,null,null,"",null,"",null,"",null,"",null,9000]
[null,"J24",null,null,null,null,null,"",null,null,null,null,"",null,"",null,"",null,"",null,9000]
[null,"J25",null,null,null,null,null,"",null,null,null,null,"",null,{"$f":"IF(C29=\"\",\"\",IF(OR(AND(H29=\"NP\",M29=\"NP\"),AND(H29=\"DNF\",M29=\"DNF\")),H29,IF(AND(H29=\"NP\",M29=\"DNF\"),H29,IF(AND(H29=\"DNF\",M29=\"NP\"),M29,MIN(H29,M29)))))","v":""},null,"",null,"",null,{"$f":"IF($C29=\"\",9000,MAX(H29,M29)+(COUNTIF($H29:$H29,\"NP\")*600)+(COUNTIF($M29:$M29,\"NP\")*600)+(COUNTIF($H29:$H29,\"DNF\")*3600)+(COUNTIF($M29:$M29,\"DNF\")*3600))","v":9000}]
[null,"J26",null,null,null,null,null,"",null,null,null,null,"",null,"",null,"",null,"",null,9000]
[null,"J27",null,null,null,null,null,"",null,null,null,null,"",null,"",null,"",null,"",null,9000]
[null,"J28",null,null,null,null,null,"",null,null,null,null,"",null,"",null,"",null,"",null,9000]
[null,"J29",null,null,null,null,null,"",null,null,null,null,"",null,"",null,"",null,"",null,9000]
[null,"J30",null,null,null,null,null,"",null,null,null,null,"",null,"",null,"",null,"",null,9000]
[null,"J31",null,null,null,null,null,"",null,null,null,null,"",null,"",null,"",null,"",null,9000]
[null,"J32",null,null,null,null,null,"",null,null,null,null,"",null,"",null,"",null,"",null,9000]
[null,"J33",null,null,null,null,null,"",null,null,null,null,"",null,"",null,{"$f":"IF(C37=\"\",\"\",IF(OR(O37=\"NP\",O37=\"DNF\"),O37,RANK(O37,O$5:O$28,1)))","v":""},null,{"$f":"IF(C37=\"\",\"\",IF(O37=\"NP\",MAX(Q$5:Q$28)+1,IF(O37=\"DNF\",MAX(Q$5:Q$28)+COUNTIF(Q$5:Q$28,\"NP\")+1,RANK(O37,O$5:O$28,1))))","v":""},null,9000]
[null,"J34",null,null,null,null,null,"",null,null,null,null,"",null,"",null,"",null,"",null,9000]
[null,"J35",null,null,null,null,null,"",null,null,null,null,"",null,"",null,"",null,"",null,9000]
[null,"J36",null,null,null,null,null,"",null,null,null,null,"",null,"",null,"",null,"",null,9000]
[null,"J37",null,null,null,null,null,"",null,null,null,null,"",null,"",null,"",null,"",null,9000]
[null,"J38",null,null,null,null,null,"",null,null,null,null,"",null,"",null,"",null,"",null,9000]
[null,"J39",null,null,null,null,null,"",null,null,null,null,"",null,"",null,"",null,"",null,9000]
[null,"J40",null,null,null,null,null,"",null,null,null,null,"",null,"",null,"",null,"",null,9000]
[null,"J41",null,null,null,null,null,"",null,null,null,null,"",null,"",null,"",null,"",null,9000]
[null,"J42",null,null,null,null,null,"",null,null,null,null,"",null,"",null,"",null,"",null,9000]
[null,"J43",null,null,null,null,null,"",null,null,null,null,"",null,"",null,"",null,"",null,9000]
[null,"J44",null,null,null,null,null,"",null,null,null,null,"",null,"",null,"",null,"",null,9000]
[null,"J45",null,null,null,null,null,"",null,null,null,null,"",null,"",null,"",null,"",null,9000]
[null,"J46",null,null,null,null,null,"",null,null,null,null,"",null,"",null,"",null,"",null,9000]
[null,"J47",null,null,null,null,null,"",null,null,null,null,"",null,{"$f":"IF(C51=\"\",\"\",IF(OR(AND(H51=\"NP\",M51=\"NP\"),AND(H51=\"DNF\",M51=\"DNF\")),H51,IF(AND(H51=\"NP\",M51=\"DNF\"),H51,IF(AND(H51=\"DNF\",M51=\"NP\"),M51,MIN(H51,M51)))))","v":""},null,"",null,"",null,{"$f":"IF($C51=\"\",9000,MAX(H51,M51)+(COUNTIF($H51:$H51,\"NP\")*600)+(COUNTIF($M51:$M51,\"NP\")*600)+(COUNTIF($H51:$H51,\"DNF\")*3600)+(COUNTIF($M51:$M51,\"DNF\")*3600))","v":9000}]
[null,"J48",null,null,null,null,null,"",null,null,null,null,"",null,{"$f":"IF(C52=\"\",\"\",IF(OR(AND(H52=\"NP\",M52=\"NP\"),AND(H52=\"DNF\",M52=\"DNF\")),H52,IF(AND(H52=\"NP\",M52=\"DNF\"),H52,IF(AND(H52=\"DNF\",M52=\"NP\"),M52,MIN(H52,M52)))))","v":""},null,"",null,"",null,{"$f":"IF($C52=\"\",9000,MAX(H52,M52)+(COUNTIF($H52:$H52,\"NP\")*600)+(COUNTIF($M52:$M52,\"NP\")*600)+(COUNTIF($H52:$H52,\"DNF\")*3600)+(COUNTIF($M52:$M52,\"DNF\")*3600))","v":9000}]
[null,"J49",null,null,null,null,null,"",null,null,null,null,"",null,{"$f":"IF(C53=\"\",\"\",IF(OR(AND(H53=\"NP\",M53=\"NP\"),AND(H53=\"DNF\",M53=\"DNF\")),H53,IF(AND(H53=\"NP\",M53=\"DNF\"),H53,IF(AND(H53=\"DNF\",M53=\"NP\"),M53,MIN(H53,M53)))))","v":""},null,"",null,"",null,{"$f":"IF($C53=\"\",9000,MAX(H53,M53)+(COUNTIF($H53:$H53,\"NP\")*600)+(COUNTIF($M53:$M53,\"NP\")*600)+(COUNTIF($H53:$H53,\"DNF\")*3600)+(COUNTIF($M53:$M53,\"DNF\")*3600))","v":9000}]
[null,"J50",null,null,null,null,null,"",null,null,null,null,"",null,{"$f":"IF(C54=\"\",\"\",IF(OR(AND(H54=\"NP\",M54=\"NP\"),AND(H54=\"DNF\",M54=\"DNF\")),H54,IF(AND(H54=\"NP\",M54=\"DNF\"),H54,IF(AND(H54=\"DNF\",M54=\"NP\"),M54,MIN(H54,M54)))))","v":""},null,"",null,"",null,{"$f":"IF($C54=\"\",9000,MAX(H54,M54)+(COUNTIF($H54:$H54,\"NP\")*600)+(COUNTIF($M54:$M54,\"NP\")*600)+(COUNTIF($H54:$H54,\"DNF\")*3600)+(COUNTIF($M54:$M54,\"DNF\")*3600))","v":9000}]

{"sheet":"PJ-VAll","index":11,"n_rows":229,"n_cols":21,"rows_kept":229,"cut":false,"hidden":false,"merged":[[0,1,0,14],[2,4,2,7],[2,9,2,12]]}
[null,"Běh na 100m s překážkami - Zadání výsledků - All"]
[]
[null,null,{"$f":"Start!$D$5","v":"dorostenky"},null,"I.",null,null,null,null,"II."]
[null,"St.č.","Jméno","kolektiv",1,2,3,"Čas",null,1,2,3,"Čas",null,"C.",null,"P.",null,"B.",null,"X."]
[null,{"$f":"J!E1","v":1},{"$f":"IF(AND(J!A1=\"\",J!B1<>\"\"),\"NESTARTOVALO\",IF(AND(J!A1=\"\",J!B1=\"\"),\"\",J!A1))","v":"Vraspírová Valerie"},{"$f":"IF(AND(J!A1=\"\",J!B1=\"\"),\"\",J!B1)","v":"Kamenec"},null,null,null,{"$f":"IF($C5=\"\",\"\",IF(OR($E5=\"DNF\",$F5=\"DNF\",$G5=\"DNF\",AND($E5=\"\",$F5=\"\",$G5=\"\")),\"DNF\",IF(OR($E5=\"NP\",$F5=\"NP\",$G5=\"NP\"),\"NP\",IF(ISERROR(MEDIAN($E5:$G5)),\"DNF\",IF(OR($E5=\"X\",$F5=\"X\",$G5=\"X\",$E5=\"\",$F5=\"\",$G5=\"\",$E5=\"x\",$F5=\"x\",$G5=\"x\"),MAX($E5:$G5),MEDIAN($E5:$G5))))))","v":"DNF"},null,null,null,null,{"$f":"IF($C5=\"\",\"\",IF(OR($J5=\"DNF\",$K5=\"DNF\",$L5=\"DNF\",AND($J5=\"\",$K5=\"\",$L5=\"\")),\"DNF\",IF(OR($J5=\"NP\",$K5=\"NP\",$L5=\"NP\"),\"NP\",IF(ISERROR(MEDIAN($J5:$L5)),\"DNF\",IF(OR($J5=\"X\",$K5=\"X\",$L5=\"X\",$J5=\"\",$K5=\"\",$L5=\"\",$J5=\"x\",$K5=\"x\",$L5=\"x\"),MAX($J5:$L5),MEDIAN($J5:$L5))))))","v":"DNF"},null,{"$f":"IF(C5=\"\",\"\",IF(OR(AND(H5=\"NP\",M5=\"NP\"),AND(H5=\"DNF\",M5=\"DNF\")),H5,IF(AND(H5=\"NP\",M5=\"DNF\"),H5,IF(AND(H5=\"DNF\",M5=\"NP\"),M5,MIN(H5,M5)))))","v":"DNF"},null,{"$f":"IF(C5=\"\",\"\",IF(OR(O5=\"NP\",O5=\"DNF\"),O5,RANK(O5,O$5:O$178,1)))","v":"DNF"},null,{"$f":"IF(C5=\"\",\"\",IF(O5=\"NP\",MAX(Q$5:Q$178)+1,IF(O5=\"DNF\",MAX(Q$5:Q$178)+COUNTIF(Q$5:Q$178,\"NP\")+1,RANK(O5,O$5:O$178,1))))","v":1},null,{"$f":"IF($C5=\"\",9000,MAX(H5,M5)+(COUNTIF($H5:$H5,\"NP\")*600)+(COUNTIF($M5:$M5,\"NP\")*600)+(COUNTIF($H5:$H5,\"DNF\")*3600)+(COUNTIF($M5:$M5,\"DNF\")*3600))","v":7200}]
[null,{"$f":"J!E2","v":2},{"$f":"IF(AND(J!A2=\"\",J!B2<>\"\"),\"NESTARTOVALO\",IF(AND(J!A2=\"\",J!B2=\"\"),\"\",J!A2))","v":"Štveráková Kristýna"},{"$f":"IF(AND(J!A2=\"\",J!B2=\"\"),\"\",J!B2)","v":"Lukavice"},null,null,null,{"$f":"IF($C6=\"\",\"\",IF(OR($E6=\"DNF\",$F6=\"DNF\",$G6=\"DNF\",AND($E6=\"\",$F6=\"\",$G6=\"\")),\"DNF\",IF(OR($E6=\"NP\",$F6=\"NP\",$G6=\"NP\"),\"NP\",IF(ISERROR(MEDIAN($E6:$G6)),\"DNF\",IF(OR($E6=\"X\",$F6=\"X\",$G6=\"X\",$E6=\"\",$F6=\"\",$G6=\"\",$E6=\"x\",$F6=\"x\",$G6=\"x\"),MAX($E6:$G6),MEDIAN($E6:$G6))))))","v":"DNF"},null,null,null,null,{"$f":"IF($C6=\"\",\"\",IF(OR($J6=\"DNF\",$K6=\"DNF\",$L6=\"DNF\",AND($J6=\"\",$K6=\"\",$L6=\"\")),\"DNF\",IF(OR($J6=\"NP\",$K6=\"NP\",$L6=\"NP\"),\"NP\",IF(ISERROR(MEDIAN($J6:$L6)),\"DNF\",IF(OR($J6=\"X\",$K6=\"X\",$L6=\"X\",$J6=\"\",$K6=\"\",$L6=\"\",$J6=\"x\",$K6=\"x\",$L6=\"x\"),MAX($J6:$L6),MEDIAN($J6:$L6))))))","v":"DNF"},null,{"$f":"IF(C6=\"\",\"\",IF(OR(AND(H6=\"NP\",M6=\"NP\"),AND(H6=\"DNF\",M6=\"DNF\")),H6,IF(AND(H6=\"NP\",M6=\"DNF\"),H6,IF(AND(H6=\"DNF\",M6=\"NP\"),M6,MIN(H6,M6)))))","v":"DNF"},null,"DNF",null,1,null,{"$f":"IF($C6=\"\",9000,MAX(H6,M6)+(COUNTIF($H6:$H6,\"NP\")*600)+(COUNTIF($M6:$M6,\"NP\")*600)+(COUNTIF($H6:$H6,\"DNF\")*3600)+(COUNTIF($M6:$M6,\"DNF\")*3600))","v":7200}]
[null,{"$f":"J!E3","v":3},{"$f":"IF(AND(J!A3=\"\",J!B3<>\"\"),\"NESTARTOVALO\",IF(AND(J!A3=\"\",J!B3=\"\"),\"\",J!A3))","v":"Zachová Lenka"},{"$f":"IF(AND(J!A3=\"\",J!B3=\"\"),\"\",J!B3)","v":"Lubná"},null,null,null,"DNF",null,null,null,null,"DNF",null,"DNF",null,"DNF",null,1,null,7200]
[null,{"$f":"J!E4","v":4},{"$f":"IF(AND(J!A4=\"\",J!B4<>\"\"),\"NESTARTOVALO\",IF(AND(J!A4=\"\",J!B4=\"\"),\"\",J!A4))","v":"Bubeníčková Denisa"},{"$f":"IF(AND(J!A4=\"\",J!B4=\"\"),\"\",J!B4)","v":"Skuteč"},null,null,null,"DNF",null,null,null,null,"DNF",null,"DNF",null,"DNF",null,1,null,7200]
[null,{"$f":"J!E5","v":5},{"$f":"IF(AND(J!A5=\"\",J!B5<>\"\"),\"NESTARTOVALO\",IF(AND(J!A5=\"\",J!B5=\"\"),\"\",J!A5))","v":"Kumulová Eliška"},{"$f":"IF(AND(J!A5=\"\",J!B5=\"\"),\"\",J!B5)","v":"Bystřec"},null,null,null,"DNF",null,null,null,null,"DNF",null,"DNF",null,"DNF",null,1,null,7200]
[null,{"$f":"J!E6","v":6},{"$f":"IF(AND(J!A6=\"\",J!B6<>\"\"),\"NESTARTOVALO\",IF(AND(J!A6=\"\",J!B6=\"\"),\"\",J!A6))","v":"Sýkorová Kateřina"},{"$f":"IF(AND(J!A6=\"\",J!B6=\"\"),\"\",J!B6)","v":"Letohrad Kunčice"},null,null,null,"DNF",null,null,null,null,"DNF",null,"DNF",null,"DNF",null,1,null,7200]
[null,{"$f":"J!E7","v":7},{"$f":"IF(AND(J!A7=\"\",J!B7<>\"\"),\"NESTARTOVALO\",IF(AND(J!A7=\"\",J!B7=\"\"),\"\",J!A7))","v":"Cejpová Adéla"},{"$f":"IF(AND(J!A7=\"\",J!B7=\"\"),\"\",J!B7)","v":"Kamenec"},null,null,null,"DNF",null,null,null,null,"DNF",null,"DNF",null,"DNF",null,1,null,7200]
[null,{"$f":"J!E8","v":8},{"$f":"IF(AND(J!A8=\"\",J!B8<>\"\"),\"NESTARTOVALO\",IF(AND(J!A8=\"\",J!B8=\"\"),\"\",J!A8))","v":"Marečková Pavla"},{"$f":"IF(AND(J!A8=\"\",J!B8=\"\"),\"\",J!B8)","v":"Lukavice"},null,null,null,"DNF",null,null,null,null,"DNF",null,"DNF",null,"DNF",null,1,null,7200]
[null,{"$f":"J!E9","v":9},{"$f":"IF(AND(J!A9=\"\",J!B9<>\"\"),\"NESTARTOVALO\",IF(AND(J!A9=\"\",J!B9=\"\"),\"\",J!A9))","v":"Lorencová Veronika"},{"$f":"IF(AND(J!A9=\"\",J!B9=\"\"),\"\",J!B9)","v":"Lubná"},null,null,null,"DNF",null,null,null,null,"DNF",null,"DNF",null,"DNF",null,1,null,7200]
[null,{"$f":"J!E10","v":10},{"$f":"IF(AND(J!A10=\"\",J!B10<>\"\"),\"NESTARTOVALO\",IF(AND(J!A10=\"\",J!B10=\"\"),\"\",J!A10))","v":"Jonášová Andrea"},{"$f":"IF(AND(J!A10=\"\",J!B10=\"\"),\"\",J!B10)","v":"Skuteč"},null,null,null,"DNF",null,null,null,null,"DNF",null,"DNF",null,"DNF",null,1,null,7200]
[null,{"$f":"J!E11","v":11},{"$f":"IF(AND(J!A11=\"\",J!B11<>\"\"),\"NESTARTOVALO\",IF(AND(J!A11=\"\",J!B11=\"\"),\"\",J!A11))","v":"Vaníčková Tereza"},{"$f":"IF(AND(J!A11=\"\",J!B11=\"\"),\"\",J!B11)","v":"Bystřec"},null,null,null,"DNF",null,null,null,null,"DNF",null,"DNF",null,"DNF",null,1,null,7200]
[null,{"$f":"J!E12","v":12},{"$f":"IF(AND(J!A12=\"\",J!B12<>\"\"),\"NESTARTOVALO\",IF(AND(J!A12=\"\",J!B12=\"\"),\"\",J!A12))","v":"Majvaldová Tereza"},{"$f":"IF(AND(J!A12=\"\",J!B12=\"\"),\"\",J!B12)","v":"Letohrad Kunčice"},null,null,null,"DNF",null,null,null,null,"DNF",null,"DNF",null,"DNF",null,1,null,7200]
[null,{"$f":"J!E13","v":13},{"$f":"IF(AND(J!A13=\"\",J!B13<>\"\"),\"NESTARTOVALO\",IF(AND(J!A13=\"\",J!B13=\"\"),\"\",J!A13))","v":"Andrlíková Vendula"},{"$f":"IF(AND(J!A13=\"\",J!B13=\"\"),\"\",J!B13)","v":"Kamenec"},null,null,null,"DNF",null,null,null,null,"DNF",null,"DNF",null,"DNF",null,1,null,7200]
[null,{"$f":"J!E14","v":14},{"$f":"IF(AND(J!A14=\"\",J!B14<>\"\"),\"NESTARTOVALO\",IF(AND(J!A14=\"\",J!B14=\"\"),\"\",J!A14))","v":"Bočková Sára"},{"$f":"IF(AND(J!A14=\"\",J!B14=\"\"),\"\",J!B14)","v":"Lukavice"},null,null,null,"DNF",null,null,null,null,"DNF",null,"DNF",null,"DNF",null,1,null,7200]
[null,{"$f":"J!E15","v":15},{"$f":"IF(AND(J!A15=\"\",J!B15<>\"\"),\"NESTARTOVALO\",IF(AND(J!A15=\"\",J!B15=\"\"),\"\",J!A15))","v":"Zachová Aneta"},{"$f":"IF(AND(J!A15=\"\",J!B15=\"\"),\"\",J!B15)","v":"Lubná"},null,null,null,"DNF",null,null,null,null,"DNF",null,"DNF",null,"DNF",null,1,null,7200]
[null,{"$f":"J!E16","v":16},{"$f":"IF(AND(J!A16=\"\",J!B16<>\"\"),\"NESTARTOVALO\",IF(AND(J!A16=\"\",J!B16=\"\"),\"\",J!A16))","v":"Novotná Leona"},{"$f":"IF(AND(J!A16=\"\",J!B16=\"\"),\"\",J!B16)","v":"Skuteč"},null,null,null,"DNF",null,null,null,null,"DNF",null,"DNF",null,"DNF",null,1,null,7200]
[null,{"$f":"J!E17","v":17},{"$f":"IF(AND(J!A17=\"\",J!B17<>\"\"),\"NESTARTOVALO\",IF(AND(J!A17=\"\",J!B17=\"\"),\"\",J!A17))","v":"Černohorská Nikola "},{"$f":"IF(AND(J!A17=\"\",J!B17=\"\"),\"\",J!B17)","v":"Bystřec"},null,null,null,"DNF",null,null,null,null,"DNF",null,"DNF",null,"DNF",null,1,null,7200]
[null,{"$f":"J!E18","v":18},{"$f":"IF(AND(J!A18=\"\",J!B18<>\"\"),\"NESTARTOVALO\",IF(AND(J!A18=\"\",J!B18=\"\"),\"\",J!A18))","v":"Majvaldová Adela"},{"$f":"IF(AND(J!A18=\"\",J!B18=\"\"),\"\",J!B18)","v":"Letohrad Kunčice"},null,null,null,"DNF",null,null,null,null,"DNF",null,"DNF",null,"DNF",null,1,null,7200]
[null,{"$f":"J!E19","v":19},{"$f":"IF(AND(J!A19=\"\",J!B19<>\"\"),\"NESTARTOVALO\",IF(AND(J!A19=\"\",J!B19=\"\"),\"\",J!A19))","v":"Cejpová Jana"},{"$f":"IF(AND(J!A19=\"\",J!B19=\"\"),\"\",J!B19)","v":"Kamenec"},null,null,null,"DNF",null,null,null,null,"DNF",null,"DNF",null,"DNF",null,1,null,7200]
[null,{"$f":"J!E20","v":20},{"$f":"IF(AND(J!A20=\"\",J!B20<>\"\"),\"NESTARTOVALO\",IF(AND(J!A20=\"\",J!B20=\"\"),\"\",J!A20))","v":"Zavoralová Klára"},{"$f":"IF(AND(J!A20=\"\",J!B20=\"\"),\"\",J!B20)","v":"Lukavice"},null,null,null,"DNF",null,null,null,null,"DNF",null,"DNF",null,"DNF",null,1,null,7200]
[null,{"$f":"J!E21","v":21},{"$f":"IF(AND(J!A21=\"\",J!B21<>\"\"),\"NESTARTOVALO\",IF(AND(J!A21=\"\",J!B21=\"\"),\"\",J!A21))","v":"Silová Michaela"},{"$f":"IF(AND(J!A21=\"\",J!B21=\"\"),\"\",J!B21)","v":"Lubná"},null,null,null,"DNF",null,null,null,null,"DNF",null,"DNF",null,"DNF",null,1,null,7200]
[null,{"$f":"J!E22","v":22},{"$f":"IF(AND(J!A22=\"\",J!B22<>\"\"),\"NESTARTOVALO\",IF(AND(J!A22=\"\",J!B22=\"\"),\"\",J!A22))","v":"Slezáková Nela"},{"$f":"IF(AND(J!A22=\"\",J!B22=\"\"),\"\",J!B22)","v":"Skuteč"},null,null,null,"DNF",null,null,null,null,"DNF",null,"DNF",null,"DNF",null,1,null,7200]
[null,{"$f":"J!E23","v":23},{"$f":"IF(AND(J!A23=\"\",J!B23<>\"\"),\"NESTARTOVALO\",IF(AND(J!A23=\"\",J!B23=\"\"),\"\",J!A23))","v":"Hrdinová Adéla"},{"$f":"IF(AND(J!A23=\"\",J!B23=\"\"),\"\",J!B23)","v":"Bystřec"},null,null,null,"DNF",null,null,null,null,"DNF",null,"DNF",null,"DNF",null,1,null,7200]
[null,{"$f":"J!E24","v":24},{"$f":"IF(AND(J!A24=\"\",J!B24<>\"\"),\"NESTARTOVALO\",IF(AND(J!A24=\"\",J!B24=\"\"),\"\",J!A24))","v":"Krejsová Nikola"},{"$f":"IF(AND(J!A24=\"\",J!B24=\"\"),\"\",J!B24)","v":"Letohrad Kunčice"},null,null,null,"DNF",null,null,null,null,"DNF",null,"DNF",null,"DNF",null,1,null,7200]
[null,{"$f":"J!E25","v":25},{"$f":"IF(AND(J!A25=\"\",J!B25<>\"\"),\"NESTARTOVALO\",IF(AND(J!A25=\"\",J!B25=\"\"),\"\",J!A25))","v":"Bartoníčková Karolína"},{"$f":"IF(AND(J!A25=\"\",J!B25=\"\"),\"\",J!B25)","v":"Kamenec"},null,null,null,"DNF",null,null,null,null,"DNF",null,"DNF",null,"DNF",null,1,null,7200]
[null,{"$f":"J!E26","v":26},{"$f":"IF(AND(J!A26=\"\",J!B26<>\"\"),\"NESTARTOVALO\",IF(AND(J!A26=\"\",J!B26=\"\"),\"\",J!A26))","v":"Marečková Veronika"},{"$f":"IF(AND(J!A26=\"\",J!B26=\"\"),\"\",J!B26)","v":"Lukavice"},null,null,null,"DNF",null,null,null,null,"DNF",null,"DNF",null,"DNF",null,1,null,7200]
[null,{"$f":"J!E27","v":27},{"$f":"IF(AND(J!A27=\"\",J!B27<>\"\"),\"NESTARTOVALO\",IF(AND(J!A27=\"\",J!B27=\"\"),\"\",J!A27))","v":"Faltysová Marketa"},{"$f":"IF(AND(J!A27=\"\",J!B27=\"\"),\"\",J!B27)","v":"Lubná"},null,null,null,"DNF",null,null,null,null,"DNF",null,"DNF",null,"DNF",null,1,null,7200]
[null,{"$f":"J!E28","v":28},{"$f":"IF(AND(J!A28=\"\",J!B28<>\"\"),\"NESTARTOVALO\",IF(AND(J!A28=\"\",J!B28=\"\"),\"\",J!A28))","v":"Šulcová Soňa"},{"$f":"IF(AND(J!A28=\"\",J!B28=\"\"),\"\",J!B28)","v":"Skuteč"},null,null,null,"DNF",null,null,null,null,"DNF",null,"DNF",null,"DNF",null,1,null,7200]
[null,{"$f":"J!E29","v":29},{"$f":"IF(AND(J!A29=\"\",J!B29<>\"\"),\"NESTARTOVALO\",IF(AND(J!A29=\"\",J!B29=\"\"),\"\",J!A29))","v":"Hrdinová Lucie"},{"$f":"IF(AND(J!A29=\"\",J!B29=\"\"),\"\",J!B29)","v":"Bystřec"},null,null,null,"DNF",null,null,null,null,"DNF",null,"DNF",null,"DNF",null,1,null,7200]
[null,{"$f":"J!E30","v":30},{"$f":"IF(AND(J!A30=\"\",J!B30<>\"\"),\"NESTARTOVALO\",IF(AND(J!A30=\"\",J!B30=\"\"),\"\",J!A30))","v":"Sýkorová Veronika"},{"$f":"IF(AND(J!A30=\"\",J!B30=\"\"),\"\",J!B30)","v":"Letohrad Kunčice"},null,null,null,"DNF",null,null,null,null,"DNF",null,"DNF",null,"DNF",null,1,null,7200]
[null,{"$f":"J!E31","v":31},{"$f":"IF(AND(J!A31=\"\",J!B31<>\"\"),\"NESTARTOVALO\",IF(AND(J!A31=\"\",J!B31=\"\"),\"\",J!A31))","v":"Andrlíková Anna"},{"$f":"IF(AND(J!A31=\"\",J!B31=\"\"),\"\",J!B31)","v":"Kamenec"},null,null,null,"DNF",null,null,null,null,"DNF",null,"DNF",null,"DNF",null,1,null,7200]
[null,{"$f":"J!E32","v":32},{"$f":"IF(AND(J!A32=\"\",J!B32<>\"\"),\"NESTARTOVALO\",IF(AND(J!A32=\"\",J!B32=\"\"),\"\",J!A32))","v":"Hospodková Tereza"},{"$f":"IF(AND(J!A32=\"\",J!B32=\"\"),\"\",J!B32)","v":"Lukavice"},null,null,null,"DNF",null,null,null,null,"DNF",null,"DNF",null,"DNF",null,1,null,7200]
[null,{"$f":"J!E33","v":33},{"$f":"IF(AND(J!A33=\"\",J!B33<>\"\"),\"NESTARTOVALO\",IF(AND(J!A33=\"\",J!B33=\"\"),\"\",J!A33))","v":"Brázdová Ilona"},{"$f":"IF(AND(J!A33=\"\",J!B33=\"\"),\"\",J!B33)","v":"Lubná"},null,null,null,"DNF",null,null,null,null,"DNF",null,"DNF",null,"DNF",null,1,null,7200]
[null,{"$f":"J!E34","v":34},{"$f":"IF(AND(J!A34=\"\",J!B34<>\"\"),\"NESTARTOVALO\",IF(AND(J!A34=\"\",J!B34=\"\"),\"\",J!A34))","v":"Zavoralová Aneta"},{"$f":"IF(AND(J!A34=\"\",J!B34=\"\"),\"\",J!B34)","v":"Skuteč"},null,null,null,"DNF",null,null,null,null,"DNF",null,"DNF",null,"DNF",null,1,null,7200]
[null,{"$f":"J!E35","v":35},{"$f":"IF(AND(J!A35=\"\",J!B35<>\"\"),\"NESTARTOVALO\",IF(AND(J!A35=\"\",J!B35=\"\"),\"\",J!A35))","v":"Pfeiferová Valerie"},{"$f":"IF(AND(J!A35=\"\",J!B35=\"\"),\"\",J!B35)","v":"Bystřec"},null,null,null,"DNF",null,null,null,null,"DNF",null,"DNF",null,"DNF",null,1,null,7200]
[null,{"$f":"J!E36","v":36},{"$f":"IF(AND(J!A36=\"\",J!B36<>\"\"),\"NESTARTOVALO\",IF(AND(J!A36=\"\",J!B36=\"\"),\"\",J!A36))","v":"Strasmeierová Eliška"},{"$f":"IF(AND(J!A36=\"\",J!B36=\"\"),\"\",J!B36)","v":"Letohrad Kunčice"},null,null,null,"DNF",null,null,null,null,"DNF",null,"DNF",null,"DNF",null,1,null,7200]
[null,{"$f":"J!E37","v":37},{"$f":"IF(AND(J!A37=\"\",J!B37<>\"\"),\"NESTARTOVALO\",IF(AND(J!A37=\"\",J!B37=\"\"),\"\",J!A37))","v":"Němcová Barbora"},{"$f":"IF(AND(J!A37=\"\",J!B37=\"\"),\"\",J!B37)","v":"Kamenec"},null,null,null,"DNF",null,null,null,null,"DNF",null,"DNF",null,"DNF",null,1,null,7200]
[null,{"$f":"J!E38","v":38},{"$f":"IF(AND(J!A38=\"\",J!B38<>\"\"),\"NESTARTOVALO\",IF(AND(J!A38=\"\",J!B38=\"\"),\"\",J!A38))","v":"Nováková Markéta"},{"$f":"IF(AND(J!A38=\"\",J!B38=\"\"),\"\",J!B38)","v":"Lukavice"},null,null,null,"DNF",null,null,null,null,"DNF",null,"DNF",null,"DNF",null,1,null,7200]
[null,{"$f":"J!E39","v":39},{"$f":"IF(AND(J!A39=\"\",J!B39<>\"\"),\"NESTARTOVALO\",IF(AND(J!A39=\"\",J!B39=\"\"),\"\",J!A39))","v":"Kusá Kateřina"},{"$f":"IF(AND(J!A39=\"\",J!B39=\"\"),\"\",J!B39)","v":"Lubná"},null,null,null,"DNF",null,null,null,null,"DNF",null,"DNF",null,"DNF",null,1,null,7200]
[null,{"$f":"J!E40","v":40},{"$f":"IF(AND(J!A40=\"\",J!B40<>\"\"),\"NESTARTOVALO\",IF(AND(J!A40=\"\",J!B40=\"\"),\"\",J!A40))","v":"Zavoralová Karolína"},{"$f":"IF(AND(J!A40=\"\",J!B40=\"\"),\"\",J!B40)","v":"Skuteč"},null,null,null,"DNF",null,null,null,null,"DNF",null,"DNF",null,"DNF",null,1,null,7200]
[null,{"$f":"J!E41","v":41},{"$f":"IF(AND(J!A41=\"\",J!B41<>\"\"),\"NESTARTOVALO\",IF(AND(J!A41=\"\",J!B41=\"\"),\"\",J!A41))","v":"Dolečková Kristýna"},{"$f":"IF(AND(J!A41=\"\",J!B41=\"\"),\"\",J!B41)","v":"Bystřec"},null,null,null,"DNF",null,null,null,null,"DNF",null,"DNF",null,"DNF",null,1,null,7200]
[null,{"$f":"J!E42","v":42},{"$f":"IF(AND(J!A42=\"\",J!B42<>\"\"),\"NESTARTOVALO\",IF(AND(J!A42=\"\",J!B42=\"\"),\"\",J!A42))","v":"Dudková Martina"},{"$f":"IF(AND(J!A42=\"\",J!B42=\"\"),\"\",J!B42)","v":"Letohrad Kunčice"},null,null,null,"DNF",null,null,null,null,"DNF",null,"DNF",null,"DNF",null,1,null,7200]
[null,{"$f":"J!E43","v":43},{"$f":"IF(AND(J!A43=\"\",J!B43<>\"\"),\"NESTARTOVALO\",IF(AND(J!A43=\"\",J!B43=\"\"),\"\",J!A43))","v":""},{"$f":"IF(AND(J!A43=\"\",J!B43=\"\"),\"\",J!B43)","v":""},null,null,null,"",null,null,null,null,"",null,"",null,"",null,"",null,9000]
[null,{"$f":"J!E44","v":44},{"$f":"IF(AND(J!A44=\"\",J!B44<>\"\"),\"NESTARTOVALO\",IF(AND(J!A44=\"\",J!B44=\"\"),\"\",J!A44))","v":""},{"$f":"IF(AND(J!A44=\"\",J!B44=\"\"),\"\",J!B44)","v":""},null,null,null,"",null,null,null,null,"",null,"",null,"",null,"",null,9000]
[null,{"$f":"J!E45","v":45},{"$f":"IF(AND(J!A45=\"\",J!B45<>\"\"),\"NESTARTOVALO\",IF(AND(J!A45=\"\",J!B45=\"\"),\"\",J!A45))","v":""},{"$f":"IF(AND(J!A45=\"\",J!B45=\"\"),\"\",J!B45)","v":""},null,null,null,"",null,null,null,null,"",null,"",null,"",null,"",null,9000]
[null,{"$f":"J!E46","v":46},{"$f":"IF(AND(J!A46=\"\",J!B46<>\"\"),\"NESTARTOVALO\",IF(AND(J!A46=\"\",J!B46=\"\"),\"\",J!A46))","v":""},{"$f":"IF(AND(J!A46=\"\",J!B46=\"\"),\"\",J!B46)","v":""},null,null,null,"",null,null,null,null,"",null,"",null,"",null,"",null,9000]
[null,{"$f":"J!E47","v":47},{"$f":"IF(AND(J!A47=\"\",J!B47<>\"\"),\"NESTARTOVALO\",IF(AND(J!A47=\"\",J!B47=\"\"),\"\",J!A47))","v":""},{"$f":"IF(AND(J!A47=\"\",J!B47=\"\"),\"\",J!B47)","v":""},null,null,null,"",null,null,null,null,"",null,"",null,"",null,"",null,9000]
[null,{"$f":"J!E48","v":48},{"$f":"IF(AND(J!A48=\"\",J!B48<>\"\"),\"NESTARTOVALO\",IF(AND(J!A48=\"\",J!B48=\"\"),\"\",J!A48))","v":""},{"$f":"IF(AND(J!A48=\"\",J!B48=\"\"),\"\",J!B48)","v":""},null,null,null,"",null,null,null,null,"",null,"",null,"",null,"",null,9000]
[null,{"$f":"J!E49","v":49},{"$f":"IF(AND(J!A49=\"\",J!B49<>\"\"),\"NESTARTOVALO\",IF(AND(J!A49=\"\",J!B49=\"\"),\"\",J!A49))","v":""},{"$f":"IF(AND(J!A49=\"\",J!B49=\"\"),\"\",J!B49)","v":""},null,null,null,"",null,null,null,null,"",null,"",null,"",null,"",null,9000]
[null,{"$f":"J!E50","v":50},{"$f":"IF(AND(J!A50=\"\",J!B50<>\"\"),\"NESTARTOVALO\",IF(AND(J!A50=\"\",J!B50=\"\"),\"\",J!A50))","v":""},{"$f":"IF(AND(J!A50=\"\",J!B50=\"\"),\"\",J!B50)","v":""},null,null,null,"",null,null,null,null,"",null,"",null,"",null,"",null,9000]
[null,{"$f":"J!E51","v":51},{"$f":"IF(AND(J!A51=\"\",J!B51<>\"\"),\"NESTARTOVALO\",IF(AND(J!A51=\"\",J!B51=\"\"),\"\",J!A51))","v":""},{"$f":"IF(AND(J!A51=\"\",J!B51=\"\"),\"\",J!B51)","v":""},null,null,null,"",null,null,null,null,"",null,"",null,"",null,"",null,9000]
[null,{"$f":"J!E52","v":52},{"$f":"IF(AND(J!A52=\"\",J!B52<>\"\"),\"NESTARTOVALO\",IF(AND(J!A52=\"\",J!B52=\"\"),\"\",J!A52))","v":""},{"$f":"IF(AND(J!A52=\"\",J!B52=\"\"),\"\",J!B52)","v":""},null,null,null,"",null,null,null,null,"",null,"",null,"",null,"",null,9000]
[null,{"$f":"J!E53","v":53},{"$f":"IF(AND(J!A53=\"\",J!B53<>\"\"),\"NESTARTOVALO\",IF(AND(J!A53=\"\",J!B53=\"\"),\"\",J!A53))","v":""},{"$f":"IF(AND(J!A53=\"\",J!B53=\"\"),\"\",J!B53)","v":""},null,null,null,"",null,null,null,null,"",null,"",null,"",null,"",null,9000]
[null,{"$f":"J!E54","v":54},{"$f":"IF(AND(J!A54=\"\",J!B54<>\"\"),\"NESTARTOVALO\",IF(AND(J!A54=\"\",J!B54=\"\"),\"\",J!A54))","v":""},{"$f":"IF(AND(J!A54=\"\",J!B54=\"\"),\"\",J!B54)","v":""},null,null,null,"",null,null,null,null,"",null,"",null,"",null,"",null,9000]
[null,{"$f":"J!E55","v":55},{"$f":"IF(AND(J!A55=\"\",J!B55<>\"\"),\"NESTARTOVALO\",IF(AND(J!A55=\"\",J!B55=\"\"),\"\",J!A55))","v":""},{"$f":"IF(AND(J!A55=\"\",J!B55=\"\"),\"\",J!B55)","v":""},null,null,null,"",null,null,null,null,"",null,"",null,"",null,"",null,9000]
[null,{"$f":"J!E56","v":56},{"$f":"IF(AND(J!A56=\"\",J!B56<>\"\"),\"NESTARTOVALO\",IF(AND(J!A56=\"\",J!B56=\"\"),\"\",J!A56))","v":""},{"$f":"IF(AND(J!A56=\"\",J!B56=\"\"),\"\",J!B56)","v":""},null,null,null,"",null,null,null,null,"",null,"",null,"",null,"",null,9000]
[null,{"$f":"J!E57","v":57},{"$f":"IF(AND(J!A57=\"\",J!B57<>\"\"),\"NESTARTOVALO\",IF(AND(J!A57=\"\",J!B57=\"\"),\"\",J!A57))","v":""},{"$f":"IF(AND(J!A57=\"\",J!B57=\"\"),\"\",J!B57)","v":""},null,null,null,"",null,null,null,null,"",null,"",null,"",null,"",null,9000]
[null,{"$f":"J!E58","v":58},{"$f":"IF(AND(J!A58=\"\",J!B58<>\"\"),\"NESTARTOVALO\",IF(AND(J!A58=\"\",J!B58=\"\"),\"\",J!A58))","v":""},{"$f":"IF(AND(J!A58=\"\",J!B58=\"\"),\"\",J!B58)","v":""},null,null,null,"",null,null,null,null,"",null,"",null,"",null,"",null,9000]
[null,{"$f":"J!E59","v":59},{"$f":"IF(AND(J!A59=\"\",J!B59<>\"\"),\"NESTARTOVALO\",IF(AND(J!A59=\"\",J!B59=\"\"),\"\",J!A59))","v":""},{"$f":"IF(AND(J!A59=\"\",J!B59=\"\"),\"\",J!B59)","v":""},null,null,null,"",null,null,null,null,"",null,"",null,"",null,"",null,9000]
[null,{"$f":"J!E60","v":60},{"$f":"IF(AND(J!A60=\"\",J!B60<>\"\"),\"NESTARTOVALO\",IF(AND(J!A60=\"\",J!B60=\"\"),\"\",J!A60))","v":""},{"$f":"IF(AND(J!A60=\"\",J!B60=\"\"),\"\",J!B60)","v":""},null,null,null,"",null,null,null,null,"",null,"",null,"",null,"",null,9000]
[null,{"$f":"J!E61","v":61},{"$f":"IF(AND(J!A61=\"\",J!B61<>\"\"),\"NESTARTOVALO\",IF(AND(J!A61=\"\",J!B61=\"\"),\"\",J!A61))","v":""},{"$f":"IF(AND(J!A61=\"\",J!B61=\"\"),\"\",J!B61)","v":""},null,null,null,"",null,null,null,null,"",null,"",null,"",null,"",null,9000]
[null,{"$f":"J!E62","v":62},{"$f":"IF(AND(J!A62=\"\",J!B62<>\"\"),\"NESTARTOVALO\",IF(AND(J!A62=\"\",J!B62=\"\"),\"\",J!A62))","v":""},{"$f":"IF(AND(J!A62=\"\",J!B62=\"\"),\"\",J!B62)","v":""},null,null,null,"",null,null,null,null,"",null,"",null,"",null,"",null,9000]
[null,{"$f":"J!E63","v":63},{"$f":"IF(AND(J!A63=\"\",J!B63<>\"\"),\"NESTARTOVALO\",IF(AND(J!A63=\"\",J!B63=\"\"),\"\",J!A63))","v":""},{"$f":"IF(AND(J!A63=\"\",J!B63=\"\"),\"\",J!B63)","v":""},null,null,null,"",null,null,null,null,"",null,"",null,"",null,"",null,9000]
[null,{"$f":"J!E64","v":64},{"$f":"IF(AND(J!A64=\"\",J!B64<>\"\"),\"NESTARTOVALO\",IF(AND(J!A64=\"\",J!B64=\"\"),\"\",J!A64))","v":""},{"$f":"IF(AND(J!A64=\"\",J!B64=\"\"),\"\",J!B64)","v":""},null,null,null,"",null,null,null,null,"",null,"",null,"",null,"",null,9000]
[null,{"$f":"J!E65","v":65},{"$f":"IF(AND(J!A65=\"\",J!B65<>\"\"),\"NESTARTOVALO\",IF(AND(J!A65=\"\",J!B65=\"\"),\"\",J!A65))","v":""},{"$f":"IF(AND(J!A65=\"\",J!B65=\"\"),\"\",J!B65)","v":""},null,null,null,"",null,null,null,null,"",null,"",null,{"$f":"IF(C69=\"\",\"\",IF(OR(O69=\"NP\",O69=\"DNF\"),O69,RANK(O69,O$5:O$178,1)))","v":""},null,{"$f":"IF(C69=\"\",\"\",IF(O69=\"NP\",MAX(Q$5:Q$178)+1,IF(O69=\"DNF\",MAX(Q$5:Q$178)+COUNTIF(Q$5:Q$178,\"NP\")+1,RANK(O69,O$5:O$178,1))))","v":""},null,9000]
[null,{"$f":"J!E66","v":66},{"$f":"IF(AND(J!A66=\"\",J!B66<>\"\"),\"NESTARTOVALO\",IF(AND(J!A66=\"\",J!B66=\"\"),\"\",J!A66))","v":""},{"$f":"IF(AND(J!A66=\"\",J!B66=\"\"),\"\",J!B66)","v":""},null,null,null,{"$f":"IF($C70=\"\",\"\",IF(OR($E70=\"DNF\",$F70=\"DNF\",$G70=\"DNF\",AND($E70=\"\",$F70=\"\",$G70=\"\")),\"DNF\",IF(OR($E70=\"NP\",$F70=\"NP\",$G70=\"NP\"),\"NP\",IF(ISERROR(MEDIAN($E70:$G70)),\"DNF\",IF(OR($E70=\"X\",$F70=\"X\",$G70=\"X\",$E70=\"\",$F70=\"\",$G70=\"\",$E70=\"x\",$F70=\"x\",$G70=\"x\"),MAX($E70:$G70),MEDIAN($E70:$G70))))))","v":""},null,null,null,null,{"$f":"IF($C70=\"\",\"\",IF(OR($J70=\"DNF\",$K70=\"DNF\",$L70=\"DNF\",AND($J70=\"\",$K70=\"\",$L70=\"\")),\"DNF\",IF(OR($J70=\"NP\",$K70=\"NP\",$L70=\"NP\"),\"NP\",IF(ISERROR(MEDIAN($J70:$L70)),\"DNF\",IF(OR($J70=\"X\",$K70=\"X\",$L70=\"X\",$J70=\"\",$K70=\"\",$L70=\"\",$J70=\"x\",$K70=\"x\",$L70=\"x\"),MAX($J70:$L70),MEDIAN($J70:$L70))))))","v":""},null,{"$f":"IF(C70=\"\",\"\",IF(OR(AND(H70=\"NP\",M70=\"NP\"),AND(H70=\"DNF\",M70=\"DNF\")),H70,IF(AND(H70=\"NP\",M70=\"DNF\"),H70,IF(AND(H70=\"DNF\",M70=\"NP\"),M70,MIN(H70,M70)))))","v":""},null,"",null,"",null,{"$f":"IF($C70=\"\",9000,MAX(H70,M70)+(COUNTIF($H70:$H70,\"NP\")*600)+(COUNTIF($M70:$M70,\"NP\")*600)+(COUNTIF($H70:$H70,\"DNF\")*3600)+(COUNTIF($M70:$M70,\"DNF\")*3600))","v":9000}]
[null,{"$f":"J!E67","v":67},{"$f":"IF(AND(J!A67=\"\",J!B67<>\"\"),\"NESTARTOVALO\",IF(AND(J!A67=\"\",J!B67=\"\"),\"\",J!A67))","v":""},{"$f":"IF(AND(J!A67=\"\",J!B67=\"\"),\"\",J!B67)","v":""},null,null,null,"",null,null,null,null,"",null,"",null,"",null,"",null,9000]
[null,{"$f":"J!E68","v":68},{"$f":"IF(AND(J!A68=\"\",J!B68<>\"\"),\"NESTARTOVALO\",IF(AND(J!A68=\"\",J!B68=\"\"),\"\",J!A68))","v":""},{"$f":"IF(AND(J!A68=\"\",J!B68=\"\"),\"\",J!B68)","v":""},null,null,null,"",null,null,null,null,"",null,"",null,"",null,"",null,9000]
[null,{"$f":"J!E69","v":69},{"$f":"IF(AND(J!A69=\"\",J!B69<>\"\"),\"NESTARTOVALO\",IF(AND(J!A69=\"\",J!B69=\"\"),\"\",J!A69))","v":""},{"$f":"IF(AND(J!A69=\"\",J!B69=\"\"),\"\",J!B69)","v":""},null,null,null,"",null,null,null,null,"",null,"",null,"",null,"",null,9000]
[null,{"$f":"J!E70","v":70},{"$f":"IF(AND(J!A70=\"\",J!B70<>\"\"),\"NESTARTOVALO\",IF(AND(J!A70=\"\",J!B70=\"\"),\"\",J!A70))","v":""},{"$f":"IF(AND(J!A70=\"\",J!B70=\"\"),\"\",J!B70)","v":""},null,null,null,"",null,null,null,null,"",null,"",null,"",null,"",null,9000]
[null,{"$f":"J!E71","v":71},{"$f":"IF(AND(J!A71=\"\",J!B71<>\"\"),\"NESTARTOVALO\",IF(AND(J!A71=\"\",J!B71=\"\"),\"\",J!A71))","v":""},{"$f":"IF(AND(J!A71=\"\",J!B71=\"\"),\"\",J!B71)","v":""},null,null,null,"",null,null,null,null,"",null,"",null,"",null,"",null,9000]
[null,{"$f":"J!E72","v":72},{"$f":"IF(AND(J!A72=\"\",J!B72<>\"\"),\"NESTARTOVALO\",IF(AND(J!A72=\"\",J!B72=\"\"),\"\",J!A72))","v":""},{"$f":"IF(AND(J!A72=\"\",J!B72=\"\"),\"\",J!B72)","v":""},null,null,null,"",null,null,null,null,"",null,"",null,"",null,"",null,9000]
[null,{"$f":"J!E73","v":73},{"$f":"IF(AND(J!A73=\"\",J!B73<>\"\"),\"NESTARTOVALO\",IF(AND(J!A73=\"\",J!B73=\"\"),\"\",J!A73))","v":""},{"$f":"IF(AND(J!A73=\"\",J!B73=\"\"),\"\",J!B73)","v":""},null,null,null,"",null,null,null,null,"",null,"",null,"",null,"",null,9000]
[null,{"$f":"J!E74","v":74},{"$f":"IF(AND(J!A74=\"\",J!B74<>\"\"),\"NESTARTOVALO\",IF(AND(J!A74=\"\",J!B74=\"\"),\"\",J!A74))","v":""},{"$f":"IF(AND(J!A74=\"\",J!B74=\"\"),\"\",J!B74)","v":""},null,null,null,"",null,null,null,null,"",null,"",null,"",null,"",null,9000]
[null,{"$f":"J!E75","v":75},{"$f":"IF(AND(J!A75=\"\",J!B75<>\"\"),\"NESTARTOVALO\",IF(AND(J!A75=\"\",J!B75=\"\"),\"\",J!A75))","v":""},{"$f":"IF(AND(J!A75=\"\",J!B75=\"\"),\"\",J!B75)","v":""},null,null,null,"",null,null,null,null,"",null,"",null,"",null,"",null,9000]
[null,{"$f":"J!E76","v":76},{"$f":"IF(AND(J!A76=\"\",J!B76<>\"\"),\"NESTARTOVALO\",IF(AND(J!A76=\"\",J!B76=\"\"),\"\",J!A76))","v":""},{"$f":"IF(AND(J!A76=\"\",J!B76=\"\"),\"\",J!B76)","v":""},null,null,null,"",null,null,null,null,"",null,"",null,"",null,"",null,9000]
[null,{"$f":"J!E77","v":77},{"$f":"IF(AND(J!A77=\"\",J!B77<>\"\"),\"NESTARTOVALO\",IF(AND(J!A77=\"\",J!B77=\"\"),\"\",J!A77))","v":""},{"$f":"IF(AND(J!A77=\"\",J!B77=\"\"),\"\",J!B77)","v":""},null,null,null,"",null,null,null,null,"",null,"",null,"",null,"",null,9000]
[null,{"$f":"J!E78","v":78},{"$f":"IF(AND(J!A78=\"\",J!B78<>\"\"),\"NESTARTOVALO\",IF(AND(J!A78=\"\",J!B78=\"\"),\"\",J!A78))","v":""},{"$f":"IF(AND(J!A78=\"\",J!B78=\"\"),\"\",J!B78)","v":""},null,null,null,"",null,null,null,null,"",null,"",null,"",null,"",null,9000]
[null,{"$f":"J!E79","v":79},{"$f":"IF(AND(J!A79=\"\",J!B79<>\"\"),\"NESTARTOVALO\",IF(AND(J!A79=\"\",J!B79=\"\"),\"\",J!A79))","v":""},{"$f":"IF(AND(J!A79=\"\",J!B79=\"\"),\"\",J!B79)","v":""},null,null,null,"",null,null,null,null,"",null,"",null,"",null,"",null,9000]
[null,{"$f":"J!E80","v":80},{"$f":"IF(AND(J!A80=\"\",J!B80<>\"\"),\"NESTARTOVALO\",IF(AND(J!A80=\"\",J!B80=\"\"),\"\",J!A80))","v":""},{"$f":"IF(AND(J!A80=\"\",J!B80=\"\"),\"\",J!B80)","v":""},null,null,null,"",null,null,null,null,"",null,"",null,"",null,"",null,9000]
[null,{"$f":"J!E81","v":81},{"$f":"IF(AND(J!A81=\"\",J!B81<>\"\"),\"NESTARTOVALO\",IF(AND(J!A81=\"\",J!B81=\"\"),\"\",J!A81))","v":""},{"$f":"IF(AND(J!A81=\"\",J!B81=\"\"),\"\",J!B81)","v":""},null,null,null,"",null,null,null,null,"",null,"",null,"",null,"",null,9000]
[null,{"$f":"J!E82","v":82},{"$f":"IF(AND(J!A82=\"\",J!B82<>\"\"),\"NESTARTOVALO\",IF(AND(J!A82=\"\",J!B82=\"\"),\"\",J!A82))","v":""},{"$f":"IF(AND(J!A82=\"\",J!B82=\"\"),\"\",J!B82)","v":""},null,null,null,"",null,null,null,null,"",null,"",null,"",null,"",null,9000]
[null,{"$f":"J!E83","v":83},{"$f":"IF(AND(J!A83=\"\",J!B83<>\"\"),\"NESTARTOVALO\",IF(AND(J!A83=\"\",J!B83=\"\"),\"\",J!A83))","v":""},{"$f":"IF(AND(J!A83=\"\",J!B83=\"\"),\"\",J!B83)","v":""},null,null,null,"",null,null,null,null,"",null,"",null,"",null,"",null,9000]
[null,{"$f":"J!E84","v":84},{"$f":"IF(AND(J!A84=\"\",J!B84<>\"\"),\"NESTARTOVALO\",IF(AND(J!A84=\"\",J!B84=\"\"),\"\",J!A84))","v":""},{"$f":"IF(AND(J!A84=\"\",J!B84=\"\"),\"\",J!B84)","v":""},null,null,null,"",null,null,null,null,"",null,"",null,"",null,"",null,9000]
[null,{"$f":"J!E85","v":85},{"$f":"IF(AND(J!A85=\"\",J!B85<>\"\"),\"NESTARTOVALO\",IF(AND(J!A85=\"\",J!B85=\"\"),\"\",J!A85))","v":""},{"$f":"IF(AND(J!A85=\"\",J!B85=\"\"),\"\",J!B85)","v":""},null,null,null,"",null,null,null,null,"",null,"",null,"",null,"",null,9000]
[null,{"$f":"J!E86","v":86},{"$f":"IF(AND(J!A86=\"\",J!B86<>\"\"),\"NESTARTOVALO\",IF(AND(J!A86=\"\",J!B86=\"\"),\"\",J!A86))","v":""},{"$f":"IF(AND(J!A86=\"\",J!B86=\"\"),\"\",J!B86)","v":""},null,null,null,"",null,null,null,null,"",null,"",null,"",null,"",null,9000]
[null,{"$f":"J!E87","v":87},{"$f":"IF(AND(J!A87=\"\",J!B87<>\"\"),\"NESTARTOVALO\",IF(AND(J!A87=\"\",J!B87=\"\"),\"\",J!A87))","v":""},{"$f":"IF(AND(J!A87=\"\",J!B87=\"\"),\"\",J!B87)","v":""},null,null,null,"",null,null,null,null,"",null,"",null,"",null,"",null,9000]
[null,{"$f":"J!E88","v":88},{"$f":"IF(AND(J!A88=\"\",J!B88<>\"\"),\"NESTARTOVALO\",IF(AND(J!A88=\"\",J!B88=\"\"),\"\",J!A88))","v":""},{"$f":"IF(AND(J!A88=\"\",J!B88=\"\"),\"\",J!B88)","v":""},null,null,null,"",null,null,null,null,"",null,"",null,"",null,"",null,9000]
[null,{"$f":"J!E89","v":89},{"$f":"IF(AND(J!A89=\"\",J!B89<>\"\"),\"NESTARTOVALO\",IF(AND(J!A89=\"\",J!B89=\"\"),\"\",J!A89))","v":""},{"$f":"IF(AND(J!A89=\"\",J!B89=\"\"),\"\",J!B89)","v":""},null,null,null,"",null,null,null,null,"",null,"",null,"",null,"",null,9000]
[null,{"$f":"J!E90","v":90},{"$f":"IF(AND(J!A90=\"\",J!B90<>\"\"),\"NESTARTOVALO\",IF(AND(J!A90=\"\",J!B90=\"\"),\"\",J!A90))","v":""},{"$f":"IF(AND(J!A90=\"\",J!B90=\"\"),\"\",J!B90)","v":""},null,null,null,"",null,null,null,null,"",null,"",null,"",null,"",null,9000]
[null,{"$f":"J!E91","v":91},{"$f":"IF(AND(J!A91=\"\",J!B91<>\"\"),\"NESTARTOVALO\",IF(AND(J!A91=\"\",J!B91=\"\"),\"\",J!A91))","v":""},{"$f":"IF(AND(J!A91=\"\",J!B91=\"\"),\"\",J!B91)","v":""},null,null,null,"",null,null,null,null,"",null,"",null,"",null,"",null,9000]
[null,{"$f":"J!E92","v":92},{"$f":"IF(AND(J!A92=\"\",J!B92<>\"\"),\"NESTARTOVALO\",IF(AND(J!A92=\"\",J!B92=\"\"),\"\",J!A92))","v":""},{"$f":"IF(AND(J!A92=\"\",J!B92=\"\"),\"\",J!B92)","v":""},null,null,null,"",null,null,null,null,"",null,"",null,"",null,"",null,9000]
[null,{"$f":"J!E93","v":93},{"$f":"IF(AND(J!A93=\"\",J!B93<>\"\"),\"NESTARTOVALO\",IF(AND(J!A93=\"\",J!B93=\"\"),\"\",J!A93))","v":""},{"$f":"IF(AND(J!A93=\"\",J!B93=\"\"),\"\",J!B93)","v":""},null,null,null,"",null,null,null,null,"",null,"",null,"",null,"",null,9000]
[null,{"$f":"J!E94","v":94},{"$f":"IF(AND(J!A94=\"\",J!B94<>\"\"),\"NESTARTOVALO\",IF(AND(J!A94=\"\",J!B94=\"\"),\"\",J!A94))","v":""},{"$f":"IF(AND(J!A94=\"\",J!B94=\"\"),\"\",J!B94)","v":""},null,null,null,"",null,null,null,null,"",null,"",null,"",null,"",null,9000]
[null,{"$f":"J!E95","v":95},{"$f":"IF(AND(J!A95=\"\",J!B95<>\"\"),\"NESTARTOVALO\",IF(AND(J!A95=\"\",J!B95=\"\"),\"\",J!A95))","v":""},{"$f":"IF(AND(J!A95=\"\",J!B95=\"\"),\"\",J!B95)","v":""},null,null,null,"",null,null,null,null,"",null,"",null,"",null,"",null,9000]
[null,{"$f":"J!E96","v":96},{"$f":"IF(AND(J!A96=\"\",J!B96<>\"\"),\"NESTARTOVALO\",IF(AND(J!A96=\"\",J!B96=\"\"),\"\",J!A96))","v":""},{"$f":"IF(AND(J!A96=\"\",J!B96=\"\"),\"\",J!B96)","v":""},null,null,null,"",null,null,null,null,"",null,"",null,"",null,"",null,9000]
[null,{"$f":"J!E97","v":97},{"$f":"IF(AND(J!A97=\"\",J!B97<>\"\"),\"NESTARTOVALO\",IF(AND(J!A97=\"\",J!B97=\"\"),\"\",J!A97))","v":""},{"$f":"IF(AND(J!A97=\"\",J!B97=\"\"),\"\",J!B97)","v":""},null,null,null,"",null,null,null,null,"",null,"",null,"",null,"",null,9000]
[null,{"$f":"J!E98","v":98},{"$f":"IF(AND(J!A98=\"\",J!B98<>\"\"),\"NESTARTOVALO\",IF(AND(J!A98=\"\",J!B98=\"\"),\"\",J!A98))","v":""},{"$f":"IF(AND(J!A98=\"\",J!B98=\"\"),\"\",J!B98)","v":""},null,null,null,"",null,null,null,null,"",null,"",null,"",null,"",null,9000]
[null,{"$f":"J!E99","v":99},{"$f":"IF(AND(J!A99=\"\",J!B99<>\"\"),\"NESTARTOVALO\",IF(AND(J!A99=\"\",J!B99=\"\"),\"\",J!A99))","v":""},{"$f":"IF(AND(J!A99=\"\",J!B99=\"\"),\"\",J!B99)","v":""},null,null,null,"",null,null,null,null,"",null,"",null,"",null,"",null,9000]
[null,{"$f":"J!E100","v":100},{"$f":"IF(AND(J!A100=\"\",J!B100<>\"\"),\"NESTARTOVALO\",IF(AND(J!A100=\"\",J!B100=\"\"),\"\",J!A100))","v":""},{"$f":"IF(AND(J!A100=\"\",J!B100=\"\"),\"\",J!B100)","v":""},null,null,null,"",null,null,null,null,"",null,"",null,"",null,"",null,9000]
[null,{"$f":"J!E101","v":101},{"$f":"IF(AND(J!A101=\"\",J!B101<>\"\"),\"NESTARTOVALO\",IF(AND(J!A101=\"\",J!B101=\"\"),\"\",J!A101))","v":""},{"$f":"IF(AND(J!A101=\"\",J!B101=\"\"),\"\",J!B101)","v":""},null,null,null,"",null,null,null,null,"",null,"",null,"",null,"",null,9000]
[null,{"$f":"J!E102","v":102},{"$f":"IF(AND(J!A102=\"\",J!B102<>\"\"),\"NESTARTOVALO\",IF(AND(J!A102=\"\",J!B102=\"\"),\"\",J!A102))","v":""},{"$f":"IF(AND(J!A102=\"\",J!B102=\"\"),\"\",J!B102)","v":""},null,null,null,"",null,null,null,null,"",null,"",null,"",null,"",null,9000]
[null,{"$f":"J!E103","v":103},{"$f":"IF(AND(J!A103=\"\",J!B103<>\"\"),\"NESTARTOVALO\",IF(AND(J!A103=\"\",J!B103=\"\"),\"\",J!A103))","v":""},{"$f":"IF(AND(J!A103=\"\",J!B103=\"\"),\"\",J!B103)","v":""},null,null,null,"",null,null,null,null,"",null,"",null,"",null,"",null,9000]
[null,{"$f":"J!E104","v":104},{"$f":"IF(AND(J!A104=\"\",J!B104<>\"\"),\"NESTARTOVALO\",IF(AND(J!A104=\"\",J!B104=\"\"),\"\",J!A104))","v":""},{"$f":"IF(AND(J!A104=\"\",J!B104=\"\"),\"\",J!B104)","v":""},null,null,null,"",null,null,null,null,"",null,"",null,"",null,"",null,9000]
[null,{"$f":"J!E105","v":105},{"$f":"IF(AND(J!A105=\"\",J!B105<>\"\"),\"NESTARTOVALO\",IF(AND(J!A105=\"\",J!B105=\"\"),\"\",J!A105))","v":""},{"$f":"IF(AND(J!A105=\"\",J!B105=\"\"),\"\",J!B105)","v":""},null,null,null,"",null,null,null,null,"",null,"",null,"",null,"",null,9000]
[null,{"$f":"J!E106","v":106},{"$f":"IF(AND(J!A106=\"\",J!B106<>\"\"),\"NESTARTOVALO\",IF(AND(J!A106=\"\",J!B106=\"\"),\"\",J!A106))","v":""},{"$f":"IF(AND(J!A106=\"\",J!B106=\"\"),\"\",J!B106)","v":""},null,null,null,"",null,null,null,null,"",null,"",null,"",null,"",null,9000]
[null,{"$f":"J!E107","v":107},{"$f":"IF(AND(J!A107=\"\",J!B107<>\"\"),\"NESTARTOVALO\",IF(AND(J!A107=\"\",J!B107=\"\"),\"\",J!A107))","v":""},{"$f":"IF(AND(J!A107=\"\",J!B107=\"\"),\"\",J!B107)","v":""},null,null,null,"",null,null,null,null,"",null,"",null,"",null,"",null,9000]
[null,{"$f":"J!E108","v":108},{"$f":"IF(AND(J!A108=\"\",J!B108<>\"\"),\"NESTARTOVALO\",IF(AND(J!A108=\"\",J!B108=\"\"),\"\",J!A108))","v":""},{"$f":"IF(AND(J!A108=\"\",J!B108=\"\"),\"\",J!B108)","v":""},null,null,null,"",null,null,null,null,"",null,"",null,"",null,"",null,9000]
[null,{"$f":"J!E109","v":109},{"$f":"IF(AND(J!A109=\"\",J!B109<>\"\"),\"NESTARTOVALO\",IF(AND(J!A109=\"\",J!B109=\"\"),\"\",J!A109))","v":""},{"$f":"IF(AND(J!A109=\"\",J!B109=\"\"),\"\",J!B109)","v":""},null,null,null,"",null,null,null,null,"",null,"",null,"",null,"",null,9000]
[null,{"$f":"J!E110","v":110},{"$f":"IF(AND(J!A110=\"\",J!B110<>\"\"),\"NESTARTOVALO\",IF(AND(J!A110=\"\",J!B110=\"\"),\"\",J!A110))","v":""},{"$f":"IF(AND(J!A110=\"\",J!B110=\"\"),\"\",J!B110)","v":""},null,null,null,"",null,null,null,null,"",null,"",null,"",null,"",null,9000]
[null,{"$f":"J!E111","v":111},{"$f":"IF(AND(J!A111=\"\",J!B111<>\"\"),\"NESTARTOVALO\",IF(AND(J!A111=\"\",J!B111=\"\"),\"\",J!A111))","v":""},{"$f":"IF(AND(J!A111=\"\",J!B111=\"\"),\"\",J!B111)","v":""},null,null,null,"",null,null,null,null,"",null,"",null,"",null,"",null,9000]
[null,{"$f":"J!E112","v":112},{"$f":"IF(AND(J!A112=\"\",J!B112<>\"\"),\"NESTARTOVALO\",IF(AND(J!A112=\"\",J!B112=\"\"),\"\",J!A112))","v":""},{"$f":"IF(AND(J!A112=\"\",J!B112=\"\"),\"\",J!B112)","v":""},null,null,null,"",null,null,null,null,"",null,"",null,"",null,"",null,9000]
[null,{"$f":"J!E113","v":113},{"$f":"IF(AND(J!A113=\"\",J!B113<>\"\"),\"NESTARTOVALO\",IF(AND(J!A113=\"\",J!B113=\"\"),\"\",J!A113))","v":""},{"$f":"IF(AND(J!A113=\"\",J!B113=\"\"),\"\",J!B113)","v":""},null,null,null,"",null,null,null,null,"",null,"",null,"",null,"",null,9000]
[null,{"$f":"J!E114","v":114},{"$f":"IF(AND(J!A114=\"\",J!B114<>\"\"),\"NESTARTOVALO\",IF(AND(J!A114=\"\",J!B114=\"\"),\"\",J!A114))","v":""},{"$f":"IF(AND(J!A114=\"\",J!B114=\"\"),\"\",J!B114)","v":""},null,null,null,"",null,null,null,null,"",null,"",null,"",null,"",null,9000]
[null,{"$f":"J!E115","v":115},{"$f":"IF(AND(J!A115=\"\",J!B115<>\"\"),\"NESTARTOVALO\",IF(AND(J!A115=\"\",J!B115=\"\"),\"\",J!A115))","v":""},{"$f":"IF(AND(J!A115=\"\",J!B115=\"\"),\"\",J!B115)","v":""},null,null,null,"",null,null,null,null,"",null,"",null,"",null,"",null,9000]
[null,{"$f":"J!E116","v":116},{"$f":"IF(AND(J!A116=\"\",J!B116<>\"\"),\"NESTARTOVALO\",IF(AND(J!A116=\"\",J!B116=\"\"),\"\",J!A116))","v":""},{"$f":"IF(AND(J!A116=\"\",J!B116=\"\"),\"\",J!B116)","v":""},null,null,null,"",null,null,null,null,"",null,"",null,"",null,"",null,9000]
[null,{"$f":"J!E117","v":117},{"$f":"IF(AND(J!A117=\"\",J!B117<>\"\"),\"NESTARTOVALO\",IF(AND(J!A117=\"\",J!B117=\"\"),\"\",J!A117))","v":""},{"$f":"IF(AND(J!A117=\"\",J!B117=\"\"),\"\",J!B117)","v":""},null,null,null,"",null,null,null,null,"",null,"",null,"",null,"",null,9000]
[null,{"$f":"J!E118","v":118},{"$f":"IF(AND(J!A118=\"\",J!B118<>\"\"),\"NESTARTOVALO\",IF(AND(J!A118=\"\",J!B118=\"\"),\"\",J!A118))","v":""},{"$f":"IF(AND(J!A118=\"\",J!B118=\"\"),\"\",J!B118)","v":""},null,null,null,"",null,null,null,null,"",null,"",null,"",null,"",null,9000]
[null,{"$f":"J!E119","v":119},{"$f":"IF(AND(J!A119=\"\",J!B119<>\"\"),\"NESTARTOVALO\",IF(AND(J!A119=\"\",J!B119=\"\"),\"\",J!A119))","v":""},{"$f":"IF(AND(J!A119=\"\",J!B119=\"\"),\"\",J!B119)","v":""},null,null,null,"",null,null,null,null,"",null,"",null,"",null,"",null,9000]
[null,{"$f":"J!E120","v":120},{"$f":"IF(AND(J!A120=\"\",J!B120<>\"\"),\"NESTARTOVALO\",IF(AND(J!A120=\"\",J!B120=\"\"),\"\",J!A120))","v":""},{"$f":"IF(AND(J!A120=\"\",J!B120=\"\"),\"\",J!B120)","v":""},null,null,null,"",null,null,null,null,"",null,"",null,"",null,"",null,9000]
[null,{"$f":"J!E121","v":121},{"$f":"IF(AND(J!A121=\"\",J!B121<>\"\"),\"NESTARTOVALO\",IF(AND(J!A121=\"\",J!B121=\"\"),\"\",J!A121))","v":""},{"$f":"IF(AND(J!A121=\"\",J!B121=\"\"),\"\",J!B121)","v":""},null,null,null,"",null,null,null,null,"",null,"",null,"",null,"",null,9000]
[null,{"$f":"J!E122","v":122},{"$f":"IF(AND(J!A122=\"\",J!B122<>\"\"),\"NESTARTOVALO\",IF(AND(J!A122=\"\",J!B122=\"\"),\"\",J!A122))","v":""},{"$f":"IF(AND(J!A122=\"\",J!B122=\"\"),\"\",J!B122)","v":""},null,null,null,"",null,null,null,null,"",null,"",null,"",null,"",null,9000]
[null,{"$f":"J!E123","v":123},{"$f":"IF(AND(J!A123=\"\",J!B123<>\"\"),\"NESTARTOVALO\",IF(AND(J!A123=\"\",J!B123=\"\"),\"\",J!A123))","v":""},{"$f":"IF(AND(J!A123=\"\",J!B123=\"\"),\"\",J!B123)","v":""},null,null,null,"",null,null,null,null,"",null,"",null,"",null,"",null,9000]
[null,{"$f":"J!E124","v":124},{"$f":"IF(AND(J!A124=\"\",J!B124<>\"\"),\"NESTARTOVALO\",IF(AND(J!A124=\"\",J!B124=\"\"),\"\",J!A124))","v":""},{"$f":"IF(AND(J!A124=\"\",J!B124=\"\"),\"\",J!B124)","v":""},null,null,null,"",null,null,null,null,"",null,"",null,"",null,"",null,9000]
[null,{"$f":"J!E125","v":125},{"$f":"IF(AND(J!A125=\"\",J!B125<>\"\"),\"NESTARTOVALO\",IF(AND(J!A125=\"\",J!B125=\"\"),\"\",J!A125))","v":""},{"$f":"IF(AND(J!A125=\"\",J!B125=\"\"),\"\",J!B125)","v":""},null,null,null,"",null,null,null,null,"",null,"",null,"",null,"",null,9000]
[null,{"$f":"J!E126","v":126},{"$f":"IF(AND(J!A126=\"\",J!B126<>\"\"),\"NESTARTOVALO\",IF(AND(J!A126=\"\",J!B126=\"\"),\"\",J!A126))","v":""},{"$f":"IF(AND(J!A126=\"\",J!B126=\"\"),\"\",J!B126)","v":""},null,null,null,"",null,null,null,null,"",null,"",null,"",null,"",null,9000]
[null,{"$f":"J!E127","v":127},{"$f":"IF(AND(J!A127=\"\",J!B127<>\"\"),\"NESTARTOVALO\",IF(AND(J!A127=\"\",J!B127=\"\"),\"\",J!A127))","v":""},{"$f":"IF(AND(J!A127=\"\",J!B127=\"\"),\"\",J!B127)","v":""},null,null,null,"",null,null,null,null,"",null,"",null,"",null,"",null,9000]
[null,{"$f":"J!E128","v":128},{"$f":"IF(AND(J!A128=\"\",J!B128<>\"\"),\"NESTARTOVALO\",IF(AND(J!A128=\"\",J!B128=\"\"),\"\",J!A128))","v":""},{"$f":"IF(AND(J!A128=\"\",J!B128=\"\"),\"\",J!B128)","v":""},null,null,null,"",null,null,null,null,"",null,"",null,"",null,"",null,9000]
[null,{"$f":"J!E129","v":129},{"$f":"IF(AND(J!A129=\"\",J!B129<>\"\"),\"NESTARTOVALO\",IF(AND(J!A129=\"\",J!B129=\"\"),\"\",J!A129))","v":""},{"$f":"IF(AND(J!A129=\"\",J!B129=\"\"),\"\",J!B129)","v":""},null,null,null,"",null,null,null,null,"",null,"",null,{"$f":"IF(C133=\"\",\"\",IF(OR(O133=\"NP\",O133=\"DNF\"),O133,RANK(O133,O$5:O$178,1)))","v":""},null,{"$f":"IF(C133=\"\",\"\",IF(O133=\"NP\",MAX(Q$5:Q$178)+1,IF(O133=\"DNF\",MAX(Q$5:Q$178)+COUNTIF(Q$5:Q$178,\"NP\")+1,RANK(O133,O$5:O$178,1))))","v":""},null,9000]
[null,{"$f":"J!E130","v":130},{"$f":"IF(AND(J!A130=\"\",J!B130<>\"\"),\"NESTARTOVALO\",IF(AND(J!A130=\"\",J!B130=\"\"),\"\",J!A130))","v":""},{"$f":"IF(AND(J!A130=\"\",J!B130=\"\"),\"\",J!B130)","v":""},null,null,null,{"$f":"IF($C134=\"\",\"\",IF(OR($E134=\"DNF\",$F134=\"DNF\",$G134=\"DNF\",AND($E134=\"\",$F134=\"\",$G134=\"\")),\"DNF\",IF(OR($E134=\"NP\",$F134=\"NP\",$G134=\"NP\"),\"NP\",IF(ISERROR(MEDIAN($E134:$G134)),\"DNF\",IF(OR($E134=\"X\",$F134=\"X\",$G134=\"X\",$E134=\"\",$F134=\"\",$G134=\"\",$E134=\"x\",$F134=\"x\",$G134=\"x\"),MAX($E134:$G134),MEDIAN($E134:$G134))))))","v":""},null,null,null,null,{"$f":"IF($C134=\"\",\"\",IF(OR($J134=\"DNF\",$K134=\"DNF\",$L134=\"DNF\",AND($J134=\"\",$K134=\"\",$L134=\"\")),\"DNF\",IF(OR($J134=\"NP\",$K134=\"NP\",$L134=\"NP\"),\"NP\",IF(ISERROR(MEDIAN($J134:$L134)),\"DNF\",IF(OR($J134=\"X\",$K134=\"X\",$L134=\"X\",$J134=\"\",$K134=\"\",$L134=\"\",$J134=\"x\",$K134=\"x\",$L134=\"x\"),MAX($J134:$L134),MEDIAN($J134:$L134))))))","v":""},null,{"$f":"IF(C134=\"\",\"\",IF(OR(AND(H134=\"NP\",M134=\"NP\"),AND(H134=\"DNF\",M134=\"DNF\")),H134,IF(AND(H134=\"NP\",M134=\"DNF\"),H134,IF(AND(H134=\"DNF\",M134=\"NP\"),M134,MIN(H134,M134)))))","v":""},null,"",null,"",null,{"$f":"IF($C134=\"\",9000,MAX(H134,M134)+(COUNTIF($H134:$H134,\"NP\")*600)+(COUNTIF($M134:$M134,\"NP\")*600)+(COUNTIF($H134:$H134,\"DNF\")*3600)+(COUNTIF($M134:$M134,\"DNF\")*3600))","v":9000}]
[null,{"$f":"J!E131","v":131},{"$f":"IF(AND(J!A131=\"\",J!B131<>\"\"),\"NESTARTOVALO\",IF(AND(J!A131=\"\",J!B131=\"\"),\"\",J!A131))","v":""},{"$f":"IF(AND(J!A131=\"\",J!B131=\"\"),\"\",J!B131)","v":""},null,null,null,"",null,null,null,null,"",null,"",null,"",null,"",null,9000]
[null,{"$f":"J!E132","v":132},{"$f":"IF(AND(J!A132=\"\",J!B132<>\"\"),\"NESTARTOVALO\",IF(AND(J!A132=\"\",J!B132=\"\"),\"\",J!A132))","v":""},{"$f":"IF(AND(J!A132=\"\",J!B132=\"\"),\"\",J!B132)","v":""},null,null,null,"",null,null,null,null,"",null,"",null,"",null,"",null,9000]
[null,{"$f":"J!E133","v":133},{"$f":"IF(AND(J!A133=\"\",J!B133<>\"\"),\"NESTARTOVALO\",IF(AND(J!A133=\"\",J!B133=\"\"),\"\",J!A133))","v":""},{"$f":"IF(AND(J!A133=\"\",J!B133=\"\"),\"\",J!B133)","v":""},null,null,null,"",null,null,null,null,"",null,"",null,"",null,"",null,9000]
[null,{"$f":"J!E134","v":134},{"$f":"IF(AND(J!A134=\"\",J!B134<>\"\"),\"NESTARTOVALO\",IF(AND(J!A134=\"\",J!B134=\"\"),\"\",J!A134))","v":""},{"$f":"IF(AND(J!A134=\"\",J!B134=\"\"),\"\",J!B134)","v":""},null,null,null,"",null,null,null,null,"",null,"",null,"",null,"",null,9000]
[null,{"$f":"J!E135","v":135},{"$f":"IF(AND(J!A135=\"\",J!B135<>\"\"),\"NESTARTOVALO\",IF(AND(J!A135=\"\",J!B135=\"\"),\"\",J!A135))","v":""},{"$f":"IF(AND(J!A135=\"\",J!B135=\"\"),\"\",J!B135)","v":""},null,null,null,"",null,null,null,null,"",null,"",null,"",null,"",null,9000]
[null,{"$f":"J!E136","v":136},{"$f":"IF(AND(J!A136=\"\",J!B136<>\"\"),\"NESTARTOVALO\",IF(AND(J!A136=\"\",J!B136=\"\"),\"\",J!A136))","v":""},{"$f":"IF(AND(J!A136=\"\",J!B136=\"\"),\"\",J!B136)","v":""},null,null,null,"",null,null,null,null,"",null,"",null,"",null,"",null,9000]
[null,{"$f":"J!E137","v":137},{"$f":"IF(AND(J!A137=\"\",J!B137<>\"\"),\"NESTARTOVALO\",IF(AND(J!A137=\"\",J!B137=\"\"),\"\",J!A137))","v":""},{"$f":"IF(AND(J!A137=\"\",J!B137=\"\"),\"\",J!B137)","v":""},null,null,null,"",null,null,null,null,"",null,"",null,"",null,"",null,9000]
[null,{"$f":"J!E138","v":138},{"$f":"IF(AND(J!A138=\"\",J!B138<>\"\"),\"NESTARTOVALO\",IF(AND(J!A138=\"\",J!B138=\"\"),\"\",J!A138))","v":""},{"$f":"IF(AND(J!A138=\"\",J!B138=\"\"),\"\",J!B138)","v":""},null,null,null,"",null,null,null,null,"",null,"",null,"",null,"",null,9000]
[null,{"$f":"J!E139","v":139},{"$f":"IF(AND(J!A139=\"\",J!B139<>\"\"),\"NESTARTOVALO\",IF(AND(J!A139=\"\",J!B139=\"\"),\"\",J!A139))","v":""},{"$f":"IF(AND(J!A139=\"\",J!B139=\"\"),\"\",J!B139)","v":""},null,null,null,"",null,null,null,null,"",null,"",null,"",null,"",null,9000]
[null,{"$f":"J!E140","v":140},{"$f":"IF(AND(J!A140=\"\",J!B140<>\"\"),\"NESTARTOVALO\",IF(AND(J!A140=\"\",J!B140=\"\"),\"\",J!A140))","v":""},{"$f":"IF(AND(J!A140=\"\",J!B140=\"\"),\"\",J!B140)","v":""},null,null,null,"",null,null,null,null,"",null,"",null,"",null,"",null,9000]
[null,{"$f":"J!E141","v":141},{"$f":"IF(AND(J!A141=\"\",J!B141<>\"\"),\"NESTARTOVALO\",IF(AND(J!A141=\"\",J!B141=\"\"),\"\",J!A141))","v":""},{"$f":"IF(AND(J!A141=\"\",J!B141=\"\"),\"\",J!B141)","v":""},null,null,null,"",null,null,null,null,"",null,"",null,"",null,"",null,9000]
[null,{"$f":"J!E142","v":142},{"$f":"IF(AND(J!A142=\"\",J!B142<>\"\"),\"NESTARTOVALO\",IF(AND(J!A142=\"\",J!B142=\"\"),\"\",J!A142))","v":""},{"$f":"IF(AND(J!A142=\"\",J!B142=\"\"),\"\",J!B142)","v":""},null,null,null,"",null,null,null,null,"",null,"",null,"",null,"",null,9000]
[null,{"$f":"J!E143","v":143},{"$f":"IF(AND(J!A143=\"\",J!B143<>\"\"),\"NESTARTOVALO\",IF(AND(J!A143=\"\",J!B143=\"\"),\"\",J!A143))","v":""},{"$f":"IF(AND(J!A143=\"\",J!B143=\"\"),\"\",J!B143)","v":""},null,null,null,"",null,null,null,null,"",null,"",null,"",null,"",null,9000]
[null,{"$f":"J!E144","v":144},{"$f":"IF(AND(J!A144=\"\",J!B144<>\"\"),\"NESTARTOVALO\",IF(AND(J!A144=\"\",J!B144=\"\"),\"\",J!A144))","v":""},{"$f":"IF(AND(J!A144=\"\",J!B144=\"\"),\"\",J!B144)","v":""},null,null,null,"",null,null,null,null,"",null,"",null,"",null,"",null,9000]
[null,{"$f":"J!E145","v":145},{"$f":"IF(AND(J!A145=\"\",J!B145<>\"\"),\"NESTARTOVALO\",IF(AND(J!A145=\"\",J!B145=\"\"),\"\",J!A145))","v":""},{"$f":"IF(AND(J!A145=\"\",J!B145=\"\"),\"\",J!B145)","v":""},null,null,null,"",null,null,null,null,"",null,"",null,"",null,"",null,9000]
[null,{"$f":"J!E146","v":146},{"$f":"IF(AND(J!A146=\"\",J!B146<>\"\"),\"NESTARTOVALO\",IF(AND(J!A146=\"\",J!B146=\"\"),\"\",J!A146))","v":""},{"$f":"IF(AND(J!A146=\"\",J!B146=\"\"),\"\",J!B146)","v":""},null,null,null,"",null,null,null,null,"",null,"",null,"",null,"",null,9000]
[null,{"$f":"J!E147","v":147},{"$f":"IF(AND(J!A147=\"\",J!B147<>\"\"),\"NESTARTOVALO\",IF(AND(J!A147=\"\",J!B147=\"\"),\"\",J!A147))","v":""},{"$f":"IF(AND(J!A147=\"\",J!B147=\"\"),\"\",J!B147)","v":""},null,null,null,"",null,null,null,null,"",null,"",null,"",null,"",null,9000]
[null,{"$f":"J!E148","v":148},{"$f":"IF(AND(J!A148=\"\",J!B148<>\"\"),\"NESTARTOVALO\",IF(AND(J!A148=\"\",J!B148=\"\"),\"\",J!A148))","v":""},{"$f":"IF(AND(J!A148=\"\",J!B148=\"\"),\"\",J!B148)","v":""},null,null,null,"",null,null,null,null,"",null,"",null,"",null,"",null,9000]
[null,{"$f":"J!E149","v":149},{"$f":"IF(AND(J!A149=\"\",J!B149<>\"\"),\"NESTARTOVALO\",IF(AND(J!A149=\"\",J!B149=\"\"),\"\",J!A149))","v":""},{"$f":"IF(AND(J!A149=\"\",J!B149=\"\"),\"\",J!B149)","v":""},null,null,null,"",null,null,null,null,"",null,"",null,"",null,"",null,9000]
[null,{"$f":"J!E150","v":150},{"$f":"IF(AND(J!A150=\"\",J!B150<>\"\"),\"NESTARTOVALO\",IF(AND(J!A150=\"\",J!B150=\"\"),\"\",J!A150))","v":""},{"$f":"IF(AND(J!A150=\"\",J!B150=\"\"),\"\",J!B150)","v":""},null,null,null,"",null,null,null,null,"",null,"",null,"",null,"",null,9000]
[null,{"$f":"J!E151","v":151},{"$f":"IF(AND(J!A151=\"\",J!B151<>\"\"),\"NESTARTOVALO\",IF(AND(J!A151=\"\",J!B151=\"\"),\"\",J!A151))","v":""},{"$f":"IF(AND(J!A151=\"\",J!B151=\"\"),\"\",J!B151)","v":""},null,null,null,"",null,null,null,null,"",null,"",null,"",null,"",null,9000]
[null,{"$f":"J!E152","v":152},{"$f":"IF(AND(J!A152=\"\",J!B152<>\"\"),\"NESTARTOVALO\",IF(AND(J!A152=\"\",J!B152=\"\"),\"\",J!A152))","v":""},{"$f":"IF(AND(J!A152=\"\",J!B152=\"\"),\"\",J!B152)","v":""},null,null,null,"",null,null,null,null,"",null,"",null,"",null,"",null,9000]
[null,{"$f":"J!E153","v":153},{"$f":"IF(AND(J!A153=\"\",J!B153<>\"\"),\"NESTARTOVALO\",IF(AND(J!A153=\"\",J!B153=\"\"),\"\",J!A153))","v":""},{"$f":"IF(AND(J!A153=\"\",J!B153=\"\"),\"\",J!B153)","v":""},null,null,null,"",null,null,null,null,"",null,"",null,"",null,"",null,9000]
[null,{"$f":"J!E154","v":154},{"$f":"IF(AND(J!A154=\"\",J!B154<>\"\"),\"NESTARTOVALO\",IF(AND(J!A154=\"\",J!B154=\"\"),\"\",J!A154))","v":""},{"$f":"IF(AND(J!A154=\"\",J!B154=\"\"),\"\",J!B154)","v":""},null,null,null,"",null,null,null,null,"",null,"",null,"",null,"",null,9000]
[null,{"$f":"J!E155","v":155},{"$f":"IF(AND(J!A155=\"\",J!B155<>\"\"),\"NESTARTOVALO\",IF(AND(J!A155=\"\",J!B155=\"\"),\"\",J!A155))","v":""},{"$f":"IF(AND(J!A155=\"\",J!B155=\"\"),\"\",J!B155)","v":""},null,null,null,"",null,null,null,null,"",null,"",null,"",null,"",null,9000]
[null,{"$f":"J!E156","v":156},{"$f":"IF(AND(J!A156=\"\",J!B156<>\"\"),\"NESTARTOVALO\",IF(AND(J!A156=\"\",J!B156=\"\"),\"\",J!A156))","v":""},{"$f":"IF(AND(J!A156=\"\",J!B156=\"\"),\"\",J!B156)","v":""},null,null,null,"",null,null,null,null,"",null,"",null,"",null,"",null,9000]
[null,{"$f":"J!E157","v":157},{"$f":"IF(AND(J!A157=\"\",J!B157<>\"\"),\"NESTARTOVALO\",IF(AND(J!A157=\"\",J!B157=\"\"),\"\",J!A157))","v":""},{"$f":"IF(AND(J!A157=\"\",J!B157=\"\"),\"\",J!B157)","v":""},null,null,null,"",null,null,null,null,"",null,"",null,"",null,"",null,9000]
[null,{"$f":"J!E158","v":158},{"$f":"IF(AND(J!A158=\"\",J!B158<>\"\"),\"NESTARTOVALO\",IF(AND(J!A158=\"\",J!B158=\"\"),\"\",J!A158))","v":""},{"$f":"IF(AND(J!A158=\"\",J!B158=\"\"),\"\",J!B158)","v":""},null,null,null,"",null,null,null,null,"",null,"",null,"",null,"",null,9000]
[null,{"$f":"J!E159","v":159},{"$f":"IF(AND(J!A159=\"\",J!B159<>\"\"),\"NESTARTOVALO\",IF(AND(J!A159=\"\",J!B159=\"\"),\"\",J!A159))","v":""},{"$f":"IF(AND(J!A159=\"\",J!B159=\"\"),\"\",J!B159)","v":""},null,null,null,"",null,null,null,null,"",null,"",null,"",null,"",null,9000]
[null,{"$f":"J!E160","v":160},{"$f":"IF(AND(J!A160=\"\",J!B160<>\"\"),\"NESTARTOVALO\",IF(AND(J!A160=\"\",J!B160=\"\"),\"\",J!A160))","v":""},{"$f":"IF(AND(J!A160=\"\",J!B160=\"\"),\"\",J!B160)","v":""},null,null,null,"",null,null,null,null,"",null,"",null,"",null,"",null,9000]
[null,{"$f":"J!E161","v":161},{"$f":"IF(AND(J!A161=\"\",J!B161<>\"\"),\"NESTARTOVALO\",IF(AND(J!A161=\"\",J!B161=\"\"),\"\",J!A161))","v":""},{"$f":"IF(AND(J!A161=\"\",J!B161=\"\"),\"\",J!B161)","v":""},null,null,null,"",null,null,null,null,"",null,"",null,"",null,"",null,9000]
[null,{"$f":"J!E162","v":162},{"$f":"IF(AND(J!A162=\"\",J!B162<>\"\"),\"NESTARTOVALO\",IF(AND(J!A162=\"\",J!B162=\"\"),\"\",J!A162))","v":""},{"$f":"IF(AND(J!A162=\"\",J!B162=\"\"),\"\",J!B162)","v":""},null,null,null,"",null,null,null,null,"",null,"",null,"",null,"",null,9000]
[null,{"$f":"J!E163","v":163},{"$f":"IF(AND(J!A163=\"\",J!B163<>\"\"),\"NESTARTOVALO\",IF(AND(J!A163=\"\",J!B163=\"\"),\"\",J!A163))","v":""},{"$f":"IF(AND(J!A163=\"\",J!B163=\"\"),\"\",J!B163)","v":""},null,null,null,"",null,null,null,null,"",null,"",null,"",null,"",null,9000]
[null,{"$f":"J!E164","v":164},{"$f":"IF(AND(J!A164=\"\",J!B164<>\"\"),\"NESTARTOVALO\",IF(AND(J!A164=\"\",J!B164=\"\"),\"\",J!A164))","v":""},{"$f":"IF(AND(J!A164=\"\",J!B164=\"\"),\"\",J!B164)","v":""},null,null,null,"",null,null,null,null,"",null,"",null,"",null,"",null,9000]
[null,{"$f":"J!E165","v":165},{"$f":"IF(AND(J!A165=\"\",J!B165<>\"\"),\"NESTARTOVALO\",IF(AND(J!A165=\"\",J!B165=\"\"),\"\",J!A165))","v":""},{"$f":"IF(AND(J!A165=\"\",J!B165=\"\"),\"\",J!B165)","v":""},null,null,null,"",null,null,null,null,"",null,"",null,"",null,"",null,9000]
[null,{"$f":"J!E166","v":166},{"$f":"IF(AND(J!A166=\"\",J!B166<>\"\"),\"NESTARTOVALO\",IF(AND(J!A166=\"\",J!B166=\"\"),\"\",J!A166))","v":""},{"$f":"IF(AND(J!A166=\"\",J!B166=\"\"),\"\",J!B166)","v":""},null,null,null,"",null,null,null,null,"",null,"",null,"",null,"",null,9000]
[null,{"$f":"J!E167","v":167},{"$f":"IF(AND(J!A167=\"\",J!B167<>\"\"),\"NESTARTOVALO\",IF(AND(J!A167=\"\",J!B167=\"\"),\"\",J!A167))","v":""},{"$f":"IF(AND(J!A167=\"\",J!B167=\"\"),\"\",J!B167)","v":""},null,null,null,"",null,null,null,null,"",null,"",null,"",null,"",null,9000]
[null,{"$f":"J!E168","v":168},{"$f":"IF(AND(J!A168=\"\",J!B168<>\"\"),\"NESTARTOVALO\",IF(AND(J!A168=\"\",J!B168=\"\"),\"\",J!A168))","v":""},{"$f":"IF(AND(J!A168=\"\",J!B168=\"\"),\"\",J!B168)","v":""},null,null,null,"",null,null,null,null,"",null,"",null,"",null,"",null,9000]
[null,{"$f":"J!E169","v":169},{"$f":"IF(AND(J!A169=\"\",J!B169<>\"\"),\"NESTARTOVALO\",IF(AND(J!A169=\"\",J!B169=\"\"),\"\",J!A169))","v":""},{"$f":"IF(AND(J!A169=\"\",J!B169=\"\"),\"\",J!B169)","v":""},null,null,null,"",null,null,null,null,"",null,"",null,"",null,"",null,9000]
[null,{"$f":"J!E170","v":170},{"$f":"IF(AND(J!A170=\"\",J!B170<>\"\"),\"NESTARTOVALO\",IF(AND(J!A170=\"\",J!B170=\"\"),\"\",J!A170))","v":""},{"$f":"IF(AND(J!A170=\"\",J!B170=\"\"),\"\",J!B170)","v":""},null,null,null,"",null,null,null,null,"",null,"",null,"",null,"",null,9000]
[null,{"$f":"J!E171","v":171},{"$f":"IF(AND(J!A171=\"\",J!B171<>\"\"),\"NESTARTOVALO\",IF(AND(J!A171=\"\",J!B171=\"\"),\"\",J!A171))","v":""},{"$f":"IF(AND(J!A171=\"\",J!B171=\"\"),\"\",J!B171)","v":""},null,null,null,"",null,null,null,null,"",null,"",null,"",null,"",null,9000]
[null,{"$f":"J!E172","v":172},{"$f":"IF(AND(J!A172=\"\",J!B172<>\"\"),\"NESTARTOVALO\",IF(AND(J!A172=\"\",J!B172=\"\"),\"\",J!A172))","v":""},{"$f":"IF(AND(J!A172=\"\",J!B172=\"\"),\"\",J!B172)","v":""},null,null,null,"",null,null,null,null,"",null,"",null,"",null,"",null,9000]
[null,{"$f":"J!E173","v":173},{"$f":"IF(AND(J!A173=\"\",J!B173<>\"\"),\"NESTARTOVALO\",IF(AND(J!A173=\"\",J!B173=\"\"),\"\",J!A173))","v":""},{"$f":"IF(AND(J!A173=\"\",J!B173=\"\"),\"\",J!B173)","v":""},null,null,null,"",null,null,null,null,"",null,"",null,"",null,"",null,9000]
[null,{"$f":"J!E174","v":174},{"$f":"IF(AND(J!A174=\"\",J!B174<>\"\"),\"NESTARTOVALO\",IF(AND(J!A174=\"\",J!B174=\"\"),\"\",J!A174))","v":""},{"$f":"IF(AND(J!A174=\"\",J!B174=\"\"),\"\",J!B174)","v":""},null,null,null,"",null,null,null,null,"",null,"",null,"",null,"",null,9000]
[null,{"$f":"J!E175","v":175},{"$f":"IF(AND(J!A175=\"\",J!B175<>\"\"),\"NESTARTOVALO\",IF(AND(J!A175=\"\",J!B175=\"\"),\"\",J!A175))","v":""},{"$f":"IF(AND(J!A175=\"\",J!B175=\"\"),\"\",J!B175)","v":""},null,null,null,"",null,null,null,null,"",null,"",null,"",null,"",null,9000]
[null,null,null,null,null,null,null,null,null,null,null,null,null,null,null,null,"",null,"",null,9000]
[null,null,null,null,null,null,null,null,null,null,null,null,null,null,null,null,"",null,"",null,9000]
[null,null,null,null,null,null,null,null,null,null,null,null,null,null,null,null,"",null,"",null,9000]
[null,null,null,null,null,null,null,null,null,null,null,null,null,null,null,null,"",null,"",null,9000]
[null,null,null,null,null,null,null,null,null,null,null,null,null,null,null,null,"",null,"",null,9000]
[null,null,null,null,null,null,null,null,null,null,null,null,null,null,null,null,"",null,"",null,9000]
[null,null,null,null,null,null,null,null,null,null,null,null,null,null,null,null,"",null,"",null,9000]
[null,null,null,null,null,null,null,null,null,null,null,null,null,null,null,null,"",null,"",null,9000]
[null,null,null,null,null,null,null,null,null,null,null,null,null,null,null,null,"",null,"",null,9000]
[null,null,null,null,null,null,null,null,null,null,null,null,null,null,null,null,"",null,"",null,9000]
[null,null,null,null,null,null,null,null,null,null,null,null,null,null,null,null,"",null,"",null,9000]
[null,null,null,null,null,null,null,null,null,null,null,null,null,null,null,null,"",null,"",null,9000]
[null,null,null,null,null,null,null,null,null,null,null,null,null,null,null,null,"",null,"",null,9000]
[null,null,null,null,null,null,null,null,null,null,null,null,null,null,null,null,"",null,"",null,9000]
[null,null,null,null,null,null,null,null,null,null,null,null,null,null,null,null,"",null,"",null,9000]
[null,null,null,null,null,null,null,null,null,null,null,null,null,null,null,null,"",null,"",null,9000]
[null,null,null,null,null,null,null,null,null,null,null,null,null,null,null,null,"",null,"",null,9000]
[null,null,null,null,null,null,null,null,null,null,null,null,null,null,null,null,{"$f":"IF(C197=\"\",\"\",IF(OR(O197=\"NP\",O197=\"DNF\"),O197,RANK(O197,O$5:O$178,1)))","v":""},null,{"$f":"IF(C197=\"\",\"\",IF(O197=\"NP\",MAX(Q$5:Q$178)+1,IF(O197=\"DNF\",MAX(Q$5:Q$178)+COUNTIF(Q$5:Q$178,\"NP\")+1,RANK(O197,O$5:O$178,1))))","v":""},null,9000]
[null,null,null,null,null,null,null,null,null,null,null,null,null,null,null,null,"",null,"",null,{"$f":"IF($C198=\"\",9000,MAX(H198,M198)+(COUNTIF($H198:$H198,\"NP\")*600)+(COUNTIF($M198:$M198,\"NP\")*600)+(COUNTIF($H198:$H198,\"DNF\")*3600)+(COUNTIF($M198:$M198,\"DNF\")*3600))","v":9000}]
[null,null,null,null,null,null,null,null,null,null,null,null,null,null,null,null,"",null,"",null,9000]
[null,null,null,null,null,null,null,null,null,null,null,null,null,null,null,null,"",null,"",null,9000]
[null,null,null,null,null,null,null,null,null,null,null,null,null,null,null,null,"",null,"",null,9000]
[null,null,null,null,null,null,null,null,null,null,null,null,null,null,null,null,"",null,"",null,9000]
[null,null,null,null,null,null,null,null,null,null,null,null,null,null,null,null,"",null,"",null,9000]
[null,null,null,null,null,null,null,null,null,null,null,null,null,null,null,null,"",null,"",null,9000]
[null,null,null,null,null,null,null,null,null,null,null,null,null,null,null,null,"",null,"",null,9000]
[null,null,null,null,null,null,null,null,null,null,null,null,null,null,null,null,"",null,"",null,9000]
[null,null,null,null,null,null,null,null,null,null,null,null,null,null,null,null,"",null,"",null,9000]
[null,null,null,null,null,null,null,null,null,null,null,null,null,null,null,null,"",null,"",null,9000]
[null,null,null,null,null,null,null,null,null,null,null,null,null,null,null,null,"",null,"",null,9000]
[null,null,null,null,null,null,null,null,null,null,null,null,null,null,null,null,"",null,"",null,9000]
[null,null,null,null,null,null,null,null,null,null,null,null,null,null,null,null,"",null,"",null,9000]
[null,null,null,null,null,null,null,null,null,null,null,null,null,null,null,null,"",null,"",null,9000]
[null,null,null,null,null,null,null,null,null,null,null,null,null,null,null,null,"",null,"",null,9000]
[null,null,null,null,null,null,null,null,null,null,null,null,null,null,null,null,"",null,"",null,9000]
[null,null,null,null,null,null,null,null,null,null,null,null,null,null,null,null,"",null,"",null,9000]
[null,null,null,null,null,null,null,null,null,null,null,null,null,null,null,null,"",null,"",null,9000]
[null,null,null,null,null,null,null,null,null,null,null,null,null,null,null,null,"",null,"",null,9000]
[null,null,null,null,null,null,null,null,null,null,null,null,null,null,null,null,"",null,"",null,9000]
[null,null,null,null,null,null,null,null,null,null,null,null,null,null,null,null,"",null,"",null,9000]
[null,null,null,null,null,null,null,null,null,null,null,null,null,null,null,null,"",null,"",null,9000]
[null,null,null,null,null,null,null,null,null,null,null,null,null,null,null,null,"",null,"",null,9000]
[null,null,null,null,null,null,null,null,null,null,null,null,null,null,null,null,"",null,"",null,9000]
[null,null,null,null,null,null,null,null,null,null,null,null,null,null,null,null,"",null,"",null,9000]
[null,null,null,null,null,null,null,null,null,null,null,null,null,null,null,null,"",null,"",null,9000]
[null,null,null,null,null,null,null,null,null,null,null,null,null,null,null,null,"",null,"",null,9000]
[null,null,null,null,null,null,null,null,null,null,null,null,null,null,null,null,"",null,"",null,9000]
[null,null,null,null,null,null,null,null,null,null,null,null,null,null,null,null,"",null,"",null,9000]
[null,null,null,null,null,null,null,null,null,null,null,null,null,null,null,null,"",null,"",null,9000]
[null,null,null,null,null,null,null,null,null,null,null,null,null,null,null,null,"",null,"",null,9000]

{"sheet":"PJ - P","index":12,"n_rows":175,"n_cols":22,"rows_kept":175,"cut":false,"hidden":false,"merged":[]}
[null,40,"Zavoralová Karolína","Skuteč",18.05,null,null,18.05,null,19.739999999999998,"NP",null,"NP",null,18.05,null,1,null,1,null,618.04999999999995,1]
[null,12,"Majvaldová Tereza","Letohrad Kunčice",19.510000000000002,null,null,19.510000000000002,null,19.3,null,null,19.3,null,19.3,null,2,null,2,null,19.510000000000002,2]
[null,22,"Slezáková Nela","Skuteč",22.21,null,null,22.21,null,19.309999999999999,null,null,19.309999999999999,null,19.309999999999999,null,3,null,3,null,22.21,3]
[null,34,"Zavoralová Aneta","Skuteč",19.690000000000001,null,null,19.690000000000001,null,19.57,null,null,19.57,null,19.57,null,4,null,4,null,19.690000000000001,4]
[null,4,"Bubeníčková Denisa","Skuteč",19.68,null,null,19.68,null,19.68,null,null,19.68,null,19.68,null,5,null,5,null,19.68,5]
[null,16,"Novotná Leona","Skuteč",19.68,null,null,19.68,null,20.39,null,null,20.39,null,19.68,null,5,null,5,null,20.39,6]
[null,39,"Kusá Kateřina","Lubná",20.8,null,null,20.8,null,19.68,null,null,19.68,null,19.68,null,5,null,5,null,20.8,7]
[null,27,"Faltysová Marketa","Lubná",19.739999999999998,null,null,19.739999999999998,null,19.510000000000002,"NP",null,"NP",null,19.739999999999998,null,8,null,8,null,619.74,8]
[null,42,"Dudková Martina","Letohrad Kunčice",19.809999999999999,null,null,19.809999999999999,null,25.95,null,null,25.95,null,19.809999999999999,null,9,null,9,null,25.95,9]
[null,25,"Bartoníčková Karolína","Kamenec",20.72,null,null,20.72,null,"NP",null,null,"NP",null,20.72,null,10,null,10,null,620.72,10]
[null,1,"Vraspírová Valerie","Kamenec",21.33,null,null,21.33,null,20.77,null,null,20.77,null,20.77,null,11,null,11,null,21.33,11]
[null,21,"Silová Michaela","Lubná",21.28,null,null,21.28,null,20.89,null,null,20.89,null,20.89,null,12,null,12,null,21.28,12]
[null,13,"Andrlíková Vendula","Kamenec",21.85,null,null,21.85,null,20.92,null,null,20.92,null,20.92,null,13,null,13,null,21.85,13]
[null,18,"Majvaldová Adela","Letohrad Kunčice",24.47,null,null,24.47,null,21.13,null,null,21.13,null,21.13,null,14,null,14,null,24.47,14]
[null,28,"Šulcová Soňa","Skuteč",21.3,null,null,21.3,null,22.01,null,null,22.01,null,21.3,null,15,null,15,null,22.01,15]
[null,38,"Nováková Markéta","Lukavice",21.35,null,null,21.35,null,34.270000000000003,null,null,34.270000000000003,null,21.35,null,16,null,16,null,34.270000000000003,16]
[null,6,"Sýkorová Kateřina","Letohrad Kunčice",22.79,null,null,22.79,null,21.57,null,null,21.57,null,21.57,null,17,null,17,null,22.79,17]
[null,10,"Jonášová Andrea","Skuteč",21.81,"NP",null,"NP",null,21.57,null,null,21.57,null,21.57,null,17,null,17,null,621.57000000000005,18]
[null,17,"Černohorská Nikola ","Bystřec",22.15,null,null,22.15,null,28.73,null,null,28.73,null,22.15,null,19,null,19,null,28.73,19]
[null,41,"Dolečková Kristýna","Bystřec",22.25,null,null,22.25,null,22.72,null,null,22.72,null,22.25,null,20,null,20,null,22.72,20]
[null,19,"Cejpová Jana","Kamenec",22.31,null,null,22.31,null,25.49,null,null,25.49,null,22.31,null,21,null,21,null,25.49,21]
[null,15,"Zachová Aneta","Lubná",22.55,null,null,22.55,null,22.38,null,null,22.38,null,22.38,null,22,null,22,null,22.55,22]
[null,7,"Cejpová Adéla","Kamenec",25.1,null,null,25.1,null,22.48,null,null,22.48,null,22.48,null,23,null,23,null,25.1,23]
[null,31,"Andrlíková Anna","Kamenec",23.02,null,null,23.02,null,22.73,null,null,22.73,null,22.73,null,24,null,24,null,23.02,24]
[null,20,"Zavoralová Klára","Lukavice",23.23,null,null,23.23,null,22.96,null,null,22.96,null,22.96,null,25,null,25,null,23.23,25]
[null,3,"Zachová Lenka","Lubná",24.87,null,null,24.87,null,22.98,null,null,22.98,null,22.98,null,26,null,26,null,24.87,26]
[null,30,"Sýkorová Veronika","Letohrad Kunčice",23.86,null,null,23.86,null,23.02,null,null,23.02,null,23.02,null,27,null,27,null,23.86,27]
[null,2,"Štveráková Kristýna","Lukavice",23.16,null,null,23.16,null,24.21,null,null,24.21,null,23.16,null,28,null,28,null,24.21,28]
[null,23,"Hrdinová Adéla","Bystřec",23.3,null,null,23.3,null,23.84,null,null,23.84,null,23.3,null,29,null,29,null,23.84,29]
[null,32,"Hospodková Tereza","Lukavice",31.29,"NP",null,"NP",null,23.45,null,null,23.45,null,23.45,null,30,null,30,null,623.45000000000005,30]
[null,24,"Krejsová Nikola","Letohrad Kunčice",23.57,null,null,23.57,null,24.32,null,null,24.32,null,23.57,null,31,null,31,null,24.32,31]
[null,33,"Brázdová Ilona","Lubná",32.89,"NP",null,"NP",null,23.58,null,null,23.58,null,23.58,null,32,null,32,null,623.58000000000004,32]
[null,11,"Vaníčková Tereza","Bystřec",24.27,null,null,24.27,null,23.93,null,null,23.93,null,23.93,null,33,null,33,null,24.27,33]
[null,29,"Hrdinová Lucie","Bystřec",24.03,null,null,24.03,null,24.53,null,null,24.53,null,24.03,null,34,null,34,null,24.53,34]
[null,36,"Strasmeierová Eliška","Letohrad Kunčice",24.06,null,null,24.06,null,25.68,null,null,25.68,null,24.06,null,35,null,35,null,25.68,35]
[null,14,"Bočková Sára","Lukavice",24.39,null,null,24.39,null,34.31,null,null,34.31,null,24.39,null,36,null,36,null,34.31,36]
[null,9,"Lorencová Veronika","Lubná","NP",null,null,"NP",null,24.73,null,null,24.73,null,24.73,null,37,null,37,null,624.73,37]
[null,8,"Marečková Pavla","Lukavice",25.14,null,null,25.14,null,24.92,null,null,24.92,null,24.92,null,38,null,38,null,25.14,38]
[null,26,"Marečková Veronika","Lukavice",26.76,null,null,26.76,null,26.2,null,null,26.2,null,26.2,null,39,null,39,null,26.76,39]
[null,5,"Kumulová Eliška","Bystřec",30.64,"NP",null,"NP",null,28.66,null,null,28.66,null,28.66,null,40,null,40,null,628.66,40]
[null,35,"Pfeiferová Valerie","Bystřec",33.090000000000003,"NP",null,"NP",null,34.83,null,null,34.83,null,34.83,null,41,null,41,null,634.83000000000004,41]
[null,37,"Němcová Barbora","Kamenec","NP",null,null,"NP",null,"DNF",null,null,"DNF",null,"NP",null,"NP",null,42,null,4200,42]
[null,43,"","",null,null,null,"",null,null,null,null,"",null,"",null,"",null,"",null,9000,43]
[null,44,"","",null,null,null,"",null,null,null,null,"",null,"",null,"",null,"",null,9000,43]
[null,45,"","",null,null,null,"",null,null,null,null,"",null,"",null,"",null,"",null,9000,43]
[null,46,"","",null,null,null,"",null,null,null,null,"",null,"",null,"",null,"",null,9000,43]
[null,47,"","",null,null,null,"",null,null,null,null,"",null,"",null,"",null,"",null,9000,43]
[null,48,"","",null,null,null,"",null,null,null,null,"",null,"",null,"",null,"",null,9000,43]
[null,49,"","",null,null,null,"",null,null,null,null,"",null,"",null,"",null,"",null,9000,43]
[null,50,"","",null,null,null,"",null,null,null,null,"",null,"",null,"",null,"",null,9000,43]
[null,51,"","",null,null,null,"",null,null,null,null,"",null,"",null,"",null,"",null,9000,43]
[null,52,"","",null,null,null,"",null,null,null,null,"",null,"",null,"",null,"",null,9000,43]
[null,53,"","",null,null,null,"",null,null,null,null,"",null,"",null,"",null,"",null,9000,43]
[null,54,"","",null,null,null,"",null,null,null,null,"",null,"",null,"",null,"",null,9000,43]
[null,55,"","",null,null,null,"",null,null,null,null,"",null,"",null,"",null,"",null,9000,43]
[null,56,"","",null,null,null,"",null,null,null,null,"",null,"",null,"",null,"",null,9000,43]
[null,57,"","",null,null,null,"",null,null,null,null,"",null,"",null,"",null,"",null,9000,43]
[null,58,"","",null,null,null,"",null,null,null,null,"",null,"",null,"",null,"",null,9000,43]
[null,59,"","",null,null,null,"",null,null,null,null,"",null,"",null,"",null,"",null,9000,43]
[null,60,"","",null,null,null,"",null,null,null,null,"",null,"",null,"",null,"",null,9000,43]
[null,61,"","",null,null,null,"",null,null,null,null,"",null,"",null,"",null,"",null,9000,43]
[null,62,"","",null,null,null,"",null,null,null,null,"",null,"",null,"",null,"",null,9000,43]
[null,63,"","",null,null,null,"",null,null,null,null,"",null,"",null,"",null,"",null,9000,43]
[null,64,"","",null,null,null,"",null,null,null,null,"",null,"",null,"",null,"",null,9000,43]
[null,65,"","",null,null,null,"",null,null,null,null,"",null,"",null,"",null,"",null,9000,43]
[null,66,"","",null,null,null,"",null,null,null,null,"",null,"",null,"",null,"",null,9000,43]
[null,67,"","",null,null,null,"",null,null,null,null,"",null,"",null,"",null,"",null,9000,43]
[null,68,"","",null,null,null,"",null,null,null,null,"",null,"",null,"",null,"",null,9000,43]
[null,69,"","",null,null,null,"",null,null,null,null,"",null,"",null,"",null,"",null,9000,43]
[null,70,"","",null,null,null,"",null,null,null,null,"",null,"",null,"",null,"",null,9000,43]
[null,71,"","",null,null,null,"",null,null,null,null,"",null,"",null,"",null,"",null,9000,43]
[null,72,"","",null,null,null,"",null,null,null,null,"",null,"",null,"",null,"",null,9000,43]
[null,73,"","",null,null,null,"",null,null,null,null,"",null,"",null,"",null,"",null,9000,43]
[null,74,"","",null,null,null,"",null,null,null,null,"",null,"",null,"",null,"",null,9000,43]
[null,75,"","",null,null,null,"",null,null,null,null,"",null,"",null,"",null,"",null,9000,43]
[null,76,"","",null,null,null,"",null,null,null,null,"",null,"",null,"",null,"",null,9000,43]
[null,77,"","",null,null,null,"",null,null,null,null,"",null,"",null,"",null,"",null,9000,43]
[null,78,"","",null,null,null,"",null,null,null,null,"",null,"",null,"",null,"",null,9000,43]
[null,79,"","",null,null,null,"",null,null,null,null,"",null,"",null,"",null,"",null,9000,43]
[null,80,"","",null,null,null,"",null,null,null,null,"",null,"",null,"",null,"",null,9000,43]
[null,81,"","",null,null,null,"",null,null,null,null,"",null,"",null,"",null,"",null,9000,43]
[null,82,"","",null,null,null,"",null,null,null,null,"",null,"",null,"",null,"",null,9000,43]
[null,83,"","",null,null,null,"",null,null,null,null,"",null,"",null,"",null,"",null,9000,43]
[null,84,"","",null,null,null,"",null,null,null,null,"",null,"",null,"",null,"",null,9000,43]
[null,85,"","",null,null,null,"",null,null,null,null,"",null,"",null,"",null,"",null,9000,43]
[null,86,"","",null,null,null,"",null,null,null,null,"",null,"",null,"",null,"",null,9000,43]
[null,87,"","",null,null,null,"",null,null,null,null,"",null,"",null,"",null,"",null,9000,43]
[null,88,"","",null,null,null,"",null,null,null,null,"",null,"",null,"",null,"",null,9000,43]
[null,89,"","",null,null,null,"",null,null,null,null,"",null,"",null,"",null,"",null,9000,43]
[null,90,"","",null,null,null,"",null,null,null,null,"",null,"",null,"",null,"",null,9000,43]
[null,91,"","",null,null,null,"",null,null,null,null,"",null,"",null,"",null,"",null,9000,43]
[null,92,"","",null,null,null,"",null,null,null,null,"",null,"",null,"",null,"",null,9000,43]
[null,93,"","",null,null,null,"",null,null,null,null,"",null,"",null,"",null,"",null,9000,43]
[null,94,"","",null,null,null,"",null,null,null,null,"",null,"",null,"",null,"",null,9000,43]
[null,95,"","",null,null,null,"",null,null,null,null,"",null,"",null,"",null,"",null,9000,43]
[null,96,"","",null,null,null,"",null,null,null,null,"",null,"",null,"",null,"",null,9000,43]
[null,97,"","",null,null,null,"",null,null,null,null,"",null,"",null,"",null,"",null,9000,43]
[null,98,"","",null,null,null,"",null,null,null,null,"",null,"",null,"",null,"",null,9000,43]
[null,99,"","",null,null,null,"",null,null,null,null,"",null,"",null,"",null,"",null,9000,43]
[null,100,"","",null,null,null,"",null,null,null,null,"",null,"",null,"",null,"",null,9000,43]
[null,101,"","",null,null,null,"",null,null,null,null,"",null,"",null,"",null,"",null,9000,43]
[null,102,"","",null,null,null,"",null,null,null,null,"",null,"",null,"",null,"",null,9000,43]
[null,103,"","",null,null,null,"",null,null,null,null,"",null,"",null,"",null,"",null,9000,43]
[null,104,"","",null,null,null,"",null,null,null,null,"",null,"",null,"",null,"",null,9000,43]
[null,105,"","",null,null,null,"",null,null,null,null,"",null,"",null,"",null,"",null,9000,43]
[null,106,"","",null,null,null,"",null,null,null,null,"",null,"",null,"",null,"",null,9000,43]
[null,107,"","",null,null,null,"",null,null,null,null,"",null,"",null,"",null,"",null,9000,43]
[null,108,"","",null,null,null,"",null,null,null,null,"",null,"",null,"",null,"",null,9000,43]
[null,109,"","",null,null,null,"",null,null,null,null,"",null,"",null,"",null,"",null,9000,43]
[null,110,"","",null,null,null,"",null,null,null,null,"",null,"",null,"",null,"",null,9000,43]
[null,111,"","",null,null,null,"",null,null,null,null,"",null,"",null,"",null,"",null,9000,43]
[null,112,"","",null,null,null,"",null,null,null,null,"",null,"",null,"",null,"",null,9000,43]
[null,113,"","",null,null,null,"",null,null,null,null,"",null,"",null,"",null,"",null,9000,43]
[null,114,"","",null,null,null,"",null,null,null,null,"",null,"",null,"",null,"",null,9000,43]
[null,115,"","",null,null,null,"",null,null,null,null,"",null,"",null,"",null,"",null,9000,43]
[null,116,"","",null,null,null,"",null,null,null,null,"",null,"",null,"",null,"",null,9000,43]
[null,117,"","",null,null,null,"",null,null,null,null,"",null,"",null,"",null,"",null,9000,43]
[null,118,"","",null,null,null,"",null,null,null,null,"",null,"",null,"",null,"",null,9000,43]
[null,119,"","",null,null,null,"",null,null,null,null,"",null,"",null,"",null,"",null,9000,43]
[null,120,"","",null,null,null,"",null,null,null,null,"",null,"",null,"",null,"",null,9000,43]
[null,121,"","",null,null,null,"",null,null,null,null,"",null,"",null,"",null,"",null,9000,43]
[null,122,"","",null,null,null,"",null,null,null,null,"",null,"",null,"",null,"",null,9000,43]
[null,123,"","",null,null,null,"",null,null,null,null,"",null,"",null,"",null,"",null,9000,43]
[null,124,"","",null,null,null,"",null,null,null,null,"",null,"",null,"",null,"",null,9000,43]
[null,125,"","",null,null,null,"",null,null,null,null,"",null,"",null,"",null,"",null,9000,43]
[null,126,"","",null,null,null,"",null,null,null,null,"",null,"",null,"",null,"",null,9000,43]
[null,127,"","",null,null,null,"",null,null,null,null,"",null,"",null,"",null,"",null,9000,43]
[null,128,"","",null,null,null,"",null,null,null,null,"",null,"",null,"",null,"",null,9000,43]
[null,129,"","",null,null,null,"",null,null,null,null,"",null,"",null,"",null,"",null,9000,43]
[null,130,"","",null,null,null,"",null,null,null,null,"",null,"",null,"",null,"",null,9000,43]
[null,131,"","",null,null,null,"",null,null,null,null,"",null,"",null,"",null,"",null,9000,43]
[null,132,"","",null,null,null,"",null,null,null,null,"",null,"",null,"",null,"",null,9000,43]
[null,133,"","",null,null,null,"",null,null,null,null,"",null,"",null,"",null,"",null,9000,43]
[null,134,"","",null,null,null,"",null,null,null,null,"",null,"",null,"",null,"",null,9000,43]
[null,135,"","",null,null,null,"",null,null,null,null,"",null,"",null,"",null,"",null,9000,43]
[null,136,"","",null,null,null,"",null,null,null,null,"",null,"",null,"",null,"",null,9000,43]
[null,137,"","",null,null,null,"",null,null,null,null,"",null,"",null,"",null,"",null,9000,43]
[null,138,"","",null,null,null,"",null,null,null,null,"",null,"",null,"",null,"",null,9000,43]
[null,139,"","",null,null,null,"",null,null,null,null,"",null,"",null,"",null,"",null,9000,43]
[null,140,"","",null,null,null,"",null,null,null,null,"",null,"",null,"",null,"",null,9000,43]
[null,141,"","",null,null,null,"",null,null,null,null,"",null,"",null,"",null,"",null,9000,43]
[null,142,"","",null,null,null,"",null,null,null,null,"",null,"",null,"",null,"",null,9000,43]
[null,143,"","",null,null,null,"",null,null,null,null,"",null,"",null,"",null,"",null,9000,43]
[null,144,"","",null,null,null,"",null,null,null,null,"",null,"",null,"",null,"",null,9000,43]
[null,145,"","",null,null,null,"",null,null,null,null,"",null,"",null,"",null,"",null,9000,43]
[null,146,"","",null,null,null,"",null,null,null,null,"",null,"",null,"",null,"",null,9000,43]
[null,147,"","",null,null,null,"",null,null,null,null,"",null,"",null,"",null,"",null,9000,43]
[null,148,"","",null,null,null,"",null,null,null,null,"",null,"",null,"",null,"",null,9000,43]
[null,149,"","",null,null,null,"",null,null,null,null,"",null,"",null,"",null,"",null,9000,43]
[null,150,"","",null,null,null,"",null,null,null,null,"",null,"",null,"",null,"",null,9000,43]
[null,151,"","",null,null,null,"",null,null,null,null,"",null,"",null,"",null,"",null,9000,43]
[null,152,"","",null,null,null,"",null,null,null,null,"",null,"",null,"",null,"",null,9000,43]
[null,153,"","",null,null,null,"",null,null,null,null,"",null,"",null,"",null,"",null,9000,43]
[null,154,"","",null,null,null,"",null,null,null,null,"",null,"",null,"",null,"",null,9000,43]
[null,155,"","",null,null,null,"",null,null,null,null,"",null,"",null,"",null,"",null,9000,43]
[null,156,"","",null,null,null,"",null,null,null,null,"",null,"",null,"",null,"",null,9000,43]
[null,157,"","",null,null,null,"",null,null,null,null,"",null,"",null,"",null,"",null,9000,43]
[null,158,"","",null,null,null,"",null,null,null,null,"",null,"",null,"",null,"",null,9000,43]
[null,159,"","",null,null,null,"",null,null,null,null,"",null,"",null,"",null,"",null,9000,43]
[null,160,"","",null,null,null,"",null,null,null,null,"",null,"",null,"",null,"",null,9000,43]
[null,161,"","",null,null,null,"",null,null,null,null,"",null,"",null,"",null,"",null,9000,43]
[null,162,"","",null,null,null,"",null,null,null,null,"",null,"",null,"",null,"",null,9000,43]
[null,163,"","",null,null,null,"",null,null,null,null,"",null,"",null,"",null,"",null,9000,43]
[null,164,"","",null,null,null,"",null,null,null,null,"",null,"",null,"",null,"",null,9000,43]
[null,165,"","",null,null,null,"",null,null,null,null,"",null,"",null,"",null,"",null,9000,43]
[null,166,"","",null,null,null,"",null,null,null,null,"",null,"",null,"",null,"",null,9000,43]
[null,167,"","",null,null,null,"",null,null,null,null,"",null,"",null,"",null,"",null,9000,43]
[null,168,"","",null,null,null,"",null,null,null,null,"",null,"",null,"",null,"",null,9000,43]
[null,169,"","",null,null,null,"",null,null,null,null,"",null,"",null,"",null,"",null,9000,43]
[null,170,"","",null,null,null,"",null,null,null,null,"",null,"",null,"",null,"",null,9000,43]
[null,171,"","",null,null,null,"",null,null,null,null,"",null,"",null,"",null,"",null,9000,43]
[null,172,"","",null,null,null,"",null,null,null,null,"",null,"",null,"",null,"",null,9000,43]
[null,173,"","",null,null,null,"",null,null,null,null,"",null,"",null,"",null,"",null,9000,43]
[null,174,"","",null,null,null,"",null,null,null,null,"",null,"",null,"",null,"",null,9000,43]
[null,175,"","",null,null,null,"",null,null,null,null,"",null,"",null,"",null,"",null,9000,43]

{"sheet":"PJ - PAll","index":13,"n_rows":225,"n_cols":22,"rows_kept":225,"cut":false,"hidden":false,"merged":[]}
[null,1,"","",null,null,null,"",null,null,null,null,"",null,"",null,"",null,"",null,9000,1]
[null,2,"","",null,null,null,"",null,null,null,null,"",null,"",null,"",null,"",null,9000,1]
[null,3,"","",null,null,null,"",null,null,null,null,"",null,"",null,"",null,"",null,9000,1]
[null,4,"","",null,null,null,"",null,null,null,null,"",null,"",null,"",null,"",null,9000,1]
[null,5,"","",null,null,null,"",null,null,null,null,"",null,"",null,"",null,"",null,9000,1]
[null,6,"","",null,null,null,"",null,null,null,null,"",null,"",null,"",null,"",null,9000,1]
[null,7,"","",null,null,null,"",null,null,null,null,"",null,"",null,"",null,"",null,9000,1]
[null,8,"","",null,null,null,"",null,null,null,null,"",null,"",null,"",null,"",null,9000,1]
[null,9,"","",null,null,null,"",null,null,null,null,"",null,"",null,"",null,"",null,9000,1]
[null,10,"","",null,null,null,"",null,null,null,null,"",null,"",null,"",null,"",null,9000,1]
[null,11,"","",null,null,null,"",null,null,null,null,"",null,"",null,"",null,"",null,9000,1]
[null,12,"","",null,null,null,"",null,null,null,null,"",null,"",null,"",null,"",null,9000,1]
[null,13,"","",null,null,null,"",null,null,null,null,"",null,"",null,"",null,"",null,9000,1]
[null,14,"","",null,null,null,"",null,null,null,null,"",null,"",null,"",null,"",null,9000,1]
[null,15,"","",null,null,null,"",null,null,null,null,"",null,"",null,"",null,"",null,9000,1]
[null,16,"","",null,null,null,"",null,null,null,null,"",null,"",null,"",null,"",null,9000,1]
[null,17,"","",null,null,null,"",null,null,null,null,"",null,"",null,"",null,"",null,9000,1]
[null,18,"","",null,null,null,"",null,null,null,null,"",null,"",null,"",null,"",null,9000,1]
[null,19,"","",null,null,null,"",null,null,null,null,"",null,"",null,"",null,"",null,9000,1]
[null,20,"","",null,null,null,"",null,null,null,null,"",null,"",null,"",null,"",null,9000,1]
[null,21,"","",null,null,null,"",null,null,null,null,"",null,"",null,"",null,"",null,9000,1]
[null,22,"","",null,null,null,"",null,null,null,null,"",null,"",null,"",null,"",null,9000,1]
[null,23,"","",null,null,null,"",null,null,null,null,"",null,"",null,"",null,"",null,9000,1]
[null,24,"","",null,null,null,"",null,null,null,null,"",null,"",null,"",null,"",null,9000,1]
[null,25,"","",null,null,null,"",null,null,null,null,"",null,"",null,"",null,"",null,9000,1]
[null,26,"","",null,null,null,"",null,null,null,null,"",null,"",null,"",null,"",null,9000,1]
[null,27,"","",null,null,null,"",null,null,null,null,"",null,"",null,"",null,"",null,9000,1]
[null,28,"","",null,null,null,"",null,null,null,null,"",null,"",null,"",null,"",null,9000,1]
[null,29,"","",null,null,null,"",null,null,null,null,"",null,"",null,"",null,"",null,9000,1]
[null,30,"","",null,null,null,"",null,null,null,null,"",null,"",null,"",null,"",null,9000,1]
[null,31,"","",null,null,null,"",null,null,null,null,"",null,"",null,"",null,"",null,9000,1]
[null,32,"","",null,null,null,"",null,null,null,null,"",null,"",null,"",null,"",null,9000,1]
[null,33,"","",null,null,null,"",null,null,null,null,"",null,"",null,"",null,"",null,9000,1]
[null,34,"","",null,null,null,"",null,null,null,null,"",null,"",null,"",null,"",null,9000,1]
[null,35,"","",null,null,null,"",null,null,null,null,"",null,"",null,"",null,"",null,9000,1]
[null,36,"","",null,null,null,"",null,null,null,null,"",null,"",null,"",null,"",null,9000,1]
[null,37,"","",null,null,null,"",null,null,null,null,"",null,"",null,"",null,"",null,9000,1]
[null,38,"","",null,null,null,"",null,null,null,null,"",null,"",null,"",null,"",null,9000,1]
[null,39,"","",null,null,null,"",null,null,null,null,"",null,"",null,"",null,"",null,9000,1]
[null,40,"","",null,null,null,"",null,null,null,null,"",null,"",null,"",null,"",null,9000,1]
[null,41,"","",null,null,null,"",null,null,null,null,"",null,"",null,"",null,"",null,9000,1]
[null,42,"","",null,null,null,"",null,null,null,null,"",null,"",null,"",null,"",null,9000,1]
[null,43,"","",null,null,null,"",null,null,null,null,"",null,"",null,"",null,"",null,9000,1]
[null,44,"","",null,null,null,"",null,null,null,null,"",null,"",null,"",null,"",null,9000,1]
[null,45,"","",null,null,null,"",null,null,null,null,"",null,"",null,"",null,"",null,9000,1]
[null,46,"","",null,null,null,"",null,null,null,null,"",null,"",null,"",null,"",null,9000,1]
[null,47,"","",null,null,null,"",null,null,null,null,"",null,"",null,"",null,"",null,9000,1]
[null,48,"","",null,null,null,"",null,null,null,null,"",null,"",null,"",null,"",null,9000,1]
[null,49,"","",null,null,null,"",null,null,null,null,"",null,"",null,"",null,"",null,9000,1]
[null,50,"","",null,null,null,"",null,null,null,null,"",null,"",null,"",null,"",null,9000,1]
[null,51,"","",null,null,null,"",null,null,null,null,"",null,"",null,"",null,"",null,9000,1]
[null,52,"","",null,null,null,"",null,null,null,null,"",null,"",null,"",null,"",null,9000,1]
[null,53,"","",null,null,null,"",null,null,null,null,"",null,"",null,"",null,"",null,9000,1]
[null,54,"","",null,null,null,"",null,null,null,null,"",null,"",null,"",null,"",null,9000,1]
[null,55,"","",null,null,null,"",null,null,null,null,"",null,"",null,"",null,"",null,9000,1]
[null,56,"","",null,null,null,"",null,null,null,null,"",null,"",null,"",null,"",null,9000,1]
[null,57,"","",null,null,null,"",null,null,null,null,"",null,"",null,"",null,"",null,9000,1]
[null,58,"","",null,null,null,"",null,null,null,null,"",null,"",null,"",null,"",null,9000,1]
[null,59,"","",null,null,null,"",null,null,null,null,"",null,"",null,"",null,"",null,9000,1]
[null,60,"","",null,null,null,"",null,null,null,null,"",null,"",null,"",null,"",null,9000,1]
[null,61,"","",null,null,null,"",null,null,null,null,"",null,"",null,"",null,"",null,9000,1]
[null,62,"","",null,null,null,"",null,null,null,null,"",null,"",null,"",null,"",null,9000,1]
[null,63,"","",null,null,null,"",null,null,null,null,"",null,"",null,"",null,"",null,9000,1]
[null,64,"","",null,null,null,"",null,null,null,null,"",null,"",null,"",null,"",null,9000,1]
[null,65,"","",null,null,null,"",null,null,null,null,"",null,"",null,"",null,"",null,9000,1]
[null,66,"","",null,null,null,"",null,null,null,null,"",null,"",null,"",null,"",null,9000,1]
[null,67,"","",null,null,null,"",null,null,null,null,"",null,"",null,"",null,"",null,9000,1]
[null,68,"","",null,null,null,"",null,null,null,null,"",null,"",null,"",null,"",null,9000,1]
[null,69,"","",null,null,null,"",null,null,null,null,"",null,"",null,"",null,"",null,9000,1]
[null,70,"","",null,null,null,"",null,null,null,null,"",null,"",null,"",null,"",null,9000,1]
[null,71,"","",null,null,null,"",null,null,null,null,"",null,"",null,"",null,"",null,9000,1]
[null,72,"","",null,null,null,"",null,null,null,null,"",null,"",null,"",null,"",null,9000,1]
[null,73,"","",null,null,null,"",null,null,null,null,"",null,"",null,"",null,"",null,9000,1]
[null,74,"","",null,null,null,"",null,null,null,null,"",null,"",null,"",null,"",null,9000,1]
[null,75,"","",null,null,null,"",null,null,null,null,"",null,"",null,"",null,"",null,9000,1]
[null,76,"","",null,null,null,"",null,null,null,null,"",null,"",null,"",null,"",null,9000,1]
[null,77,"","",null,null,null,"",null,null,null,null,"",null,"",null,"",null,"",null,9000,1]
[null,78,"","",null,null,null,"",null,null,null,null,"",null,"",null,"",null,"",null,9000,1]
[null,79,"","",null,null,null,"",null,null,null,null,"",null,"",null,"",null,"",null,9000,1]
[null,80,"","",null,null,null,"",null,null,null,null,"",null,"",null,"",null,"",null,9000,1]
[null,81,"","",null,null,null,"",null,null,null,null,"",null,"",null,"",null,"",null,9000,1]
[null,82,"","",null,null,null,"",null,null,null,null,"",null,"",null,"",null,"",null,9000,1]
[null,83,"","",null,null,null,"",null,null,null,null,"",null,"",null,"",null,"",null,9000,1]
[null,84,"","",null,null,null,"",null,null,null,null,"",null,"",null,"",null,"",null,9000,1]
[null,85,"","",null,null,null,"",null,null,null,null,"",null,"",null,"",null,"",null,9000,1]
[null,86,"","",null,null,null,"",null,null,null,null,"",null,"",null,"",null,"",null,9000,1]
[null,87,"","",null,null,null,"",null,null,null,null,"",null,"",null,"",null,"",null,9000,1]
[null,88,"","",null,null,null,"",null,null,null,null,"",null,"",null,"",null,"",null,9000,1]
[null,89,"","",null,null,null,"",null,null,null,null,"",null,"",null,"",null,"",null,9000,1]
[null,90,"","",null,null,null,"",null,null,null,null,"",null,"",null,"",null,"",null,9000,1]
[null,91,"","",null,null,null,"",null,null,null,null,"",null,"",null,"",null,"",null,9000,1]
[null,92,"","",null,null,null,"",null,null,null,null,"",null,"",null,"",null,"",null,9000,1]
[null,93,"","",null,null,null,"",null,null,null,null,"",null,"",null,"",null,"",null,9000,1]
[null,94,"","",null,null,null,"",null,null,null,null,"",null,"",null,"",null,"",null,9000,1]
[null,95,"","",null,null,null,"",null,null,null,null,"",null,"",null,"",null,"",null,9000,1]
[null,96,"","",null,null,null,"",null,null,null,null,"",null,"",null,"",null,"",null,9000,1]
[null,97,"","",null,null,null,"",null,null,null,null,"",null,"",null,"",null,"",null,9000,1]
[null,98,"","",null,null,null,"",null,null,null,null,"",null,"",null,"",null,"",null,9000,1]
[null,99,"","",null,null,null,"",null,null,null,null,"",null,"",null,"",null,"",null,9000,1]
[null,100,"","",null,null,null,"",null,null,null,null,"",null,"",null,"",null,"",null,9000,1]
[null,101,"","",null,null,null,"",null,null,null,null,"",null,"",null,"",null,"",null,9000,1]
[null,102,"","",null,null,null,"",null,null,null,null,"",null,"",null,"",null,"",null,9000,1]
[null,103,"","",null,null,null,"",null,null,null,null,"",null,"",null,"",null,"",null,9000,1]
[null,104,"","",null,null,null,"",null,null,null,null,"",null,"",null,"",null,"",null,9000,1]
[null,105,"","",null,null,null,"",null,null,null,null,"",null,"",null,"",null,"",null,9000,1]
[null,106,"","",null,null,null,"",null,null,null,null,"",null,"",null,"",null,"",null,9000,1]
[null,107,"","",null,null,null,"",null,null,null,null,"",null,"",null,"",null,"",null,9000,1]
[null,108,"","",null,null,null,"",null,null,null,null,"",null,"",null,"",null,"",null,9000,1]
[null,109,"","",null,null,null,"",null,null,null,null,"",null,"",null,"",null,"",null,9000,1]
[null,110,"","",null,null,null,"",null,null,null,null,"",null,"",null,"",null,"",null,9000,1]
[null,111,"","",null,null,null,"",null,null,null,null,"",null,"",null,"",null,"",null,9000,1]
[null,112,"","",null,null,null,"",null,null,null,null,"",null,"",null,"",null,"",null,9000,1]
[null,113,"","",null,null,null,"",null,null,null,null,"",null,"",null,"",null,"",null,9000,1]
[null,114,"","",null,null,null,"",null,null,null,null,"",null,"",null,"",null,"",null,9000,1]
[null,115,"","",null,null,null,"",null,null,null,null,"",null,"",null,"",null,"",null,9000,1]
[null,116,"","",null,null,null,"",null,null,null,null,"",null,"",null,"",null,"",null,9000,1]
[null,117,"","",null,null,null,"",null,null,null,null,"",null,"",null,"",null,"",null,9000,1]
[null,118,"","",null,null,null,"",null,null,null,null,"",null,"",null,"",null,"",null,9000,1]
[null,119,"","",null,null,null,"",null,null,null,null,"",null,"",null,"",null,"",null,9000,1]
[null,120,"","",null,null,null,"",null,null,null,null,"",null,"",null,"",null,"",null,9000,1]
[null,121,"","",null,null,null,"",null,null,null,null,"",null,"",null,"",null,"",null,9000,1]
[null,122,"","",null,null,null,"",null,null,null,null,"",null,"",null,"",null,"",null,9000,1]
[null,123,"","",null,null,null,"",null,null,null,null,"",null,"",null,"",null,"",null,9000,1]
[null,124,"","",null,null,null,"",null,null,null,null,"",null,"",null,"",null,"",null,9000,1]
[null,125,"","",null,null,null,"",null,null,null,null,"",null,"",null,"",null,"",null,9000,1]
[null,126,"","",null,null,null,"",null,null,null,null,"",null,"",null,"",null,"",null,9000,1]
[null,127,"","",null,null,null,"",null,null,null,null,"",null,"",null,"",null,"",null,9000,1]
[null,128,"","",null,null,null,"",null,null,null,null,"",null,"",null,"",null,"",null,9000,1]
[null,129,"","",null,null,null,"",null,null,null,null,"",null,"",null,"",null,"",null,9000,1]
[null,130,"","",null,null,null,"",null,null,null,null,"",null,"",null,"",null,"",null,9000,1]
[null,131,"","",null,null,null,"",null,null,null,null,"",null,"",null,"",null,"",null,9000,1]
[null,132,"","",null,null,null,"",null,null,null,null,"",null,"",null,"",null,"",null,9000,1]
[null,133,"","",null,null,null,"",null,null,null,null,"",null,"",null,"",null,"",null,9000,1]
[null,134,"","",null,null,null,"",null,null,null,null,"",null,"",null,"",null,"",null,9000,1]
[null,135,"","",null,null,null,"",null,null,null,null,"",null,"",null,"",null,"",null,9000,1]
[null,136,"","",null,null,null,"",null,null,null,null,"",null,"",null,"",null,"",null,9000,1]
[null,137,"","",null,null,null,"",null,null,null,null,"",null,"",null,"",null,"",null,9000,1]
[null,138,"","",null,null,null,"",null,null,null,null,"",null,"",null,"",null,"",null,9000,1]
[null,139,"","",null,null,null,"",null,null,null,null,"",null,"",null,"",null,"",null,9000,1]
[null,140,"","",null,null,null,"",null,null,null,null,"",null,"",null,"",null,"",null,9000,1]
[null,141,"","",null,null,null,"",null,null,null,null,"",null,"",null,"",null,"",null,9000,1]
[null,142,"","",null,null,null,"",null,null,null,null,"",null,"",null,"",null,"",null,9000,1]
[null,143,"","",null,null,null,"",null,null,null,null,"",null,"",null,"",null,"",null,9000,1]
[null,144,"","",null,null,null,"",null,null,null,null,"",null,"",null,"",null,"",null,9000,1]
[null,145,"","",null,null,null,"",null,null,null,null,"",null,"",null,"",null,"",null,9000,1]
[null,146,"","",null,null,null,"",null,null,null,null,"",null,"",null,"",null,"",null,9000,1]
[null,147,"","",null,null,null,"",null,null,null,null,"",null,"",null,"",null,"",null,9000,1]
[null,148,"","",null,null,null,"",null,null,null,null,"",null,"",null,"",null,"",null,9000,1]
[null,149,"","",null,null,null,"",null,null,null,null,"",null,"",null,"",null,"",null,9000,1]
[null,150,"","",null,null,null,"",null,null,null,null,"",null,"",null,"",null,"",null,9000,1]
[null,151,"","",null,null,null,"",null,null,null,null,"",null,"",null,"",null,"",null,9000,1]
[null,152,"","",null,null,null,"",null,null,null,null,"",null,"",null,"",null,"",null,9000,1]
[null,153,"","",null,null,null,"",null,null,null,null,"",null,"",null,"",null,"",null,9000,1]
[null,154,"","",null,null,null,"",null,null,null,null,"",null,"",null,"",null,"",null,9000,1]
[null,155,"","",null,null,null,"",null,null,null,null,"",null,"",null,"",null,"",null,9000,1]
[null,156,"","",null,null,null,"",null,null,null,null,"",null,"",null,"",null,"",null,9000,1]
[null,157,"","",null,null,null,"",null,null,null,null,"",null,"",null,"",null,"",null,9000,1]
[null,158,"","",null,null,null,"",null,null,null,null,"",null,"",null,"",null,"",null,9000,1]
[null,159,"","",null,null,null,"",null,null,null,null,"",null,"",null,"",null,"",null,9000,1]
[null,160,"","",null,null,null,"",null,null,null,null,"",null,"",null,"",null,"",null,9000,1]
[null,161,"","",null,null,null,"",null,null,null,null,"",null,"",null,"",null,"",null,9000,1]
[null,162,"","",null,null,null,"",null,null,null,null,"",null,"",null,"",null,"",null,9000,1]
[null,163,"","",null,null,null,"",null,null,null,null,"",null,"",null,"",null,"",null,9000,1]
[null,164,"","",null,null,null,"",null,null,null,null,"",null,"",null,"",null,"",null,9000,1]
[null,165,"","",null,null,null,"",null,null,null,null,"",null,"",null,"",null,"",null,9000,1]
[null,166,"","",null,null,null,"",null,null,null,null,"",null,"",null,"",null,"",null,9000,1]
[null,167,"","",null,null,null,"",null,null,null,null,"",null,"",null,"",null,"",null,9000,1]
[null,168,"","",null,null,null,"",null,null,null,null,"",null,"",null,"",null,"",null,9000,1]
[null,169,"","",null,null,null,"",null,null,null,null,"",null,"",null,"",null,"",null,9000,1]
[null,170,"","",null,null,null,"",null,null,null,null,"",null,"",null,"",null,"",null,9000,1]
[null,171,"","",null,null,null,"",null,null,null,null,"",null,"",null,"",null,"",null,9000,1]
[null,172,"","",null,null,null,"",null,null,null,null,"",null,"",null,"",null,"",null,9000,1]
[null,173,"","",null,null,null,"",null,null,null,null,"",null,"",null,"",null,"",null,9000,1]
[null,174,"","",null,null,null,"",null,null,null,null,"",null,"",null,"",null,"",null,9000,1]
[null,175,"","",null,null,null,"",null,null,null,null,"",null,"",null,"",null,"",null,9000,1]
[null,null,null,null,null,null,null,null,null,null,null,null,null,null,null,null,"",null,"",null,9000,1]
[null,null,null,null,null,null,null,null,null,null,null,null,null,null,null,null,"",null,"",null,9000,1]
[null,null,null,null,null,null,null,null,null,null,null,null,null,null,null,null,"",null,"",null,9000,1]
[null,null,null,null,null,null,null,null,null,null,null,null,null,null,null,null,"",null,"",null,9000,1]
[null,null,null,null,null,null,null,null,null,null,null,null,null,null,null,null,"",null,"",null,9000,1]
[null,null,null,null,null,null,null,null,null,null,null,null,null,null,null,null,"",null,"",null,9000,1]
[null,null,null,null,null,null,null,null,null,null,null,null,null,null,null,null,"",null,"",null,9000,1]
[null,null,null,null,null,null,null,null,null,null,null,null,null,null,null,null,"",null,"",null,9000,1]
[null,null,null,null,null,null,null,null,null,null,null,null,null,null,null,null,"",null,"",null,9000,1]
[null,null,null,null,null,null,null,null,null,null,null,null,null,null,null,null,"",null,"",null,9000,1]
[null,null,null,null,null,null,null,null,null,null,null,null,null,null,null,null,"",null,"",null,9000,1]
[null,null,null,null,null,null,null,null,null,null,null,null,null,null,null,null,"",null,"",null,9000,1]
[null,null,null,null,null,null,null,null,null,null,null,null,null,null,null,null,"",null,"",null,9000,1]
[null,null,null,null,null,null,null,null,null,null,null,null,null,null,null,null,"",null,"",null,9000,1]
[null,null,null,null,null,null,null,null,null,null,null,null,null,null,null,null,"",null,"",null,9000,1]
[null,null,null,null,null,null,null,null,null,null,null,null,null,null,null,null,"",null,"",null,9000,1]
[null,null,null,null,null,null,null,null,null,null,null,null,null,null,null,null,"",null,"",null,9000,1]
[null,null,null,null,null,null,null,null,null,null,null,null,null,null,null,null,"",null,"",null,9000,1]
[null,null,null,null,null,null,null,null,null,null,null,null,null,null,null,null,"",null,"",null,9000,1]
[null,null,null,null,null,null,null,null,null,null,null,null,null,null,null,null,"",null,"",null,9000,1]
[null,null,null,null,null,null,null,null,null,null,null,null,null,null,null,null,"",null,"",null,9000,1]
[null,null,null,null,null,null,null,null,null,null,null,null,null,null,null,null,"",null,"",null,9000,1]
[null,null,null,null,null,null,null,null,null,null,null,null,null,null,null,null,"",null,"",null,9000,1]
[null,null,null,null,null,null,null,null,null,null,null,null,null,null,null,null,"",null,"",null,9000,1]
[null,null,null,null,null,null,null,null,null,null,null,null,null,null,null,null,"",null,"",null,9000,1]
[null,null,null,null,null,null,null,null,null,null,null,null,null,null,null,null,"",null,"",null,9000,1]
[null,null,null,null,null,null,null,null,null,null,null,null,null,null,null,null,"",null,"",null,9000,1]
[null,null,null,null,null,null,null,null,null,null,null,null,null,null,null,null,"",null,"",null,9000,1]
[null,null,null,null,null,null,null,null,null,null,null,null,null,null,null,null,"",null,"",null,9000,1]
[null,null,null,null,null,null,null,null,null,null,null,null,null,null,null,null,"",null,"",null,9000,1]
[null,null,null,null,null,null,null,null,null,null,null,null,null,null,null,null,"",null,"",null,9000,1]
[null,null,null,null,null,null,null,null,null,null,null,null,null,null,null,null,"",null,"",null,9000,1]
[null,null,null,null,null,null,null,null,null,null,null,null,null,null,null,null,"",null,"",null,9000,1]
[null,null,null,null,null,null,null,null,null,null,null,null,null,null,null,null,"",null,"",null,9000,1]
[null,null,null,null,null,null,null,null,null,null,null,null,null,null,null,null,"",null,"",null,9000,1]
[null,null,null,null,null,null,null,null,null,null,null,null,null,null,null,null,"",null,"",null,9000,1]
[null,null,null,null,null,null,null,null,null,null,null,null,null,null,null,null,"",null,"",null,9000,1]
[null,null,null,null,null,null,null,null,null,null,null,null,null,null,null,null,"",null,"",null,9000,1]
[null,null,null,null,null,null,null,null,null,null,null,null,null,null,null,null,"",null,"",null,9000,1]
[null,null,null,null,null,null,null,null,null,null,null,null,null,null,null,null,"",null,"",null,9000,1]
[null,null,null,null,null,null,null,null,null,null,null,null,null,null,null,null,"",null,"",null,9000,1]
[null,null,null,null,null,null,null,null,null,null,null,null,null,null,null,null,"",null,"",null,9000,1]
[null,null,null,null,null,null,null,null,null,null,null,null,null,null,null,null,"",null,"",null,9000,1]
[null,null,null,null,null,null,null,null,null,null,null,null,null,null,null,null,"",null,"",null,9000,1]
[null,null,null,null,null,null,null,null,null,null,null,null,null,null,null,null,"",null,"",null,9000,1]
[null,null,null,null,null,null,null,null,null,null,null,null,null,null,null,null,"",null,"",null,9000,1]
[null,null,null,null,null,null,null,null,null,null,null,null,null,null,null,null,"",null,"",null,9000,1]
[null,null,null,null,null,null,null,null,null,null,null,null,null,null,null,null,"",null,"",null,9000,1]
[null,null,null,null,null,null,null,null,null,null,null,null,null,null,null,null,"",null,"",null,9000,1]
[null,null,null,null,null,null,null,null,null,null,null,null,null,null,null,null,"",null,"",null,9000,1]

{"sheet":"PJ-P","index":14,"n_rows":210,"n_cols":9,"rows_kept":210,"cut":false,"hidden":false,"merged":[[0,1,0,8],[43,1,43,8],[2,1,2,3],[2,4,2,8],[47,1,47,2],[45,1,45,3],[45,4,45,8],[4,1,4,2],[5,1,6,1],[5,2,6,2],[5,3,6,3],[5,4,6,4],[5,5,6,5],[5,6,6,6],[5,8,6,8],[48,6,49,6],[48,8,49,8],[86,1,86,8],[90,1,90,2],[91,1,92,1],[91,2,92,2],[91,3,92,3],[91,4,92,4],[91,5,92,5],[91,6,92,6],[48,1,49,1],[48,2,49,2],[48,3,49,3],[48,4,49,4],[48,5,49,5],[88,4,88,8],[91,8,92,8],[88,1,88,3],[134,4,135,4],[134,5,135,5],[134,6,135,6],[134,8,135,8],[131,1,131,3],[131,4,131,8],[129,1,129,8],[133,1,133,2],[134,1,135,1],[134,2,135,2],[134,3,135,3],[172,1,172,8],[176,1,176,2],[177,1,178,1],[177,2,178,2],[177,3,178,3],[177,4,178,4],[177,5,178,5],[177,6,178,6],[177,8,178,8],[174,1,174,3],[174,4,174,8]]}
[null,"Běh na 100m s přek. - D - Pořadí jednotlivců"]
[]
[null,{"$f":"Start!$B$2","v":"Krajské kolo dorostu"},null,null,{"$f":"Start!$B$3","v":"18.06.2022 Pardubice"}]
[]
[null,{"$f":"Start!$D$5","v":"dorostenky"}]
[null,"Pořadí","Start. číslo","Jméno","kolektiv","čas             I. pokusu","čas            II. pokusu",null,"Výsledný čas"]
[]
[null,{"$f":"IF(AND('PJ - P'!$C1=\"\",'PJ - P'!$D1=\"\"),\"\",'PJ - P'!V1)","v":1},{"$f":"IF(AND('PJ - P'!$C1=\"\",'PJ - P'!$D1=\"\"),\"\",'PJ - P'!B1)","v":40},{"$f":"IF('PJ - P'!C1=\"\",\"\",'PJ - P'!C1)","v":"Zavoralová Karolína"},{"$f":"IF('PJ - P'!D1=\"\",\"\",'PJ - P'!D1)","v":"Skuteč"},{"$f":"IF('PJ - P'!H1=\"\",\"\",'PJ - P'!H1)","v":18.05},{"$f":"IF('PJ - P'!M1=\"\",\"\",'PJ - P'!M1)","v":"NP"},null,{"$f":"IF('PJ - P'!O1=\"\",\"\",'PJ - P'!O1)","v":18.05}]
[null,{"$f":"IF(AND('PJ - P'!$C2=\"\",'PJ - P'!$D2=\"\"),\"\",'PJ - P'!V2)","v":2},{"$f":"IF(AND('PJ - P'!$C2=\"\",'PJ - P'!$D2=\"\"),\"\",'PJ - P'!B2)","v":12},{"$f":"IF('PJ - P'!C2=\"\",\"\",'PJ - P'!C2)","v":"Majvaldová Tereza"},{"$f":"IF('PJ - P'!D2=\"\",\"\",'PJ - P'!D2)","v":"Letohrad Kunčice"},{"$f":"IF('PJ - P'!H2=\"\",\"\",'PJ - P'!H2)","v":19.510000000000002},{"$f":"IF('PJ - P'!M2=\"\",\"\",'PJ - P'!M2)","v":19.3},null,{"$f":"IF('PJ - P'!O2=\"\",\"\",'PJ - P'!O2)","v":19.3}]
[null,{"$f":"IF(AND('PJ - P'!$C3=\"\",'PJ - P'!$D3=\"\"),\"\",'PJ - P'!V3)","v":3},{"$f":"IF(AND('PJ - P'!$C3=\"\",'PJ - P'!$D3=\"\"),\"\",'PJ - P'!B3)","v":22},{"$f":"IF('PJ - P'!C3=\"\",\"\",'PJ - P'!C3)","v":"Slezáková Nela"},{"$f":"IF('PJ - P'!D3=\"\",\"\",'PJ - P'!D3)","v":"Skuteč"},{"$f":"IF('PJ - P'!H3=\"\",\"\",'PJ - P'!H3)","v":22.21},{"$f":"IF('PJ - P'!M3=\"\",\"\",'PJ - P'!M3)","v":19.309999999999999},null,{"$f":"IF('PJ - P'!O3=\"\",\"\",'PJ - P'!O3)","v":19.309999999999999}]
[null,{"$f":"IF(AND('PJ - P'!$C4=\"\",'PJ - P'!$D4=\"\"),\"\",'PJ - P'!V4)","v":4},{"$f":"IF(AND('PJ - P'!$C4=\"\",'PJ - P'!$D4=\"\"),\"\",'PJ - P'!B4)","v":34},{"$f":"IF('PJ - P'!C4=\"\",\"\",'PJ - P'!C4)","v":"Zavoralová Aneta"},{"$f":"IF('PJ - P'!D4=\"\",\"\",'PJ - P'!D4)","v":"Skuteč"},{"$f":"IF('PJ - P'!H4=\"\",\"\",'PJ - P'!H4)","v":19.690000000000001},{"$f":"IF('PJ - P'!M4=\"\",\"\",'PJ - P'!M4)","v":19.57},null,{"$f":"IF('PJ - P'!O4=\"\",\"\",'PJ - P'!O4)","v":19.57}]
[null,{"$f":"IF(AND('PJ - P'!$C5=\"\",'PJ - P'!$D5=\"\"),\"\",'PJ - P'!V5)","v":5},{"$f":"IF(AND('PJ - P'!$C5=\"\",'PJ - P'!$D5=\"\"),\"\",'PJ - P'!B5)","v":4},{"$f":"IF('PJ - P'!C5=\"\",\"\",'PJ - P'!C5)","v":"Bubeníčková Denisa"},{"$f":"IF('PJ - P'!D5=\"\",\"\",'PJ - P'!D5)","v":"Skuteč"},{"$f":"IF('PJ - P'!H5=\"\",\"\",'PJ - P'!H5)","v":19.68},{"$f":"IF('PJ - P'!M5=\"\",\"\",'PJ - P'!M5)","v":19.68},null,{"$f":"IF('PJ - P'!O5=\"\",\"\",'PJ - P'!O5)","v":19.68}]
[null,{"$f":"IF(AND('PJ - P'!$C6=\"\",'PJ - P'!$D6=\"\"),\"\",'PJ - P'!V6)","v":6},{"$f":"IF(AND('PJ - P'!$C6=\"\",'PJ - P'!$D6=\"\"),\"\",'PJ - P'!B6)","v":16},{"$f":"IF('PJ - P'!C6=\"\",\"\",'PJ - P'!C6)","v":"Novotná Leona"},{"$f":"IF('PJ - P'!D6=\"\",\"\",'PJ - P'!D6)","v":"Skuteč"},{"$f":"IF('PJ - P'!H6=\"\",\"\",'PJ - P'!H6)","v":19.68},{"$f":"IF('PJ - P'!M6=\"\",\"\",'PJ - P'!M6)","v":20.39},null,{"$f":"IF('PJ - P'!O6=\"\",\"\",'PJ - P'!O6)","v":19.68}]
[null,{"$f":"IF(AND('PJ - P'!$C7=\"\",'PJ - P'!$D7=\"\"),\"\",'PJ - P'!V7)","v":7},{"$f":"IF(AND('PJ - P'!$C7=\"\",'PJ - P'!$D7=\"\"),\"\",'PJ - P'!B7)","v":39},{"$f":"IF('PJ - P'!C7=\"\",\"\",'PJ - P'!C7)","v":"Kusá Kateřina"},{"$f":"IF('PJ - P'!D7=\"\",\"\",'PJ - P'!D7)","v":"Lubná"},{"$f":"IF('PJ - P'!H7=\"\",\"\",'PJ - P'!H7)","v":20.8},{"$f":"IF('PJ - P'!M7=\"\",\"\",'PJ - P'!M7)","v":19.68},null,{"$f":"IF('PJ - P'!O7=\"\",\"\",'PJ - P'!O7)","v":19.68}]
[null,{"$f":"IF(AND('PJ - P'!$C8=\"\",'PJ - P'!$D8=\"\"),\"\",'PJ - P'!V8)","v":8},{"$f":"IF(AND('PJ - P'!$C8=\"\",'PJ - P'!$D8=\"\"),\"\",'PJ - P'!B8)","v":27},{"$f":"IF('PJ - P'!C8=\"\",\"\",'PJ - P'!C8)","v":"Faltysová Marketa"},{"$f":"IF('PJ - P'!D8=\"\",\"\",'PJ - P'!D8)","v":"Lubná"},{"$f":"IF('PJ - P'!H8=\"\",\"\",'PJ - P'!H8)","v":19.739999999999998},{"$f":"IF('PJ - P'!M8=\"\",\"\",'PJ - P'!M8)","v":"NP"},null,{"$f":"IF('PJ - P'!O8=\"\",\"\",'PJ - P'!O8)","v":19.739999999999998}]
[null,{"$f":"IF(AND('PJ - P'!$C9=\"\",'PJ - P'!$D9=\"\"),\"\",'PJ - P'!V9)","v":9},{"$f":"IF(AND('PJ - P'!$C9=\"\",'PJ - P'!$D9=\"\"),\"\",'PJ - P'!B9)","v":42},{"$f":"IF('PJ - P'!C9=\"\",\"\",'PJ - P'!C9)","v":"Dudková Martina"},{"$f":"IF('PJ - P'!D9=\"\",\"\",'PJ - P'!D9)","v":"Letohrad Kunčice"},{"$f":"IF('PJ - P'!H9=\"\",\"\",'PJ - P'!H9)","v":19.809999999999999},{"$f":"IF('PJ - P'!M9=\"\",\"\",'PJ - P'!M9)","v":25.95},null,{"$f":"IF('PJ - P'!O9=\"\",\"\",'PJ - P'!O9)","v":19.809999999999999}]
[null,{"$f":"IF(AND('PJ - P'!$C10=\"\",'PJ - P'!$D10=\"\"),\"\",'PJ - P'!V10)","v":10},{"$f":"IF(AND('PJ - P'!$C10=\"\",'PJ - P'!$D10=\"\"),\"\",'PJ - P'!B10)","v":25},{"$f":"IF('PJ - P'!C10=\"\",\"\",'PJ - P'!C10)","v":"Bartoníčková Karolína"},{"$f":"IF('PJ - P'!D10=\"\",\"\",'PJ - P'!D10)","v":"Kamenec"},{"$f":"IF('PJ - P'!H10=\"\",\"\",'PJ - P'!H10)","v":20.72},{"$f":"IF('PJ - P'!M10=\"\",\"\",'PJ - P'!M10)","v":"NP"},null,{"$f":"IF('PJ - P'!O10=\"\",\"\",'PJ - P'!O10)","v":20.72}]
[null,{"$f":"IF(AND('PJ - P'!$C11=\"\",'PJ - P'!$D11=\"\"),\"\",'PJ - P'!V11)","v":11},{"$f":"IF(AND('PJ - P'!$C11=\"\",'PJ - P'!$D11=\"\"),\"\",'PJ - P'!B11)","v":1},{"$f":"IF('PJ - P'!C11=\"\",\"\",'PJ - P'!C11)","v":"Vraspírová Valerie"},{"$f":"IF('PJ - P'!D11=\"\",\"\",'PJ - P'!D11)","v":"Kamenec"},{"$f":"IF('PJ - P'!H11=\"\",\"\",'PJ - P'!H11)","v":21.33},{"$f":"IF('PJ - P'!M11=\"\",\"\",'PJ - P'!M11)","v":20.77},null,{"$f":"IF('PJ - P'!O11=\"\",\"\",'PJ - P'!O11)","v":20.77}]
[null,{"$f":"IF(AND('PJ - P'!$C12=\"\",'PJ - P'!$D12=\"\"),\"\",'PJ - P'!V12)","v":12},{"$f":"IF(AND('PJ - P'!$C12=\"\",'PJ - P'!$D12=\"\"),\"\",'PJ - P'!B12)","v":21},{"$f":"IF('PJ - P'!C12=\"\",\"\",'PJ - P'!C12)","v":"Silová Michaela"},{"$f":"IF('PJ - P'!D12=\"\",\"\",'PJ - P'!D12)","v":"Lubná"},{"$f":"IF('PJ - P'!H12=\"\",\"\",'PJ - P'!H12)","v":21.28},{"$f":"IF('PJ - P'!M12=\"\",\"\",'PJ - P'!M12)","v":20.89},null,{"$f":"IF('PJ - P'!O12=\"\",\"\",'PJ - P'!O12)","v":20.89}]
[null,{"$f":"IF(AND('PJ - P'!$C13=\"\",'PJ - P'!$D13=\"\"),\"\",'PJ - P'!V13)","v":13},{"$f":"IF(AND('PJ - P'!$C13=\"\",'PJ - P'!$D13=\"\"),\"\",'PJ - P'!B13)","v":13},{"$f":"IF('PJ - P'!C13=\"\",\"\",'PJ - P'!C13)","v":"Andrlíková Vendula"},{"$f":"IF('PJ - P'!D13=\"\",\"\",'PJ - P'!D13)","v":"Kamenec"},{"$f":"IF('PJ - P'!H13=\"\",\"\",'PJ - P'!H13)","v":21.85},{"$f":"IF('PJ - P'!M13=\"\",\"\",'PJ - P'!M13)","v":20.92},null,{"$f":"IF('PJ - P'!O13=\"\",\"\",'PJ - P'!O13)","v":20.92}]
[null,{"$f":"IF(AND('PJ - P'!$C14=\"\",'PJ - P'!$D14=\"\"),\"\",'PJ - P'!V14)","v":14},{"$f":"IF(AND('PJ - P'!$C14=\"\",'PJ - P'!$D14=\"\"),\"\",'PJ - P'!B14)","v":18},{"$f":"IF('PJ - P'!C14=\"\",\"\",'PJ - P'!C14)","v":"Majvaldová Adela"},{"$f":"IF('PJ - P'!D14=\"\",\"\",'PJ - P'!D14)","v":"Letohrad Kunčice"},{"$f":"IF('PJ - P'!H14=\"\",\"\",'PJ - P'!H14)","v":24.47},{"$f":"IF('PJ - P'!M14=\"\",\"\",'PJ - P'!M14)","v":21.13},null,{"$f":"IF('PJ - P'!O14=\"\",\"\",'PJ - P'!O14)","v":21.13}]
[null,{"$f":"IF(AND('PJ - P'!$C15=\"\",'PJ - P'!$D15=\"\"),\"\",'PJ - P'!V15)","v":15},{"$f":"IF(AND('PJ - P'!$C15=\"\",'PJ - P'!$D15=\"\"),\"\",'PJ - P'!B15)","v":28},{"$f":"IF('PJ - P'!C15=\"\",\"\",'PJ - P'!C15)","v":"Šulcová Soňa"},{"$f":"IF('PJ - P'!D15=\"\",\"\",'PJ - P'!D15)","v":"Skuteč"},{"$f":"IF('PJ - P'!H15=\"\",\"\",'PJ - P'!H15)","v":21.3},{"$f":"IF('PJ - P'!M15=\"\",\"\",'PJ - P'!M15)","v":22.01},null,{"$f":"IF('PJ - P'!O15=\"\",\"\",'PJ - P'!O15)","v":21.3}]
[null,{"$f":"IF(AND('PJ - P'!$C16=\"\",'PJ - P'!$D16=\"\"),\"\",'PJ - P'!V16)","v":16},{"$f":"IF(AND('PJ - P'!$C16=\"\",'PJ - P'!$D16=\"\"),\"\",'PJ - P'!B16)","v":38},{"$f":"IF('PJ - P'!C16=\"\",\"\",'PJ - P'!C16)","v":"Nováková Markéta"},{"$f":"IF('PJ - P'!D16=\"\",\"\",'PJ - P'!D16)","v":"Lukavice"},{"$f":"IF('PJ - P'!H16=\"\",\"\",'PJ - P'!H16)","v":21.35},{"$f":"IF('PJ - P'!M16=\"\",\"\",'PJ - P'!M16)","v":34.270000000000003},null,{"$f":"IF('PJ - P'!O16=\"\",\"\",'PJ - P'!O16)","v":21.35}]
[null,{"$f":"IF(AND('PJ - P'!$C17=\"\",'PJ - P'!$D17=\"\"),\"\",'PJ - P'!V17)","v":17},{"$f":"IF(AND('PJ - P'!$C17=\"\",'PJ - P'!$D17=\"\"),\"\",'PJ - P'!B17)","v":6},{"$f":"IF('PJ - P'!C17=\"\",\"\",'PJ - P'!C17)","v":"Sýkorová Kateřina"},{"$f":"IF('PJ - P'!D17=\"\",\"\",'PJ - P'!D17)","v":"Letohrad Kunčice"},{"$f":"IF('PJ - P'!H17=\"\",\"\",'PJ - P'!H17)","v":22.79},{"$f":"IF('PJ - P'!M17=\"\",\"\",'PJ - P'!M17)","v":21.57},null,{"$f":"IF('PJ - P'!O17=\"\",\"\",'PJ - P'!O17)","v":21.57}]
[null,{"$f":"IF(AND('PJ - P'!$C18=\"\",'PJ - P'!$D18=\"\"),\"\",'PJ - P'!V18)","v":18},{"$f":"IF(AND('PJ - P'!$C18=\"\",'PJ - P'!$D18=\"\"),\"\",'PJ - P'!B18)","v":10},{"$f":"IF('PJ - P'!C18=\"\",\"\",'PJ - P'!C18)","v":"Jonášová Andrea"},{"$f":"IF('PJ - P'!D18=\"\",\"\",'PJ - P'!D18)","v":"Skuteč"},{"$f":"IF('PJ - P'!H18=\"\",\"\",'PJ - P'!H18)","v":"NP"},{"$f":"IF('PJ - P'!M18=\"\",\"\",'PJ - P'!M18)","v":21.57},null,{"$f":"IF('PJ - P'!O18=\"\",\"\",'PJ - P'!O18)","v":21.57}]
[null,{"$f":"IF(AND('PJ - P'!$C19=\"\",'PJ - P'!$D19=\"\"),\"\",'PJ - P'!V19)","v":19},{"$f":"IF(AND('PJ - P'!$C19=\"\",'PJ - P'!$D19=\"\"),\"\",'PJ - P'!B19)","v":17},{"$f":"IF('PJ - P'!C19=\"\",\"\",'PJ - P'!C19)","v":"Černohorská Nikola "},{"$f":"IF('PJ - P'!D19=\"\",\"\",'PJ - P'!D19)","v":"Bystřec"},{"$f":"IF('PJ - P'!H19=\"\",\"\",'PJ - P'!H19)","v":22.15},{"$f":"IF('PJ - P'!M19=\"\",\"\",'PJ - P'!M19)","v":28.73},null,{"$f":"IF('PJ - P'!O19=\"\",\"\",'PJ - P'!O19)","v":22.15}]
[null,{"$f":"IF(AND('PJ - P'!$C20=\"\",'PJ - P'!$D20=\"\"),\"\",'PJ - P'!V20)","v":20},{"$f":"IF(AND('PJ - P'!$C20=\"\",'PJ - P'!$D20=\"\"),\"\",'PJ - P'!B20)","v":41},{"$f":"IF('PJ - P'!C20=\"\",\"\",'PJ - P'!C20)","v":"Dolečková Kristýna"},{"$f":"IF('PJ - P'!D20=\"\",\"\",'PJ - P'!D20)","v":"Bystřec"},{"$f":"IF('PJ - P'!H20=\"\",\"\",'PJ - P'!H20)","v":22.25},{"$f":"IF('PJ - P'!M20=\"\",\"\",'PJ - P'!M20)","v":22.72},null,{"$f":"IF('PJ - P'!O20=\"\",\"\",'PJ - P'!O20)","v":22.25}]
[null,{"$f":"IF(AND('PJ - P'!$C21=\"\",'PJ - P'!$D21=\"\"),\"\",'PJ - P'!V21)","v":21},{"$f":"IF(AND('PJ - P'!$C21=\"\",'PJ - P'!$D21=\"\"),\"\",'PJ - P'!B21)","v":19},{"$f":"IF('PJ - P'!C21=\"\",\"\",'PJ - P'!C21)","v":"Cejpová Jana"},{"$f":"IF('PJ - P'!D21=\"\",\"\",'PJ - P'!D21)","v":"Kamenec"},{"$f":"IF('PJ - P'!H21=\"\",\"\",'PJ - P'!H21)","v":22.31},{"$f":"IF('PJ - P'!M21=\"\",\"\",'PJ - P'!M21)","v":25.49},null,{"$f":"IF('PJ - P'!O21=\"\",\"\",'PJ - P'!O21)","v":22.31}]
[null,{"$f":"IF(AND('PJ - P'!$C22=\"\",'PJ - P'!$D22=\"\"),\"\",'PJ - P'!V22)","v":22},{"$f":"IF(AND('PJ - P'!$C22=\"\",'PJ - P'!$D22=\"\"),\"\",'PJ - P'!B22)","v":15},{"$f":"IF('PJ - P'!C22=\"\",\"\",'PJ - P'!C22)","v":"Zachová Aneta"},{"$f":"IF('PJ - P'!D22=\"\",\"\",'PJ - P'!D22)","v":"Lubná"},{"$f":"IF('PJ - P'!H22=\"\",\"\",'PJ - P'!H22)","v":22.55},{"$f":"IF('PJ - P'!M22=\"\",\"\",'PJ - P'!M22)","v":22.38},null,{"$f":"IF('PJ - P'!O22=\"\",\"\",'PJ - P'!O22)","v":22.38}]
[null,{"$f":"IF(AND('PJ - P'!$C23=\"\",'PJ - P'!$D23=\"\"),\"\",'PJ - P'!V23)","v":23},{"$f":"IF(AND('PJ - P'!$C23=\"\",'PJ - P'!$D23=\"\"),\"\",'PJ - P'!B23)","v":7},{"$f":"IF('PJ - P'!C23=\"\",\"\",'PJ - P'!C23)","v":"Cejpová Adéla"},{"$f":"IF('PJ - P'!D23=\"\",\"\",'PJ - P'!D23)","v":"Kamenec"},{"$f":"IF('PJ - P'!H23=\"\",\"\",'PJ - P'!H23)","v":25.1},{"$f":"IF('PJ - P'!M23=\"\",\"\",'PJ - P'!M23)","v":22.48},null,{"$f":"IF('PJ - P'!O23=\"\",\"\",'PJ - P'!O23)","v":22.48}]
[null,{"$f":"IF(AND('PJ - P'!$C24=\"\",'PJ - P'!$D24=\"\"),\"\",'PJ - P'!V24)","v":24},{"$f":"IF(AND('PJ - P'!$C24=\"\",'PJ - P'!$D24=\"\"),\"\",'PJ - P'!B24)","v":31},{"$f":"IF('PJ - P'!C24=\"\",\"\",'PJ - P'!C24)","v":"Andrlíková Anna"},{"$f":"IF('PJ - P'!D24=\"\",\"\",'PJ - P'!D24)","v":"Kamenec"},{"$f":"IF('PJ - P'!H24=\"\",\"\",'PJ - P'!H24)","v":23.02},{"$f":"IF('PJ - P'!M24=\"\",\"\",'PJ - P'!M24)","v":22.73},null,{"$f":"IF('PJ - P'!O24=\"\",\"\",'PJ - P'!O24)","v":22.73}]
[null,{"$f":"IF(AND('PJ - P'!$C25=\"\",'PJ - P'!$D25=\"\"),\"\",'PJ - P'!V25)","v":25},{"$f":"IF(AND('PJ - P'!$C25=\"\",'PJ - P'!$D25=\"\"),\"\",'PJ - P'!B25)","v":20},{"$f":"IF('PJ - P'!C25=\"\",\"\",'PJ - P'!C25)","v":"Zavoralová Klára"},{"$f":"IF('PJ - P'!D25=\"\",\"\",'PJ - P'!D25)","v":"Lukavice"},{"$f":"IF('PJ - P'!H25=\"\",\"\",'PJ - P'!H25)","v":23.23},{"$f":"IF('PJ - P'!M25=\"\",\"\",'PJ - P'!M25)","v":22.96},null,{"$f":"IF('PJ - P'!O25=\"\",\"\",'PJ - P'!O25)","v":22.96}]
[null,{"$f":"IF(AND('PJ - P'!$C26=\"\",'PJ - P'!$D26=\"\"),\"\",'PJ - P'!V26)","v":26},{"$f":"IF(AND('PJ - P'!$C26=\"\",'PJ - P'!$D26=\"\"),\"\",'PJ - P'!B26)","v":3},{"$f":"IF('PJ - P'!C26=\"\",\"\",'PJ - P'!C26)","v":"Zachová Lenka"},{"$f":"IF('PJ - P'!D26=\"\",\"\",'PJ - P'!D26)","v":"Lubná"},{"$f":"IF('PJ - P'!H26=\"\",\"\",'PJ - P'!H26)","v":24.87},{"$f":"IF('PJ - P'!M26=\"\",\"\",'PJ - P'!M26)","v":22.98},null,{"$f":"IF('PJ - P'!O26=\"\",\"\",'PJ - P'!O26)","v":22.98}]
[null,{"$f":"IF(AND('PJ - P'!$C27=\"\",'PJ - P'!$D27=\"\"),\"\",'PJ - P'!V27)","v":27},{"$f":"IF(AND('PJ - P'!$C27=\"\",'PJ - P'!$D27=\"\"),\"\",'PJ - P'!B27)","v":30},{"$f":"IF('PJ - P'!C27=\"\",\"\",'PJ - P'!C27)","v":"Sýkorová Veronika"},{"$f":"IF('PJ - P'!D27=\"\",\"\",'PJ - P'!D27)","v":"Letohrad Kunčice"},{"$f":"IF('PJ - P'!H27=\"\",\"\",'PJ - P'!H27)","v":23.86},{"$f":"IF('PJ - P'!M27=\"\",\"\",'PJ - P'!M27)","v":23.02},null,{"$f":"IF('PJ - P'!O27=\"\",\"\",'PJ - P'!O27)","v":23.02}]
[null,{"$f":"IF(AND('PJ - P'!$C28=\"\",'PJ - P'!$D28=\"\"),\"\",'PJ - P'!V28)","v":28},{"$f":"IF(AND('PJ - P'!$C28=\"\",'PJ - P'!$D28=\"\"),\"\",'PJ - P'!B28)","v":2},{"$f":"IF('PJ - P'!C28=\"\",\"\",'PJ - P'!C28)","v":"Štveráková Kristýna"},{"$f":"IF('PJ - P'!D28=\"\",\"\",'PJ - P'!D28)","v":"Lukavice"},{"$f":"IF('PJ - P'!H28=\"\",\"\",'PJ - P'!H28)","v":23.16},{"$f":"IF('PJ - P'!M28=\"\",\"\",'PJ - P'!M28)","v":24.21},null,{"$f":"IF('PJ - P'!O28=\"\",\"\",'PJ - P'!O28)","v":23.16}]
[null,{"$f":"IF(AND('PJ - P'!$C29=\"\",'PJ - P'!$D29=\"\"),\"\",'PJ - P'!V29)","v":29},{"$f":"IF(AND('PJ - P'!$C29=\"\",'PJ - P'!$D29=\"\"),\"\",'PJ - P'!B29)","v":23},{"$f":"IF('PJ - P'!C29=\"\",\"\",'PJ - P'!C29)","v":"Hrdinová Adéla"},{"$f":"IF('PJ - P'!D29=\"\",\"\",'PJ - P'!D29)","v":"Bystřec"},{"$f":"IF('PJ - P'!H29=\"\",\"\",'PJ - P'!H29)","v":23.3},{"$f":"IF('PJ - P'!M29=\"\",\"\",'PJ - P'!M29)","v":23.84},null,{"$f":"IF('PJ - P'!O29=\"\",\"\",'PJ - P'!O29)","v":23.3}]
[null,{"$f":"IF(AND('PJ - P'!$C30=\"\",'PJ - P'!$D30=\"\"),\"\",'PJ - P'!V30)","v":30},{"$f":"IF(AND('PJ - P'!$C30=\"\",'PJ - P'!$D30=\"\"),\"\",'PJ - P'!B30)","v":32},{"$f":"IF('PJ - P'!C30=\"\",\"\",'PJ - P'!C30)","v":"Hospodková Tereza"},{"$f":"IF('PJ - P'!D30=\"\",\"\",'PJ - P'!D30)","v":"Lukavice"},{"$f":"IF('PJ - P'!H30=\"\",\"\",'PJ - P'!H30)","v":"NP"},{"$f":"IF('PJ - P'!M30=\"\",\"\",'PJ - P'!M30)","v":23.45},null,{"$f":"IF('PJ - P'!O30=\"\",\"\",'PJ - P'!O30)","v":23.45}]
[null,{"$f":"IF(AND('PJ - P'!$C31=\"\",'PJ - P'!$D31=\"\"),\"\",'PJ - P'!V31)","v":31},{"$f":"IF(AND('PJ - P'!$C31=\"\",'PJ - P'!$D31=\"\"),\"\",'PJ - P'!B31)","v":24},{"$f":"IF('PJ - P'!C31=\"\",\"\",'PJ - P'!C31)","v":"Krejsová Nikola"},{"$f":"IF('PJ - P'!D31=\"\",\"\",'PJ - P'!D31)","v":"Letohrad Kunčice"},{"$f":"IF('PJ - P'!H31=\"\",\"\",'PJ - P'!H31)","v":23.57},{"$f":"IF('PJ - P'!M31=\"\",\"\",'PJ - P'!M31)","v":24.32},null,{"$f":"IF('PJ - P'!O31=\"\",\"\",'PJ - P'!O31)","v":23.57}]
[null,{"$f":"IF(AND('PJ - P'!$C32=\"\",'PJ - P'!$D32=\"\"),\"\",'PJ - P'!V32)","v":32},{"$f":"IF(AND('PJ - P'!$C32=\"\",'PJ - P'!$D32=\"\"),\"\",'PJ - P'!B32)","v":33},{"$f":"IF('PJ - P'!C32=\"\",\"\",'PJ - P'!C32)","v":"Brázdová Ilona"},{"$f":"IF('PJ - P'!D32=\"\",\"\",'PJ - P'!D32)","v":"Lubná"},{"$f":"IF('PJ - P'!H32=\"\",\"\",'PJ - P'!H32)","v":"NP"},{"$f":"IF('PJ - P'!M32=\"\",\"\",'PJ - P'!M32)","v":23.58},null,{"$f":"IF('PJ - P'!O32=\"\",\"\",'PJ - P'!O32)","v":23.58}]
[null,{"$f":"IF(AND('PJ - P'!$C33=\"\",'PJ - P'!$D33=\"\"),\"\",'PJ - P'!V33)","v":33},{"$f":"IF(AND('PJ - P'!$C33=\"\",'PJ - P'!$D33=\"\"),\"\",'PJ - P'!B33)","v":11},{"$f":"IF('PJ - P'!C33=\"\",\"\",'PJ - P'!C33)","v":"Vaníčková Tereza"},{"$f":"IF('PJ - P'!D33=\"\",\"\",'PJ - P'!D33)","v":"Bystřec"},{"$f":"IF('PJ - P'!H33=\"\",\"\",'PJ - P'!H33)","v":24.27},{"$f":"IF('PJ - P'!M33=\"\",\"\",'PJ - P'!M33)","v":23.93},null,{"$f":"IF('PJ - P'!O33=\"\",\"\",'PJ - P'!O33)","v":23.93}]
[null,{"$f":"IF(AND('PJ - P'!$C34=\"\",'PJ - P'!$D34=\"\"),\"\",'PJ - P'!V34)","v":34},{"$f":"IF(AND('PJ - P'!$C34=\"\",'PJ - P'!$D34=\"\"),\"\",'PJ - P'!B34)","v":29},{"$f":"IF('PJ - P'!C34=\"\",\"\",'PJ - P'!C34)","v":"Hrdinová Lucie"},{"$f":"IF('PJ - P'!D34=\"\",\"\",'PJ - P'!D34)","v":"Bystřec"},{"$f":"IF('PJ - P'!H34=\"\",\"\",'PJ - P'!H34)","v":24.03},{"$f":"IF('PJ - P'!M34=\"\",\"\",'PJ - P'!M34)","v":24.53},null,{"$f":"IF('PJ - P'!O34=\"\",\"\",'PJ - P'!O34)","v":24.03}]
[null,{"$f":"IF(AND('PJ - P'!$C35=\"\",'PJ - P'!$D35=\"\"),\"\",'PJ - P'!V35)","v":35},{"$f":"IF(AND('PJ - P'!$C35=\"\",'PJ - P'!$D35=\"\"),\"\",'PJ - P'!B35)","v":36},{"$f":"IF('PJ - P'!C35=\"\",\"\",'PJ - P'!C35)","v":"Strasmeierová Eliška"},{"$f":"IF('PJ - P'!D35=\"\",\"\",'PJ - P'!D35)","v":"Letohrad Kunčice"},{"$f":"IF('PJ - P'!H35=\"\",\"\",'PJ - P'!H35)","v":24.06},{"$f":"IF('PJ - P'!M35=\"\",\"\",'PJ - P'!M35)","v":25.68},null,{"$f":"IF('PJ - P'!O35=\"\",\"\",'PJ - P'!O35)","v":24.06}]
[null,{"$f":"IF(AND('PJ - P'!$C36=\"\",'PJ - P'!$D36=\"\"),\"\",'PJ - P'!V36)","v":36},{"$f":"IF(AND('PJ - P'!$C36=\"\",'PJ - P'!$D36=\"\"),\"\",'PJ - P'!B36)","v":14},{"$f":"IF('PJ - P'!C36=\"\",\"\",'PJ - P'!C36)","v":"Bočková Sára"},{"$f":"IF('PJ - P'!D36=\"\",\"\",'PJ - P'!D36)","v":"Lukavice"},{"$f":"IF('PJ - P'!H36=\"\",\"\",'PJ - P'!H36)","v":24.39},{"$f":"IF('PJ - P'!M36=\"\",\"\",'PJ - P'!M36)","v":34.31},null,{"$f":"IF('PJ - P'!O36=\"\",\"\",'PJ - P'!O36)","v":24.39}]
[null,{"$f":"B1","v":"Běh na 100m s přek. - D - Pořadí jednotlivců"}]
[]
[null,{"$f":"$B$3","v":"Krajské kolo dorostu"},null,null,{"$f":"$E$3","v":"18.06.2022 Pardubice"}]
[]
[null,{"$f":"Start!$D$5","v":"dorostenky"}]
[null,"Pořadí","Start. číslo","Jméno","kolektiv","čas           I. pokusu","čas          II. pokusu",null,"Výsledný čas"]
[]
[null,{"$f":"IF(AND('PJ - P'!$C37=\"\",'PJ - P'!$D37=\"\"),\"\",'PJ - P'!V37)","v":37},{"$f":"IF(AND('PJ - P'!$C37=\"\",'PJ - P'!$D37=\"\"),\"\",'PJ - P'!B37)","v":9},{"$f":"IF('PJ - P'!C37=\"\",\"\",'PJ - P'!C37)","v":"Lorencová Veronika"},{"$f":"IF('PJ - P'!D37=\"\",\"\",'PJ - P'!D37)","v":"Lubná"},{"$f":"IF('PJ - P'!H37=\"\",\"\",'PJ - P'!H37)","v":"NP"},{"$f":"IF('PJ - P'!M37=\"\",\"\",'PJ - P'!M37)","v":24.73},null,{"$f":"IF('PJ - P'!O37=\"\",\"\",'PJ - P'!O37)","v":24.73}]
[null,{"$f":"IF(AND('PJ - P'!$C38=\"\",'PJ - P'!$D38=\"\"),\"\",'PJ - P'!V38)","v":38},{"$f":"IF(AND('PJ - P'!$C38=\"\",'PJ - P'!$D38=\"\"),\"\",'PJ - P'!B38)","v":8},{"$f":"IF('PJ - P'!C38=\"\",\"\",'PJ - P'!C38)","v":"Marečková Pavla"},{"$f":"IF('PJ - P'!D38=\"\",\"\",'PJ - P'!D38)","v":"Lukavice"},{"$f":"IF('PJ - P'!H38=\"\",\"\",'PJ - P'!H38)","v":25.14},{"$f":"IF('PJ - P'!M38=\"\",\"\",'PJ - P'!M38)","v":24.92},null,{"$f":"IF('PJ - P'!O38=\"\",\"\",'PJ - P'!O38)","v":24.92}]
[null,{"$f":"IF(AND('PJ - P'!$C39=\"\",'PJ - P'!$D39=\"\"),\"\",'PJ - P'!V39)","v":39},{"$f":"IF(AND('PJ - P'!$C39=\"\",'PJ - P'!$D39=\"\"),\"\",'PJ - P'!B39)","v":26},{"$f":"IF('PJ - P'!C39=\"\",\"\",'PJ - P'!C39)","v":"Marečková Veronika"},{"$f":"IF('PJ - P'!D39=\"\",\"\",'PJ - P'!D39)","v":"Lukavice"},{"$f":"IF('PJ - P'!H39=\"\",\"\",'PJ - P'!H39)","v":26.76},{"$f":"IF('PJ - P'!M39=\"\",\"\",'PJ - P'!M39)","v":26.2},null,{"$f":"IF('PJ - P'!O39=\"\",\"\",'PJ - P'!O39)","v":26.2}]
[null,{"$f":"IF(AND('PJ - P'!$C40=\"\",'PJ - P'!$D40=\"\"),\"\",'PJ - P'!V40)","v":40},{"$f":"IF(AND('PJ - P'!$C40=\"\",'PJ - P'!$D40=\"\"),\"\",'PJ - P'!B40)","v":5},{"$f":"IF('PJ - P'!C40=\"\",\"\",'PJ - P'!C40)","v":"Kumulová Eliška"},{"$f":"IF('PJ - P'!D40=\"\",\"\",'PJ - P'!D40)","v":"Bystřec"},{"$f":"IF('PJ - P'!H40=\"\",\"\",'PJ - P'!H40)","v":"NP"},{"$f":"IF('PJ - P'!M40=\"\",\"\",'PJ - P'!M40)","v":28.66},null,{"$f":"IF('PJ - P'!O40=\"\",\"\",'PJ - P'!O40)","v":28.66}]
[null,{"$f":"IF(AND('PJ - P'!$C41=\"\",'PJ - P'!$D41=\"\"),\"\",'PJ - P'!V41)","v":41},{"$f":"IF(AND('PJ - P'!$C41=\"\",'PJ - P'!$D41=\"\"),\"\",'PJ - P'!B41)","v":35},{"$f":"IF('PJ - P'!C41=\"\",\"\",'PJ - P'!C41)","v":"Pfeiferová Valerie"},{"$f":"IF('PJ - P'!D41=\"\",\"\",'PJ - P'!D41)","v":"Bystřec"},{"$f":"IF('PJ - P'!H41=\"\",\"\",'PJ - P'!H41)","v":"NP"},{"$f":"IF('PJ - P'!M41=\"\",\"\",'PJ - P'!M41)","v":34.83},null,{"$f":"IF('PJ - P'!O41=\"\",\"\",'PJ - P'!O41)","v":34.83}]
[null,{"$f":"IF(AND('PJ - P'!$C42=\"\",'PJ - P'!$D42=\"\"),\"\",'PJ - P'!V42)","v":42},{"$f":"IF(AND('PJ - P'!$C42=\"\",'PJ - P'!$D42=\"\"),\"\",'PJ - P'!B42)","v":37},{"$f":"IF('PJ - P'!C42=\"\",\"\",'PJ - P'!C42)","v":"Němcová Barbora"},{"$f":"IF('PJ - P'!D42=\"\",\"\",'PJ - P'!D42)","v":"Kamenec"},{"$f":"IF('PJ - P'!H42=\"\",\"\",'PJ - P'!H42)","v":"NP"},{"$f":"IF('PJ - P'!M42=\"\",\"\",'PJ - P'!M42)","v":"DNF"},null,{"$f":"IF('PJ - P'!O42=\"\",\"\",'PJ - P'!O42)","v":"NP"}]
[null,{"$f":"IF(AND('PJ - P'!$C43=\"\",'PJ - P'!$D43=\"\"),\"\",'PJ - P'!V43)","v":""},{"$f":"IF(AND('PJ - P'!$C43=\"\",'PJ - P'!$D43=\"\"),\"\",'PJ - P'!B43)","v":""},{"$f":"IF('PJ - P'!C43=\"\",\"\",'PJ - P'!C43)","v":""},{"$f":"IF('PJ - P'!D43=\"\",\"\",'PJ - P'!D43)","v":""},{"$f":"IF('PJ - P'!H43=\"\",\"\",'PJ - P'!H43)","v":""},{"$f":"IF('PJ - P'!M43=\"\",\"\",'PJ - P'!M43)","v":""},null,{"$f":"IF('PJ - P'!O43=\"\",\"\",'PJ - P'!O43)","v":""}]
[null,{"$f":"IF(AND('PJ - P'!$C44=\"\",'PJ - P'!$D44=\"\"),\"\",'PJ - P'!V44)","v":""},{"$f":"IF(AND('PJ - P'!$C44=\"\",'PJ - P'!$D44=\"\"),\"\",'PJ - P'!B44)","v":""},{"$f":"IF('PJ - P'!C44=\"\",\"\",'PJ - P'!C44)","v":""},{"$f":"IF('PJ - P'!D44=\"\",\"\",'PJ - P'!D44)","v":""},{"$f":"IF('PJ - P'!H44=\"\",\"\",'PJ - P'!H44)","v":""},{"$f":"IF('PJ - P'!M44=\"\",\"\",'PJ - P'!M44)","v":""},null,{"$f":"IF('PJ - P'!O44=\"\",\"\",'PJ - P'!O44)","v":""}]
[null,{"$f":"IF(AND('PJ - P'!$C45=\"\",'PJ - P'!$D45=\"\"),\"\",'PJ - P'!V45)","v":""},{"$f":"IF(AND('PJ - P'!$C45=\"\",'PJ - P'!$D45=\"\"),\"\",'PJ - P'!B45)","v":""},{"$f":"IF('PJ - P'!C45=\"\",\"\",'PJ - P'!C45)","v":""},{"$f":"IF('PJ - P'!D45=\"\",\"\",'PJ - P'!D45)","v":""},{"$f":"IF('PJ - P'!H45=\"\",\"\",'PJ - P'!H45)","v":""},{"$f":"IF('PJ - P'!M45=\"\",\"\",'PJ - P'!M45)","v":""},null,{"$f":"IF('PJ - P'!O45=\"\",\"\",'PJ - P'!O45)","v":""}]
[null,{"$f":"IF(AND('PJ - P'!$C46=\"\",'PJ - P'!$D46=\"\"),\"\",'PJ - P'!V46)","v":""},{"$f":"IF(AND('PJ - P'!$C46=\"\",'PJ - P'!$D46=\"\"),\"\",'PJ - P'!B46)","v":""},{"$f":"IF('PJ - P'!C46=\"\",\"\",'PJ - P'!C46)","v":""},{"$f":"IF('PJ - P'!D46=\"\",\"\",'PJ - P'!D46)","v":""},{"$f":"IF('PJ - P'!H46=\"\",\"\",'PJ - P'!H46)","v":""},{"$f":"IF('PJ - P'!M46=\"\",\"\",'PJ - P'!M46)","v":""},null,{"$f":"IF('PJ - P'!O46=\"\",\"\",'PJ - P'!O46)","v":""}]
[null,{"$f":"IF(AND('PJ - P'!$C47=\"\",'PJ - P'!$D47=\"\"),\"\",'PJ - P'!V47)","v":""},{"$f":"IF(AND('PJ - P'!$C47=\"\",'PJ - P'!$D47=\"\"),\"\",'PJ - P'!B47)","v":""},{"$f":"IF('PJ - P'!C47=\"\",\"\",'PJ - P'!C47)","v":""},{"$f":"IF('PJ - P'!D47=\"\",\"\",'PJ - P'!D47)","v":""},{"$f":"IF('PJ - P'!H47=\"\",\"\",'PJ - P'!H47)","v":""},{"$f":"IF('PJ - P'!M47=\"\",\"\",'PJ - P'!M47)","v":""},null,{"$f":"IF('PJ - P'!O47=\"\",\"\",'PJ - P'!O47)","v":""}]
[null,{"$f":"IF(AND('PJ - P'!$C48=\"\",'PJ - P'!$D48=\"\"),\"\",'PJ - P'!V48)","v":""},{"$f":"IF(AND('PJ - P'!$C48=\"\",'PJ - P'!$D48=\"\"),\"\",'PJ - P'!B48)","v":""},{"$f":"IF('PJ - P'!C48=\"\",\"\",'PJ - P'!C48)","v":""},{"$f":"IF('PJ - P'!D48=\"\",\"\",'PJ - P'!D48)","v":""},{"$f":"IF('PJ - P'!H48=\"\",\"\",'PJ - P'!H48)","v":""},{"$f":"IF('PJ - P'!M48=\"\",\"\",'PJ - P'!M48)","v":""},null,{"$f":"IF('PJ - P'!O48=\"\",\"\",'PJ - P'!O48)","v":""}]
[null,{"$f":"IF(AND('PJ - P'!$C49=\"\",'PJ - P'!$D49=\"\"),\"\",'PJ - P'!V49)","v":""},{"$f":"IF(AND('PJ - P'!$C49=\"\",'PJ - P'!$D49=\"\"),\"\",'PJ - P'!B49)","v":""},{"$f":"IF('PJ - P'!C49=\"\",\"\",'PJ - P'!C49)","v":""},{"$f":"IF('PJ - P'!D49=\"\",\"\",'PJ - P'!D49)","v":""},{"$f":"IF('PJ - P'!H49=\"\",\"\",'PJ - P'!H49)","v":""},{"$f":"IF('PJ - P'!M49=\"\",\"\",'PJ - P'!M49)","v":""},null,{"$f":"IF('PJ - P'!O49=\"\",\"\",'PJ - P'!O49)","v":""}]
[null,{"$f":"IF(AND('PJ - P'!$C50=\"\",'PJ - P'!$D50=\"\"),\"\",'PJ - P'!V50)","v":""},{"$f":"IF(AND('PJ - P'!$C50=\"\",'PJ - P'!$D50=\"\"),\"\",'PJ - P'!B50)","v":""},{"$f":"IF('PJ - P'!C50=\"\",\"\",'PJ - P'!C50)","v":""},{"$f":"IF('PJ - P'!D50=\"\",\"\",'PJ - P'!D50)","v":""},{"$f":"IF('PJ - P'!H50=\"\",\"\",'PJ - P'!H50)","v":""},{"$f":"IF('PJ - P'!M50=\"\",\"\",'PJ - P'!M50)","v":""},null,{"$f":"IF('PJ - P'!O50=\"\",\"\",'PJ - P'!O50)","v":""}]
[null,{"$f":"IF(AND('PJ - P'!$C51=\"\",'PJ - P'!$D51=\"\"),\"\",'PJ - P'!V51)","v":""},{"$f":"IF(AND('PJ - P'!$C51=\"\",'PJ - P'!$D51=\"\"),\"\",'PJ - P'!B51)","v":""},{"$f":"IF('PJ - P'!C51=\"\",\"\",'PJ - P'!C51)","v":""},{"$f":"IF('PJ - P'!D51=\"\",\"\",'PJ - P'!D51)","v":""},{"$f":"IF('PJ - P'!H51=\"\",\"\",'PJ - P'!H51)","v":""},{"$f":"IF('PJ - P'!M51=\"\",\"\",'PJ - P'!M51)","v":""},null,{"$f":"IF('PJ - P'!O51=\"\",\"\",'PJ - P'!O51)","v":""}]
[null,{"$f":"IF(AND('PJ - P'!$C52=\"\",'PJ - P'!$D52=\"\"),\"\",'PJ - P'!V52)","v":""},{"$f":"IF(AND('PJ - P'!$C52=\"\",'PJ - P'!$D52=\"\"),\"\",'PJ - P'!B52)","v":""},{"$f":"IF('PJ - P'!C52=\"\",\"\",'PJ - P'!C52)","v":""},{"$f":"IF('PJ - P'!D52=\"\",\"\",'PJ - P'!D52)","v":""},{"$f":"IF('PJ - P'!H52=\"\",\"\",'PJ - P'!H52)","v":""},{"$f":"IF('PJ - P'!M52=\"\",\"\",'PJ - P'!M52)","v":""},null,{"$f":"IF('PJ - P'!O52=\"\",\"\",'PJ - P'!O52)","v":""}]
[null,{"$f":"IF(AND('PJ - P'!$C53=\"\",'PJ - P'!$D53=\"\"),\"\",'PJ - P'!V53)","v":""},{"$f":"IF(AND('PJ - P'!$C53=\"\",'PJ - P'!$D53=\"\"),\"\",'PJ - P'!B53)","v":""},{"$f":"IF('PJ - P'!C53=\"\",\"\",'PJ - P'!C53)","v":""},{"$f":"IF('PJ - P'!D53=\"\",\"\",'PJ - P'!D53)","v":""},{"$f":"IF('PJ - P'!H53=\"\",\"\",'PJ - P'!H53)","v":""},{"$f":"IF('PJ - P'!M53=\"\",\"\",'PJ - P'!M53)","v":""},null,{"$f":"IF('PJ - P'!O53=\"\",\"\",'PJ - P'!O53)","v":""}]
[null,{"$f":"IF(AND('PJ - P'!$C54=\"\",'PJ - P'!$D54=\"\"),\"\",'PJ - P'!V54)","v":""},{"$f":"IF(AND('PJ - P'!$C54=\"\",'PJ - P'!$D54=\"\"),\"\",'PJ - P'!B54)","v":""},{"$f":"IF('PJ - P'!C54=\"\",\"\",'PJ - P'!C54)","v":""},{"$f":"IF('PJ - P'!D54=\"\",\"\",'PJ - P'!D54)","v":""},{"$f":"IF('PJ - P'!H54=\"\",\"\",'PJ - P'!H54)","v":""},{"$f":"IF('PJ - P'!M54=\"\",\"\",'PJ - P'!M54)","v":""},null,{"$f":"IF('PJ - P'!O54=\"\",\"\",'PJ - P'!O54)","v":""}]
[null,{"$f":"IF(AND('PJ - P'!$C55=\"\",'PJ - P'!$D55=\"\"),\"\",'PJ - P'!V55)","v":""},{"$f":"IF(AND('PJ - P'!$C55=\"\",'PJ - P'!$D55=\"\"),\"\",'PJ - P'!B55)","v":""},{"$f":"IF('PJ - P'!C55=\"\",\"\",'PJ - P'!C55)","v":""},{"$f":"IF('PJ - P'!D55=\"\",\"\",'PJ - P'!D55)","v":""},{"$f":"IF('PJ - P'!H55=\"\",\"\",'PJ - P'!H55)","v":""},{"$f":"IF('PJ - P'!M55=\"\",\"\",'PJ - P'!M55)","v":""},null,{"$f":"IF('PJ - P'!O55=\"\",\"\",'PJ - P'!O55)","v":""}]
[null,{"$f":"IF(AND('PJ - P'!$C56=\"\",'PJ - P'!$D56=\"\"),\"\",'PJ - P'!V56)","v":""},{"$f":"IF(AND('PJ - P'!$C56=\"\",'PJ - P'!$D56=\"\"),\"\",'PJ - P'!B56)","v":""},{"$f":"IF('PJ - P'!C56=\"\",\"\",'PJ - P'!C56)","v":""},{"$f":"IF('PJ - P'!D56=\"\",\"\",'PJ - P'!D56)","v":""},{"$f":"IF('PJ - P'!H56=\"\",\"\",'PJ - P'!H56)","v":""},{"$f":"IF('PJ - P'!M56=\"\",\"\",'PJ - P'!M56)","v":""},null,{"$f":"IF('PJ - P'!O56=\"\",\"\",'PJ - P'!O56)","v":""}]
[null,{"$f":"IF(AND('PJ - P'!$C57=\"\",'PJ - P'!$D57=\"\"),\"\",'PJ - P'!V57)","v":""},{"$f":"IF(AND('PJ - P'!$C57=\"\",'PJ - P'!$D57=\"\"),\"\",'PJ - P'!B57)","v":""},{"$f":"IF('PJ - P'!C57=\"\",\"\",'PJ - P'!C57)","v":""},{"$f":"IF('PJ - P'!D57=\"\",\"\",'PJ - P'!D57)","v":""},{"$f":"IF('PJ - P'!H57=\"\",\"\",'PJ - P'!H57)","v":""},{"$f":"IF('PJ - P'!M57=\"\",\"\",'PJ - P'!M57)","v":""},null,{"$f":"IF('PJ - P'!O57=\"\",\"\",'PJ - P'!O57)","v":""}]
[null,{"$f":"IF(AND('PJ - P'!$C58=\"\",'PJ - P'!$D58=\"\"),\"\",'PJ - P'!V58)","v":""},{"$f":"IF(AND('PJ - P'!$C58=\"\",'PJ - P'!$D58=\"\"),\"\",'PJ - P'!B58)","v":""},{"$f":"IF('PJ - P'!C58=\"\",\"\",'PJ - P'!C58)","v":""},{"$f":"IF('PJ - P'!D58=\"\",\"\",'PJ - P'!D58)","v":""},{"$f":"IF('PJ - P'!H58=\"\",\"\",'PJ - P'!H58)","v":""},{"$f":"IF('PJ - P'!M58=\"\",\"\",'PJ - P'!M58)","v":""},null,{"$f":"IF('PJ - P'!O58=\"\",\"\",'PJ - P'!O58)","v":""}]
[null,{"$f":"IF(AND('PJ - P'!$C59=\"\",'PJ - P'!$D59=\"\"),\"\",'PJ - P'!V59)","v":""},{"$f":"IF(AND('PJ - P'!$C59=\"\",'PJ - P'!$D59=\"\"),\"\",'PJ - P'!B59)","v":""},{"$f":"IF('PJ - P'!C59=\"\",\"\",'PJ - P'!C59)","v":""},{"$f":"IF('PJ - P'!D59=\"\",\"\",'PJ - P'!D59)","v":""},{"$f":"IF('PJ - P'!H59=\"\",\"\",'PJ - P'!H59)","v":""},{"$f":"IF('PJ - P'!M59=\"\",\"\",'PJ - P'!M59)","v":""},null,{"$f":"IF('PJ - P'!O59=\"\",\"\",'PJ - P'!O59)","v":""}]
[null,{"$f":"IF(AND('PJ - P'!$C60=\"\",'PJ - P'!$D60=\"\"),\"\",'PJ - P'!V60)","v":""},{"$f":"IF(AND('PJ - P'!$C60=\"\",'PJ - P'!$D60=\"\"),\"\",'PJ - P'!B60)","v":""},{"$f":"IF('PJ - P'!C60=\"\",\"\",'PJ - P'!C60)","v":""},{"$f":"IF('PJ - P'!D60=\"\",\"\",'PJ - P'!D60)","v":""},{"$f":"IF('PJ - P'!H60=\"\",\"\",'PJ - P'!H60)","v":""},{"$f":"IF('PJ - P'!M60=\"\",\"\",'PJ - P'!M60)","v":""},null,{"$f":"IF('PJ - P'!O60=\"\",\"\",'PJ - P'!O60)","v":""}]
[null,{"$f":"IF(AND('PJ - P'!$C61=\"\",'PJ - P'!$D61=\"\"),\"\",'PJ - P'!V61)","v":""},{"$f":"IF(AND('PJ - P'!$C61=\"\",'PJ - P'!$D61=\"\"),\"\",'PJ - P'!B61)","v":""},{"$f":"IF('PJ - P'!C61=\"\",\"\",'PJ - P'!C61)","v":""},{"$f":"IF('PJ - P'!D61=\"\",\"\",'PJ - P'!D61)","v":""},{"$f":"IF('PJ - P'!H61=\"\",\"\",'PJ - P'!H61)","v":""},{"$f":"IF('PJ - P'!M61=\"\",\"\",'PJ - P'!M61)","v":""},null,{"$f":"IF('PJ - P'!O61=\"\",\"\",'PJ - P'!O61)","v":""}]
[null,{"$f":"IF(AND('PJ - P'!$C62=\"\",'PJ - P'!$D62=\"\"),\"\",'PJ - P'!V62)","v":""},{"$f":"IF(AND('PJ - P'!$C62=\"\",'PJ - P'!$D62=\"\"),\"\",'PJ - P'!B62)","v":""},{"$f":"IF('PJ - P'!C62=\"\",\"\",'PJ - P'!C62)","v":""},{"$f":"IF('PJ - P'!D62=\"\",\"\",'PJ - P'!D62)","v":""},{"$f":"IF('PJ - P'!H62=\"\",\"\",'PJ - P'!H62)","v":""},{"$f":"IF('PJ - P'!M62=\"\",\"\",'PJ - P'!M62)","v":""},null,{"$f":"IF('PJ - P'!O62=\"\",\"\",'PJ - P'!O62)","v":""}]
[null,{"$f":"IF(AND('PJ - P'!$C63=\"\",'PJ - P'!$D63=\"\"),\"\",'PJ - P'!V63)","v":""},{"$f":"IF(AND('PJ - P'!$C63=\"\",'PJ - P'!$D63=\"\"),\"\",'PJ - P'!B63)","v":""},{"$f":"IF('PJ - P'!C63=\"\",\"\",'PJ - P'!C63)","v":""},{"$f":"IF('PJ - P'!D63=\"\",\"\",'PJ - P'!D63)","v":""},{"$f":"IF('PJ - P'!H63=\"\",\"\",'PJ - P'!H63)","v":""},{"$f":"IF('PJ - P'!M63=\"\",\"\",'PJ - P'!M63)","v":""},null,{"$f":"IF('PJ - P'!O63=\"\",\"\",'PJ - P'!O63)","v":""}]
[null,{"$f":"IF(AND('PJ - P'!$C64=\"\",'PJ - P'!$D64=\"\"),\"\",'PJ - P'!V64)","v":""},{"$f":"IF(AND('PJ - P'!$C64=\"\",'PJ - P'!$D64=\"\"),\"\",'PJ - P'!B64)","v":""},{"$f":"IF('PJ - P'!C64=\"\",\"\",'PJ - P'!C64)","v":""},{"$f":"IF('PJ - P'!D64=\"\",\"\",'PJ - P'!D64)","v":""},{"$f":"IF('PJ - P'!H64=\"\",\"\",'PJ - P'!H64)","v":""},{"$f":"IF('PJ - P'!M64=\"\",\"\",'PJ - P'!M64)","v":""},null,{"$f":"IF('PJ - P'!O64=\"\",\"\",'PJ - P'!O64)","v":""}]
[null,{"$f":"IF(AND('PJ - P'!$C65=\"\",'PJ - P'!$D65=\"\"),\"\",'PJ - P'!V65)","v":""},{"$f":"IF(AND('PJ - P'!$C65=\"\",'PJ - P'!$D65=\"\"),\"\",'PJ - P'!B65)","v":""},{"$f":"IF('PJ - P'!C65=\"\",\"\",'PJ - P'!C65)","v":""},{"$f":"IF('PJ - P'!D65=\"\",\"\",'PJ - P'!D65)","v":""},{"$f":"IF('PJ - P'!H65=\"\",\"\",'PJ - P'!H65)","v":""},{"$f":"IF('PJ - P'!M65=\"\",\"\",'PJ - P'!M65)","v":""},null,{"$f":"IF('PJ - P'!O65=\"\",\"\",'PJ - P'!O65)","v":""}]
[null,{"$f":"IF(AND('PJ - P'!$C66=\"\",'PJ - P'!$D66=\"\"),\"\",'PJ - P'!V66)","v":""},{"$f":"IF(AND('PJ - P'!$C66=\"\",'PJ - P'!$D66=\"\"),\"\",'PJ - P'!B66)","v":""},{"$f":"IF('PJ - P'!C66=\"\",\"\",'PJ - P'!C66)","v":""},{"$f":"IF('PJ - P'!D66=\"\",\"\",'PJ - P'!D66)","v":""},{"$f":"IF('PJ - P'!H66=\"\",\"\",'PJ - P'!H66)","v":""},{"$f":"IF('PJ - P'!M66=\"\",\"\",'PJ - P'!M66)","v":""},null,{"$f":"IF('PJ - P'!O66=\"\",\"\",'PJ - P'!O66)","v":""}]
[null,{"$f":"IF(AND('PJ - P'!$C67=\"\",'PJ - P'!$D67=\"\"),\"\",'PJ - P'!V67)","v":""},{"$f":"IF(AND('PJ - P'!$C67=\"\",'PJ - P'!$D67=\"\"),\"\",'PJ - P'!B67)","v":""},{"$f":"IF('PJ - P'!C67=\"\",\"\",'PJ - P'!C67)","v":""},{"$f":"IF('PJ - P'!D67=\"\",\"\",'PJ - P'!D67)","v":""},{"$f":"IF('PJ - P'!H67=\"\",\"\",'PJ - P'!H67)","v":""},{"$f":"IF('PJ - P'!M67=\"\",\"\",'PJ - P'!M67)","v":""},null,{"$f":"IF('PJ - P'!O67=\"\",\"\",'PJ - P'!O67)","v":""}]
[null,{"$f":"IF(AND('PJ - P'!$C68=\"\",'PJ - P'!$D68=\"\"),\"\",'PJ - P'!V68)","v":""},{"$f":"IF(AND('PJ - P'!$C68=\"\",'PJ - P'!$D68=\"\"),\"\",'PJ - P'!B68)","v":""},{"$f":"IF('PJ - P'!C68=\"\",\"\",'PJ - P'!C68)","v":""},{"$f":"IF('PJ - P'!D68=\"\",\"\",'PJ - P'!D68)","v":""},{"$f":"IF('PJ - P'!H68=\"\",\"\",'PJ - P'!H68)","v":""},{"$f":"IF('PJ - P'!M68=\"\",\"\",'PJ - P'!M68)","v":""},null,{"$f":"IF('PJ - P'!O68=\"\",\"\",'PJ - P'!O68)","v":""}]
[null,{"$f":"IF(AND('PJ - P'!$C69=\"\",'PJ - P'!$D69=\"\"),\"\",'PJ - P'!V69)","v":""},{"$f":"IF(AND('PJ - P'!$C69=\"\",'PJ - P'!$D69=\"\"),\"\",'PJ - P'!B69)","v":""},{"$f":"IF('PJ - P'!C69=\"\",\"\",'PJ - P'!C69)","v":""},{"$f":"IF('PJ - P'!D69=\"\",\"\",'PJ - P'!D69)","v":""},{"$f":"IF('PJ - P'!H69=\"\",\"\",'PJ - P'!H69)","v":""},{"$f":"IF('PJ - P'!M69=\"\",\"\",'PJ - P'!M69)","v":""},null,{"$f":"IF('PJ - P'!O69=\"\",\"\",'PJ - P'!O69)","v":""}]
[null,{"$f":"IF(AND('PJ - P'!$C70=\"\",'PJ - P'!$D70=\"\"),\"\",'PJ - P'!V70)","v":""},{"$f":"IF(AND('PJ - P'!$C70=\"\",'PJ - P'!$D70=\"\"),\"\",'PJ - P'!B70)","v":""},{"$f":"IF('PJ - P'!C70=\"\",\"\",'PJ - P'!C70)","v":""},{"$f":"IF('PJ - P'!D70=\"\",\"\",'PJ - P'!D70)","v":""},{"$f":"IF('PJ - P'!H70=\"\",\"\",'PJ - P'!H70)","v":""},{"$f":"IF('PJ - P'!M70=\"\",\"\",'PJ - P'!M70)","v":""},null,{"$f":"IF('PJ - P'!O70=\"\",\"\",'PJ - P'!O70)","v":""}]
[null,{"$f":"IF(AND('PJ - P'!$C71=\"\",'PJ - P'!$D71=\"\"),\"\",'PJ - P'!V71)","v":""},{"$f":"IF(AND('PJ - P'!$C71=\"\",'PJ - P'!$D71=\"\"),\"\",'PJ - P'!B71)","v":""},{"$f":"IF('PJ - P'!C71=\"\",\"\",'PJ - P'!C71)","v":""},{"$f":"IF('PJ - P'!D71=\"\",\"\",'PJ - P'!D71)","v":""},{"$f":"IF('PJ - P'!H71=\"\",\"\",'PJ - P'!H71)","v":""},{"$f":"IF('PJ - P'!M71=\"\",\"\",'PJ - P'!M71)","v":""},null,{"$f":"IF('PJ - P'!O71=\"\",\"\",'PJ - P'!O71)","v":""}]
[null,{"$f":"IF(AND('PJ - P'!$C72=\"\",'PJ - P'!$D72=\"\"),\"\",'PJ - P'!V72)","v":""},{"$f":"IF(AND('PJ - P'!$C72=\"\",'PJ - P'!$D72=\"\"),\"\",'PJ - P'!B72)","v":""},{"$f":"IF('PJ - P'!C72=\"\",\"\",'PJ - P'!C72)","v":""},{"$f":"IF('PJ - P'!D72=\"\",\"\",'PJ - P'!D72)","v":""},{"$f":"IF('PJ - P'!H72=\"\",\"\",'PJ - P'!H72)","v":""},{"$f":"IF('PJ - P'!M72=\"\",\"\",'PJ - P'!M72)","v":""},null,{"$f":"IF('PJ - P'!O72=\"\",\"\",'PJ - P'!O72)","v":""}]
[null,{"$f":"B44","v":"Běh na 100m s přek. - D - Pořadí jednotlivců"}]
[]
[null,{"$f":"$B$3","v":"Krajské kolo dorostu"},null,null,{"$f":"$E$3","v":"18.06.2022 Pardubice"}]
[]
[null,{"$f":"Start!$D$5","v":"dorostenky"}]
[null,"Pořadí","Start. číslo","Jméno","kolektiv","čas           I. pokusu","čas          II. pokusu",null,"Výsledný čas"]
[]
[null,{"$f":"IF(AND('PJ - P'!$C73=\"\",'PJ - P'!$D73=\"\"),\"\",'PJ - P'!V73)","v":""},{"$f":"IF(AND('PJ - P'!$C73=\"\",'PJ - P'!$D73=\"\"),\"\",'PJ - P'!B73)","v":""},{"$f":"IF('PJ - P'!C73=\"\",\"\",'PJ - P'!C73)","v":""},{"$f":"IF('PJ - P'!D73=\"\",\"\",'PJ - P'!D73)","v":""},{"$f":"IF('PJ - P'!H73=\"\",\"\",'PJ - P'!H73)","v":""},{"$f":"IF('PJ - P'!M73=\"\",\"\",'PJ - P'!M73)","v":""},null,{"$f":"IF('PJ - P'!O73=\"\",\"\",'PJ - P'!O73)","v":""}]
[null,{"$f":"IF(AND('PJ - P'!$C74=\"\",'PJ - P'!$D74=\"\"),\"\",'PJ - P'!V74)","v":""},{"$f":"IF(AND('PJ - P'!$C74=\"\",'PJ - P'!$D74=\"\"),\"\",'PJ - P'!B74)","v":""},{"$f":"IF('PJ - P'!C74=\"\",\"\",'PJ - P'!C74)","v":""},{"$f":"IF('PJ - P'!D74=\"\",\"\",'PJ - P'!D74)","v":""},{"$f":"IF('PJ - P'!H74=\"\",\"\",'PJ - P'!H74)","v":""},{"$f":"IF('PJ - P'!M74=\"\",\"\",'PJ - P'!M74)","v":""},null,{"$f":"IF('PJ - P'!O74=\"\",\"\",'PJ - P'!O74)","v":""}]
[null,{"$f":"IF(AND('PJ - P'!$C75=\"\",'PJ - P'!$D75=\"\"),\"\",'PJ - P'!V75)","v":""},{"$f":"IF(AND('PJ - P'!$C75=\"\",'PJ - P'!$D75=\"\"),\"\",'PJ - P'!B75)","v":""},{"$f":"IF('PJ - P'!C75=\"\",\"\",'PJ - P'!C75)","v":""},{"$f":"IF('PJ - P'!D75=\"\",\"\",'PJ - P'!D75)","v":""},{"$f":"IF('PJ - P'!H75=\"\",\"\",'PJ - P'!H75)","v":""},{"$f":"IF('PJ - P'!M75=\"\",\"\",'PJ - P'!M75)","v":""},null,{"$f":"IF('PJ - P'!O75=\"\",\"\",'PJ - P'!O75)","v":""}]
[null,{"$f":"IF(AND('PJ - P'!$C76=\"\",'PJ - P'!$D76=\"\"),\"\",'PJ - P'!V76)","v":""},{"$f":"IF(AND('PJ - P'!$C76=\"\",'PJ - P'!$D76=\"\"),\"\",'PJ - P'!B76)","v":""},{"$f":"IF('PJ - P'!C76=\"\",\"\",'PJ - P'!C76)","v":""},{"$f":"IF('PJ - P'!D76=\"\",\"\",'PJ - P'!D76)","v":""},{"$f":"IF('PJ - P'!H76=\"\",\"\",'PJ - P'!H76)","v":""},{"$f":"IF('PJ - P'!M76=\"\",\"\",'PJ - P'!M76)","v":""},null,{"$f":"IF('PJ - P'!O76=\"\",\"\",'PJ - P'!O76)","v":""}]
[null,{"$f":"IF(AND('PJ - P'!$C77=\"\",'PJ - P'!$D77=\"\"),\"\",'PJ - P'!V77)","v":""},{"$f":"IF(AND('PJ - P'!$C77=\"\",'PJ - P'!$D77=\"\"),\"\",'PJ - P'!B77)","v":""},{"$f":"IF('PJ - P'!C77=\"\",\"\",'PJ - P'!C77)","v":""},{"$f":"IF('PJ - P'!D77=\"\",\"\",'PJ - P'!D77)","v":""},{"$f":"IF('PJ - P'!H77=\"\",\"\",'PJ - P'!H77)","v":""},{"$f":"IF('PJ - P'!M77=\"\",\"\",'PJ - P'!M77)","v":""},null,{"$f":"IF('PJ - P'!O77=\"\",\"\",'PJ - P'!O77)","v":""}]
[null,{"$f":"IF(AND('PJ - P'!$C78=\"\",'PJ - P'!$D78=\"\"),\"\",'PJ - P'!V78)","v":""},{"$f":"IF(AND('PJ - P'!$C78=\"\",'PJ - P'!$D78=\"\"),\"\",'PJ - P'!B78)","v":""},{"$f":"IF('PJ - P'!C78=\"\",\"\",'PJ - P'!C78)","v":""},{"$f":"IF('PJ - P'!D78=\"\",\"\",'PJ - P'!D78)","v":""},{"$f":"IF('PJ - P'!H78=\"\",\"\",'PJ - P'!H78)","v":""},{"$f":"IF('PJ - P'!M78=\"\",\"\",'PJ - P'!M78)","v":""},null,{"$f":"IF('PJ - P'!O78=\"\",\"\",'PJ - P'!O78)","v":""}]
[null,{"$f":"IF(AND('PJ - P'!$C79=\"\",'PJ - P'!$D79=\"\"),\"\",'PJ - P'!V79)","v":""},{"$f":"IF(AND('PJ - P'!$C79=\"\",'PJ - P'!$D79=\"\"),\"\",'PJ - P'!B79)","v":""},{"$f":"IF('PJ - P'!C79=\"\",\"\",'PJ - P'!C79)","v":""},{"$f":"IF('PJ - P'!D79=\"\",\"\",'PJ - P'!D79)","v":""},{"$f":"IF('PJ - P'!H79=\"\",\"\",'PJ - P'!H79)","v":""},{"$f":"IF('PJ - P'!M79=\"\",\"\",'PJ - P'!M79)","v":""},null,{"$f":"IF('PJ - P'!O79=\"\",\"\",'PJ - P'!O79)","v":""}]
[null,{"$f":"IF(AND('PJ - P'!$C80=\"\",'PJ - P'!$D80=\"\"),\"\",'PJ - P'!V80)","v":""},{"$f":"IF(AND('PJ - P'!$C80=\"\",'PJ - P'!$D80=\"\"),\"\",'PJ - P'!B80)","v":""},{"$f":"IF('PJ - P'!C80=\"\",\"\",'PJ - P'!C80)","v":""},{"$f":"IF('PJ - P'!D80=\"\",\"\",'PJ - P'!D80)","v":""},{"$f":"IF('PJ - P'!H80=\"\",\"\",'PJ - P'!H80)","v":""},{"$f":"IF('PJ - P'!M80=\"\",\"\",'PJ - P'!M80)","v":""},null,{"$f":"IF('PJ - P'!O80=\"\",\"\",'PJ - P'!O80)","v":""}]
[null,{"$f":"IF(AND('PJ - P'!$C81=\"\",'PJ - P'!$D81=\"\"),\"\",'PJ - P'!V81)","v":""},{"$f":"IF(AND('PJ - P'!$C81=\"\",'PJ - P'!$D81=\"\"),\"\",'PJ - P'!B81)","v":""},{"$f":"IF('PJ - P'!C81=\"\",\"\",'PJ - P'!C81)","v":""},{"$f":"IF('PJ - P'!D81=\"\",\"\",'PJ - P'!D81)","v":""},{"$f":"IF('PJ - P'!H81=\"\",\"\",'PJ - P'!H81)","v":""},{"$f":"IF('PJ - P'!M81=\"\",\"\",'PJ - P'!M81)","v":""},null,{"$f":"IF('PJ - P'!O81=\"\",\"\",'PJ - P'!O81)","v":""}]
[null,{"$f":"IF(AND('PJ - P'!$C82=\"\",'PJ - P'!$D82=\"\"),\"\",'PJ - P'!V82)","v":""},{"$f":"IF(AND('PJ - P'!$C82=\"\",'PJ - P'!$D82=\"\"),\"\",'PJ - P'!B82)","v":""},{"$f":"IF('PJ - P'!C82=\"\",\"\",'PJ - P'!C82)","v":""},{"$f":"IF('PJ - P'!D82=\"\",\"\",'PJ - P'!D82)","v":""},{"$f":"IF('PJ - P'!H82=\"\",\"\",'PJ - P'!H82)","v":""},{"$f":"IF('PJ - P'!M82=\"\",\"\",'PJ - P'!M82)","v":""},null,{"$f":"IF('PJ - P'!O82=\"\",\"\",'PJ - P'!O82)","v":""}]
[null,{"$f":"IF(AND('PJ - P'!$C83=\"\",'PJ - P'!$D83=\"\"),\"\",'PJ - P'!V83)","v":""},{"$f":"IF(AND('PJ - P'!$C83=\"\",'PJ - P'!$D83=\"\"),\"\",'PJ - P'!B83)","v":""},{"$f":"IF('PJ - P'!C83=\"\",\"\",'PJ - P'!C83)","v":""},{"$f":"IF('PJ - P'!D83=\"\",\"\",'PJ - P'!D83)","v":""},{"$f":"IF('PJ - P'!H83=\"\",\"\",'PJ - P'!H83)","v":""},{"$f":"IF('PJ - P'!M83=\"\",\"\",'PJ - P'!M83)","v":""},null,{"$f":"IF('PJ - P'!O83=\"\",\"\",'PJ - P'!O83)","v":""}]
[null,{"$f":"IF(AND('PJ - P'!$C84=\"\",'PJ - P'!$D84=\"\"),\"\",'PJ - P'!V84)","v":""},{"$f":"IF(AND('PJ - P'!$C84=\"\",'PJ - P'!$D84=\"\"),\"\",'PJ - P'!B84)","v":""},{"$f":"IF('PJ - P'!C84=\"\",\"\",'PJ - P'!C84)","v":""},{"$f":"IF('PJ - P'!D84=\"\",\"\",'PJ - P'!D84)","v":""},{"$f":"IF('PJ - P'!H84=\"\",\"\",'PJ - P'!H84)","v":""},{"$f":"IF('PJ - P'!M84=\"\",\"\",'PJ - P'!M84)","v":""},null,{"$f":"IF('PJ - P'!O84=\"\",\"\",'PJ - P'!O84)","v":""}]
[null,{"$f":"IF(AND('PJ - P'!$C85=\"\",'PJ - P'!$D85=\"\"),\"\",'PJ - P'!V85)","v":""},{"$f":"IF(AND('PJ - P'!$C85=\"\",'PJ - P'!$D85=\"\"),\"\",'PJ - P'!B85)","v":""},{"$f":"IF('PJ - P'!C85=\"\",\"\",'PJ - P'!C85)","v":""},{"$f":"IF('PJ - P'!D85=\"\",\"\",'PJ - P'!D85)","v":""},{"$f":"IF('PJ - P'!H85=\"\",\"\",'PJ - P'!H85)","v":""},{"$f":"IF('PJ - P'!M85=\"\",\"\",'PJ - P'!M85)","v":""},null,{"$f":"IF('PJ - P'!O85=\"\",\"\",'PJ - P'!O85)","v":""}]
[null,{"$f":"IF(AND('PJ - P'!$C86=\"\",'PJ - P'!$D86=\"\"),\"\",'PJ - P'!V86)","v":""},{"$f":"IF(AND('PJ - P'!$C86=\"\",'PJ - P'!$D86=\"\"),\"\",'PJ - P'!B86)","v":""},{"$f":"IF('PJ - P'!C86=\"\",\"\",'PJ - P'!C86)","v":""},{"$f":"IF('PJ - P'!D86=\"\",\"\",'PJ - P'!D86)","v":""},{"$f":"IF('PJ - P'!H86=\"\",\"\",'PJ - P'!H86)","v":""},{"$f":"IF('PJ - P'!M86=\"\",\"\",'PJ - P'!M86)","v":""},null,{"$f":"IF('PJ - P'!O86=\"\",\"\",'PJ - P'!O86)","v":""}]
[null,{"$f":"IF(AND('PJ - P'!$C87=\"\",'PJ - P'!$D87=\"\"),\"\",'PJ - P'!V87)","v":""},{"$f":"IF(AND('PJ - P'!$C87=\"\",'PJ - P'!$D87=\"\"),\"\",'PJ - P'!B87)","v":""},{"$f":"IF('PJ - P'!C87=\"\",\"\",'PJ - P'!C87)","v":""},{"$f":"IF('PJ - P'!D87=\"\",\"\",'PJ - P'!D87)","v":""},{"$f":"IF('PJ - P'!H87=\"\",\"\",'PJ - P'!H87)","v":""},{"$f":"IF('PJ - P'!M87=\"\",\"\",'PJ - P'!M87)","v":""},null,{"$f":"IF('PJ - P'!O87=\"\",\"\",'PJ - P'!O87)","v":""}]
[null,{"$f":"IF(AND('PJ - P'!$C88=\"\",'PJ - P'!$D88=\"\"),\"\",'PJ - P'!V88)","v":""},{"$f":"IF(AND('PJ - P'!$C88=\"\",'PJ - P'!$D88=\"\"),\"\",'PJ - P'!B88)","v":""},{"$f":"IF('PJ - P'!C88=\"\",\"\",'PJ - P'!C88)","v":""},{"$f":"IF('PJ - P'!D88=\"\",\"\",'PJ - P'!D88)","v":""},{"$f":"IF('PJ - P'!H88=\"\",\"\",'PJ - P'!H88)","v":""},{"$f":"IF('PJ - P'!M88=\"\",\"\",'PJ - P'!M88)","v":""},null,{"$f":"IF('PJ - P'!O88=\"\",\"\",'PJ - P'!O88)","v":""}]
[null,{"$f":"IF(AND('PJ - P'!$C89=\"\",'PJ - P'!$D89=\"\"),\"\",'PJ - P'!V89)","v":""},{"$f":"IF(AND('PJ - P'!$C89=\"\",'PJ - P'!$D89=\"\"),\"\",'PJ - P'!B89)","v":""},{"$f":"IF('PJ - P'!C89=\"\",\"\",'PJ - P'!C89)","v":""},{"$f":"IF('PJ - P'!D89=\"\",\"\",'PJ - P'!D89)","v":""},{"$f":"IF('PJ - P'!H89=\"\",\"\",'PJ - P'!H89)","v":""},{"$f":"IF('PJ - P'!M89=\"\",\"\",'PJ - P'!M89)","v":""},null,{"$f":"IF('PJ - P'!O89=\"\",\"\",'PJ - P'!O89)","v":""}]
[null,{"$f":"IF(AND('PJ - P'!$C90=\"\",'PJ - P'!$D90=\"\"),\"\",'PJ - P'!V90)","v":""},{"$f":"IF(AND('PJ - P'!$C90=\"\",'PJ - P'!$D90=\"\"),\"\",'PJ - P'!B90)","v":""},{"$f":"IF('PJ - P'!C90=\"\",\"\",'PJ - P'!C90)","v":""},{"$f":"IF('PJ - P'!D90=\"\",\"\",'PJ - P'!D90)","v":""},{"$f":"IF('PJ - P'!H90=\"\",\"\",'PJ - P'!H90)","v":""},{"$f":"IF('PJ - P'!M90=\"\",\"\",'PJ - P'!M90)","v":""},null,{"$f":"IF('PJ - P'!O90=\"\",\"\",'PJ - P'!O90)","v":""}]
[null,{"$f":"IF(AND('PJ - P'!$C91=\"\",'PJ - P'!$D91=\"\"),\"\",'PJ - P'!V91)","v":""},{"$f":"IF(AND('PJ - P'!$C91=\"\",'PJ - P'!$D91=\"\"),\"\",'PJ - P'!B91)","v":""},{"$f":"IF('PJ - P'!C91=\"\",\"\",'PJ - P'!C91)","v":""},{"$f":"IF('PJ - P'!D91=\"\",\"\",'PJ - P'!D91)","v":""},{"$f":"IF('PJ - P'!H91=\"\",\"\",'PJ - P'!H91)","v":""},{"$f":"IF('PJ - P'!M91=\"\",\"\",'PJ - P'!M91)","v":""},null,{"$f":"IF('PJ - P'!O91=\"\",\"\",'PJ - P'!O91)","v":""}]
[null,{"$f":"IF(AND('PJ - P'!$C92=\"\",'PJ - P'!$D92=\"\"),\"\",'PJ - P'!V92)","v":""},{"$f":"IF(AND('PJ - P'!$C92=\"\",'PJ - P'!$D92=\"\"),\"\",'PJ - P'!B92)","v":""},{"$f":"IF('PJ - P'!C92=\"\",\"\",'PJ - P'!C92)","v":""},{"$f":"IF('PJ - P'!D92=\"\",\"\",'PJ - P'!D92)","v":""},{"$f":"IF('PJ - P'!H92=\"\",\"\",'PJ - P'!H92)","v":""},{"$f":"IF('PJ - P'!M92=\"\",\"\",'PJ - P'!M92)","v":""},null,{"$f":"IF('PJ - P'!O92=\"\",\"\",'PJ - P'!O92)","v":""}]
[null,{"$f":"IF(AND('PJ - P'!$C93=\"\",'PJ - P'!$D93=\"\"),\"\",'PJ - P'!V93)","v":""},{"$f":"IF(AND('PJ - P'!$C93=\"\",'PJ - P'!$D93=\"\"),\"\",'PJ - P'!B93)","v":""},{"$f":"IF('PJ - P'!C93=\"\",\"\",'PJ - P'!C93)","v":""},{"$f":"IF('PJ - P'!D93=\"\",\"\",'PJ - P'!D93)","v":""},{"$f":"IF('PJ - P'!H93=\"\",\"\",'PJ - P'!H93)","v":""},{"$f":"IF('PJ - P'!M93=\"\",\"\",'PJ - P'!M93)","v":""},null,{"$f":"IF('PJ - P'!O93=\"\",\"\",'PJ - P'!O93)","v":""}]
[null,{"$f":"IF(AND('PJ - P'!$C94=\"\",'PJ - P'!$D94=\"\"),\"\",'PJ - P'!V94)","v":""},{"$f":"IF(AND('PJ - P'!$C94=\"\",'PJ - P'!$D94=\"\"),\"\",'PJ - P'!B94)","v":""},{"$f":"IF('PJ - P'!C94=\"\",\"\",'PJ - P'!C94)","v":""},{"$f":"IF('PJ - P'!D94=\"\",\"\",'PJ - P'!D94)","v":""},{"$f":"IF('PJ - P'!H94=\"\",\"\",'PJ - P'!H94)","v":""},{"$f":"IF('PJ - P'!M94=\"\",\"\",'PJ - P'!M94)","v":""},null,{"$f":"IF('PJ - P'!O94=\"\",\"\",'PJ - P'!O94)","v":""}]
[null,{"$f":"IF(AND('PJ - P'!$C95=\"\",'PJ - P'!$D95=\"\"),\"\",'PJ - P'!V95)","v":""},{"$f":"IF(AND('PJ - P'!$C95=\"\",'PJ - P'!$D95=\"\"),\"\",'PJ - P'!B95)","v":""},{"$f":"IF('PJ - P'!C95=\"\",\"\",'PJ - P'!C95)","v":""},{"$f":"IF('PJ - P'!D95=\"\",\"\",'PJ - P'!D95)","v":""},{"$f":"IF('PJ - P'!H95=\"\",\"\",'PJ - P'!H95)","v":""},{"$f":"IF('PJ - P'!M95=\"\",\"\",'PJ - P'!M95)","v":""},null,{"$f":"IF('PJ - P'!O95=\"\",\"\",'PJ - P'!O95)","v":""}]
[null,{"$f":"IF(AND('PJ - P'!$C96=\"\",'PJ - P'!$D96=\"\"),\"\",'PJ - P'!V96)","v":""},{"$f":"IF(AND('PJ - P'!$C96=\"\",'PJ - P'!$D96=\"\"),\"\",'PJ - P'!B96)","v":""},{"$f":"IF('PJ - P'!C96=\"\",\"\",'PJ - P'!C96)","v":""},{"$f":"IF('PJ - P'!D96=\"\",\"\",'PJ - P'!D96)","v":""},{"$f":"IF('PJ - P'!H96=\"\",\"\",'PJ - P'!H96)","v":""},{"$f":"IF('PJ - P'!M96=\"\",\"\",'PJ - P'!M96)","v":""},null,{"$f":"IF('PJ - P'!O96=\"\",\"\",'PJ - P'!O96)","v":""}]
[null,{"$f":"IF(AND('PJ - P'!$C97=\"\",'PJ - P'!$D97=\"\"),\"\",'PJ - P'!V97)","v":""},{"$f":"IF(AND('PJ - P'!$C97=\"\",'PJ - P'!$D97=\"\"),\"\",'PJ - P'!B97)","v":""},{"$f":"IF('PJ - P'!C97=\"\",\"\",'PJ - P'!C97)","v":""},{"$f":"IF('PJ - P'!D97=\"\",\"\",'PJ - P'!D97)","v":""},{"$f":"IF('PJ - P'!H97=\"\",\"\",'PJ - P'!H97)","v":""},{"$f":"IF('PJ - P'!M97=\"\",\"\",'PJ - P'!M97)","v":""},null,{"$f":"IF('PJ - P'!O97=\"\",\"\",'PJ - P'!O97)","v":""}]
[null,{"$f":"IF(AND('PJ - P'!$C98=\"\",'PJ - P'!$D98=\"\"),\"\",'PJ - P'!V98)","v":""},{"$f":"IF(AND('PJ - P'!$C98=\"\",'PJ - P'!$D98=\"\"),\"\",'PJ - P'!B98)","v":""},{"$f":"IF('PJ - P'!C98=\"\",\"\",'PJ - P'!C98)","v":""},{"$f":"IF('PJ - P'!D98=\"\",\"\",'PJ - P'!D98)","v":""},{"$f":"IF('PJ - P'!H98=\"\",\"\",'PJ - P'!H98)","v":""},{"$f":"IF('PJ - P'!M98=\"\",\"\",'PJ - P'!M98)","v":""},null,{"$f":"IF('PJ - P'!O98=\"\",\"\",'PJ - P'!O98)","v":""}]
[null,{"$f":"IF(AND('PJ - P'!$C99=\"\",'PJ - P'!$D99=\"\"),\"\",'PJ - P'!V99)","v":""},{"$f":"IF(AND('PJ - P'!$C99=\"\",'PJ - P'!$D99=\"\"),\"\",'PJ - P'!B99)","v":""},{"$f":"IF('PJ - P'!C99=\"\",\"\",'PJ - P'!C99)","v":""},{"$f":"IF('PJ - P'!D99=\"\",\"\",'PJ - P'!D99)","v":""},{"$f":"IF('PJ - P'!H99=\"\",\"\",'PJ - P'!H99)","v":""},{"$f":"IF('PJ - P'!M99=\"\",\"\",'PJ - P'!M99)","v":""},null,{"$f":"IF('PJ - P'!O99=\"\",\"\",'PJ - P'!O99)","v":""}]
[null,{"$f":"IF(AND('PJ - P'!$C100=\"\",'PJ - P'!$D100=\"\"),\"\",'PJ - P'!V100)","v":""},{"$f":"IF(AND('PJ - P'!$C100=\"\",'PJ - P'!$D100=\"\"),\"\",'PJ - P'!B100)","v":""},{"$f":"IF('PJ - P'!C100=\"\",\"\",'PJ - P'!C100)","v":""},{"$f":"IF('PJ - P'!D100=\"\",\"\",'PJ - P'!D100)","v":""},{"$f":"IF('PJ - P'!H100=\"\",\"\",'PJ - P'!H100)","v":""},{"$f":"IF('PJ - P'!M100=\"\",\"\",'PJ - P'!M100)","v":""},null,{"$f":"IF('PJ - P'!O100=\"\",\"\",'PJ - P'!O100)","v":""}]
[null,{"$f":"IF(AND('PJ - P'!$C101=\"\",'PJ - P'!$D101=\"\"),\"\",'PJ - P'!V101)","v":""},{"$f":"IF(AND('PJ - P'!$C101=\"\",'PJ - P'!$D101=\"\"),\"\",'PJ - P'!B101)","v":""},{"$f":"IF('PJ - P'!C101=\"\",\"\",'PJ - P'!C101)","v":""},{"$f":"IF('PJ - P'!D101=\"\",\"\",'PJ - P'!D101)","v":""},{"$f":"IF('PJ - P'!H101=\"\",\"\",'PJ - P'!H101)","v":""},{"$f":"IF('PJ - P'!M101=\"\",\"\",'PJ - P'!M101)","v":""},null,{"$f":"IF('PJ - P'!O101=\"\",\"\",'PJ - P'!O101)","v":""}]
[null,{"$f":"IF(AND('PJ - P'!$C102=\"\",'PJ - P'!$D102=\"\"),\"\",'PJ - P'!V102)","v":""},{"$f":"IF(AND('PJ - P'!$C102=\"\",'PJ - P'!$D102=\"\"),\"\",'PJ - P'!B102)","v":""},{"$f":"IF('PJ - P'!C102=\"\",\"\",'PJ - P'!C102)","v":""},{"$f":"IF('PJ - P'!D102=\"\",\"\",'PJ - P'!D102)","v":""},{"$f":"IF('PJ - P'!H102=\"\",\"\",'PJ - P'!H102)","v":""},{"$f":"IF('PJ - P'!M102=\"\",\"\",'PJ - P'!M102)","v":""},null,{"$f":"IF('PJ - P'!O102=\"\",\"\",'PJ - P'!O102)","v":""}]
[null,{"$f":"IF(AND('PJ - P'!$C103=\"\",'PJ - P'!$D103=\"\"),\"\",'PJ - P'!V103)","v":""},{"$f":"IF(AND('PJ - P'!$C103=\"\",'PJ - P'!$D103=\"\"),\"\",'PJ - P'!B103)","v":""},{"$f":"IF('PJ - P'!C103=\"\",\"\",'PJ - P'!C103)","v":""},{"$f":"IF('PJ - P'!D103=\"\",\"\",'PJ - P'!D103)","v":""},{"$f":"IF('PJ - P'!H103=\"\",\"\",'PJ - P'!H103)","v":""},{"$f":"IF('PJ - P'!M103=\"\",\"\",'PJ - P'!M103)","v":""},null,{"$f":"IF('PJ - P'!O103=\"\",\"\",'PJ - P'!O103)","v":""}]
[null,{"$f":"IF(AND('PJ - P'!$C104=\"\",'PJ - P'!$D104=\"\"),\"\",'PJ - P'!V104)","v":""},{"$f":"IF(AND('PJ - P'!$C104=\"\",'PJ - P'!$D104=\"\"),\"\",'PJ - P'!B104)","v":""},{"$f":"IF('PJ - P'!C104=\"\",\"\",'PJ - P'!C104)","v":""},{"$f":"IF('PJ - P'!D104=\"\",\"\",'PJ - P'!D104)","v":""},{"$f":"IF('PJ - P'!H104=\"\",\"\",'PJ - P'!H104)","v":""},{"$f":"IF('PJ - P'!M104=\"\",\"\",'PJ - P'!M104)","v":""},null,{"$f":"IF('PJ - P'!O104=\"\",\"\",'PJ - P'!O104)","v":""}]
[null,{"$f":"IF(AND('PJ - P'!$C105=\"\",'PJ - P'!$D105=\"\"),\"\",'PJ - P'!V105)","v":""},{"$f":"IF(AND('PJ - P'!$C105=\"\",'PJ - P'!$D105=\"\"),\"\",'PJ - P'!B105)","v":""},{"$f":"IF('PJ - P'!C105=\"\",\"\",'PJ - P'!C105)","v":""},{"$f":"IF('PJ - P'!D105=\"\",\"\",'PJ - P'!D105)","v":""},{"$f":"IF('PJ - P'!H105=\"\",\"\",'PJ - P'!H105)","v":""},{"$f":"IF('PJ - P'!M105=\"\",\"\",'PJ - P'!M105)","v":""},null,{"$f":"IF('PJ - P'!O105=\"\",\"\",'PJ - P'!O105)","v":""}]
[null,{"$f":"IF(AND('PJ - P'!$C106=\"\",'PJ - P'!$D106=\"\"),\"\",'PJ - P'!V106)","v":""},{"$f":"IF(AND('PJ - P'!$C106=\"\",'PJ - P'!$D106=\"\"),\"\",'PJ - P'!B106)","v":""},{"$f":"IF('PJ - P'!C106=\"\",\"\",'PJ - P'!C106)","v":""},{"$f":"IF('PJ - P'!D106=\"\",\"\",'PJ - P'!D106)","v":""},{"$f":"IF('PJ - P'!H106=\"\",\"\",'PJ - P'!H106)","v":""},{"$f":"IF('PJ - P'!M106=\"\",\"\",'PJ - P'!M106)","v":""},null,{"$f":"IF('PJ - P'!O106=\"\",\"\",'PJ - P'!O106)","v":""}]
[null,{"$f":"IF(AND('PJ - P'!$C107=\"\",'PJ - P'!$D107=\"\"),\"\",'PJ - P'!V107)","v":""},{"$f":"IF(AND('PJ - P'!$C107=\"\",'PJ - P'!$D107=\"\"),\"\",'PJ - P'!B107)","v":""},{"$f":"IF('PJ - P'!C107=\"\",\"\",'PJ - P'!C107)","v":""},{"$f":"IF('PJ - P'!D107=\"\",\"\",'PJ - P'!D107)","v":""},{"$f":"IF('PJ - P'!H107=\"\",\"\",'PJ - P'!H107)","v":""},{"$f":"IF('PJ - P'!M107=\"\",\"\",'PJ - P'!M107)","v":""},null,{"$f":"IF('PJ - P'!O107=\"\",\"\",'PJ - P'!O107)","v":""}]
[null,{"$f":"IF(AND('PJ - P'!$C108=\"\",'PJ - P'!$D108=\"\"),\"\",'PJ - P'!V108)","v":""},{"$f":"IF(AND('PJ - P'!$C108=\"\",'PJ - P'!$D108=\"\"),\"\",'PJ - P'!B108)","v":""},{"$f":"IF('PJ - P'!C108=\"\",\"\",'PJ - P'!C108)","v":""},{"$f":"IF('PJ - P'!D108=\"\",\"\",'PJ - P'!D108)","v":""},{"$f":"IF('PJ - P'!H108=\"\",\"\",'PJ - P'!H108)","v":""},{"$f":"IF('PJ - P'!M108=\"\",\"\",'PJ - P'!M108)","v":""},null,{"$f":"IF('PJ - P'!O108=\"\",\"\",'PJ - P'!O108)","v":""}]
[null,{"$f":"B87","v":"Běh na 100m s přek. - D - Pořadí jednotlivců"}]
[]
[null,{"$f":"$B$3","v":"Krajské kolo dorostu"},null,null,{"$f":"$E$3","v":"18.06.2022 Pardubice"}]
[]
[null,{"$f":"Start!$D$5","v":"dorostenky"}]
[null,"Pořadí","Start. číslo","Jméno","kolektiv","čas           I. pokusu","čas          II. pokusu",null,"Výsledný čas"]
[]
[null,{"$f":"IF(AND('PJ - P'!$C109=\"\",'PJ - P'!$D109=\"\"),\"\",'PJ - P'!V109)","v":""},{"$f":"IF(AND('PJ - P'!$C109=\"\",'PJ - P'!$D109=\"\"),\"\",'PJ - P'!B109)","v":""},{"$f":"IF('PJ - P'!C109=\"\",\"\",'PJ - P'!C109)","v":""},{"$f":"IF('PJ - P'!D109=\"\",\"\",'PJ - P'!D109)","v":""},{"$f":"IF('PJ - P'!H109=\"\",\"\",'PJ - P'!H109)","v":""},{"$f":"IF('PJ - P'!M109=\"\",\"\",'PJ - P'!M109)","v":""},null,{"$f":"IF('PJ - P'!O109=\"\",\"\",'PJ - P'!O109)","v":""}]
[null,{"$f":"IF(AND('PJ - P'!$C110=\"\",'PJ - P'!$D110=\"\"),\"\",'PJ - P'!V110)","v":""},{"$f":"IF(AND('PJ - P'!$C110=\"\",'PJ - P'!$D110=\"\"),\"\",'PJ - P'!B110)","v":""},{"$f":"IF('PJ - P'!C110=\"\",\"\",'PJ - P'!C110)","v":""},{"$f":"IF('PJ - P'!D110=\"\",\"\",'PJ - P'!D110)","v":""},{"$f":"IF('PJ - P'!H110=\"\",\"\",'PJ - P'!H110)","v":""},{"$f":"IF('PJ - P'!M110=\"\",\"\",'PJ - P'!M110)","v":""},null,{"$f":"IF('PJ - P'!O110=\"\",\"\",'PJ - P'!O110)","v":""}]
[null,{"$f":"IF(AND('PJ - P'!$C111=\"\",'PJ - P'!$D111=\"\"),\"\",'PJ - P'!V111)","v":""},{"$f":"IF(AND('PJ - P'!$C111=\"\",'PJ - P'!$D111=\"\"),\"\",'PJ - P'!B111)","v":""},{"$f":"IF('PJ - P'!C111=\"\",\"\",'PJ - P'!C111)","v":""},{"$f":"IF('PJ - P'!D111=\"\",\"\",'PJ - P'!D111)","v":""},{"$f":"IF('PJ - P'!H111=\"\",\"\",'PJ - P'!H111)","v":""},{"$f":"IF('PJ - P'!M111=\"\",\"\",'PJ - P'!M111)","v":""},null,{"$f":"IF('PJ - P'!O111=\"\",\"\",'PJ - P'!O111)","v":""}]
[null,{"$f":"IF(AND('PJ - P'!$C112=\"\",'PJ - P'!$D112=\"\"),\"\",'PJ - P'!V112)","v":""},{"$f":"IF(AND('PJ - P'!$C112=\"\",'PJ - P'!$D112=\"\"),\"\",'PJ - P'!B112)","v":""},{"$f":"IF('PJ - P'!C112=\"\",\"\",'PJ - P'!C112)","v":""},{"$f":"IF('PJ - P'!D112=\"\",\"\",'PJ - P'!D112)","v":""},{"$f":"IF('PJ - P'!H112=\"\",\"\",'PJ - P'!H112)","v":""},{"$f":"IF('PJ - P'!M112=\"\",\"\",'PJ - P'!M112)","v":""},null,{"$f":"IF('PJ - P'!O112=\"\",\"\",'PJ - P'!O112)","v":""}]
[null,{"$f":"IF(AND('PJ - P'!$C113=\"\",'PJ - P'!$D113=\"\"),\"\",'PJ - P'!V113)","v":""},{"$f":"IF(AND('PJ - P'!$C113=\"\",'PJ - P'!$D113=\"\"),\"\",'PJ - P'!B113)","v":""},{"$f":"IF('PJ - P'!C113=\"\",\"\",'PJ - P'!C113)","v":""},{"$f":"IF('PJ - P'!D113=\"\",\"\",'PJ - P'!D113)","v":""},{"$f":"IF('PJ - P'!H113=\"\",\"\",'PJ - P'!H113)","v":""},{"$f":"IF('PJ - P'!M113=\"\",\"\",'PJ - P'!M113)","v":""},null,{"$f":"IF('PJ - P'!O113=\"\",\"\",'PJ - P'!O113)","v":""}]
[null,{"$f":"IF(AND('PJ - P'!$C114=\"\",'PJ - P'!$D114=\"\"),\"\",'PJ - P'!V114)","v":""},{"$f":"IF(AND('PJ - P'!$C114=\"\",'PJ - P'!$D114=\"\"),\"\",'PJ - P'!B114)","v":""},{"$f":"IF('PJ - P'!C114=\"\",\"\",'PJ - P'!C114)","v":""},{"$f":"IF('PJ - P'!D114=\"\",\"\",'PJ - P'!D114)","v":""},{"$f":"IF('PJ - P'!H114=\"\",\"\",'PJ - P'!H114)","v":""},{"$f":"IF('PJ - P'!M114=\"\",\"\",'PJ - P'!M114)","v":""},null,{"$f":"IF('PJ - P'!O114=\"\",\"\",'PJ - P'!O114)","v":""}]
[null,{"$f":"IF(AND('PJ - P'!$C115=\"\",'PJ - P'!$D115=\"\"),\"\",'PJ - P'!V115)","v":""},{"$f":"IF(AND('PJ - P'!$C115=\"\",'PJ - P'!$D115=\"\"),\"\",'PJ - P'!B115)","v":""},{"$f":"IF('PJ - P'!C115=\"\",\"\",'PJ - P'!C115)","v":""},{"$f":"IF('PJ - P'!D115=\"\",\"\",'PJ - P'!D115)","v":""},{"$f":"IF('PJ - P'!H115=\"\",\"\",'PJ - P'!H115)","v":""},{"$f":"IF('PJ - P'!M115=\"\",\"\",'PJ - P'!M115)","v":""},null,{"$f":"IF('PJ - P'!O115=\"\",\"\",'PJ - P'!O115)","v":""}]
[null,{"$f":"IF(AND('PJ - P'!$C116=\"\",'PJ - P'!$D116=\"\"),\"\",'PJ - P'!V116)","v":""},{"$f":"IF(AND('PJ - P'!$C116=\"\",'PJ - P'!$D116=\"\"),\"\",'PJ - P'!B116)","v":""},{"$f":"IF('PJ - P'!C116=\"\",\"\",'PJ - P'!C116)","v":""},{"$f":"IF('PJ - P'!D116=\"\",\"\",'PJ - P'!D116)","v":""},{"$f":"IF('PJ - P'!H116=\"\",\"\",'PJ - P'!H116)","v":""},{"$f":"IF('PJ - P'!M116=\"\",\"\",'PJ - P'!M116)","v":""},null,{"$f":"IF('PJ - P'!O116=\"\",\"\",'PJ - P'!O116)","v":""}]
[null,{"$f":"IF(AND('PJ - P'!$C117=\"\",'PJ - P'!$D117=\"\"),\"\",'PJ - P'!V117)","v":""},{"$f":"IF(AND('PJ - P'!$C117=\"\",'PJ - P'!$D117=\"\"),\"\",'PJ - P'!B117)","v":""},{"$f":"IF('PJ - P'!C117=\"\",\"\",'PJ - P'!C117)","v":""},{"$f":"IF('PJ - P'!D117=\"\",\"\",'PJ - P'!D117)","v":""},{"$f":"IF('PJ - P'!H117=\"\",\"\",'PJ - P'!H117)","v":""},{"$f":"IF('PJ - P'!M117=\"\",\"\",'PJ - P'!M117)","v":""},null,{"$f":"IF('PJ - P'!O117=\"\",\"\",'PJ - P'!O117)","v":""}]
[null,{"$f":"IF(AND('PJ - P'!$C118=\"\",'PJ - P'!$D118=\"\"),\"\",'PJ - P'!V118)","v":""},{"$f":"IF(AND('PJ - P'!$C118=\"\",'PJ - P'!$D118=\"\"),\"\",'PJ - P'!B118)","v":""},{"$f":"IF('PJ - P'!C118=\"\",\"\",'PJ - P'!C118)","v":""},{"$f":"IF('PJ - P'!D118=\"\",\"\",'PJ - P'!D118)","v":""},{"$f":"IF('PJ - P'!H118=\"\",\"\",'PJ - P'!H118)","v":""},{"$f":"IF('PJ - P'!M118=\"\",\"\",'PJ - P'!M118)","v":""},null,{"$f":"IF('PJ - P'!O118=\"\",\"\",'PJ - P'!O118)","v":""}]
[null,{"$f":"IF(AND('PJ - P'!$C119=\"\",'PJ - P'!$D119=\"\"),\"\",'PJ - P'!V119)","v":""},{"$f":"IF(AND('PJ - P'!$C119=\"\",'PJ - P'!$D119=\"\"),\"\",'PJ - P'!B119)","v":""},{"$f":"IF('PJ - P'!C119=\"\",\"\",'PJ - P'!C119)","v":""},{"$f":"IF('PJ - P'!D119=\"\",\"\",'PJ - P'!D119)","v":""},{"$f":"IF('PJ - P'!H119=\"\",\"\",'PJ - P'!H119)","v":""},{"$f":"IF('PJ - P'!M119=\"\",\"\",'PJ - P'!M119)","v":""},null,{"$f":"IF('PJ - P'!O119=\"\",\"\",'PJ - P'!O119)","v":""}]
[null,{"$f":"IF(AND('PJ - P'!$C120=\"\",'PJ - P'!$D120=\"\"),\"\",'PJ - P'!V120)","v":""},{"$f":"IF(AND('PJ - P'!$C120=\"\",'PJ - P'!$D120=\"\"),\"\",'PJ - P'!B120)","v":""},{"$f":"IF('PJ - P'!C120=\"\",\"\",'PJ - P'!C120)","v":""},{"$f":"IF('PJ - P'!D120=\"\",\"\",'PJ - P'!D120)","v":""},{"$f":"IF('PJ - P'!H120=\"\",\"\",'PJ - P'!H120)","v":""},{"$f":"IF('PJ - P'!M120=\"\",\"\",'PJ - P'!M120)","v":""},null,{"$f":"IF('PJ - P'!O120=\"\",\"\",'PJ - P'!O120)","v":""}]
[null,{"$f":"IF(AND('PJ - P'!$C121=\"\",'PJ - P'!$D121=\"\"),\"\",'PJ - P'!V121)","v":""},{"$f":"IF(AND('PJ - P'!$C121=\"\",'PJ - P'!$D121=\"\"),\"\",'PJ - P'!B121)","v":""},{"$f":"IF('PJ - P'!C121=\"\",\"\",'PJ - P'!C121)","v":""},{"$f":"IF('PJ - P'!D121=\"\",\"\",'PJ - P'!D121)","v":""},{"$f":"IF('PJ - P'!H121=\"\",\"\",'PJ - P'!H121)","v":""},{"$f":"IF('PJ - P'!M121=\"\",\"\",'PJ - P'!M121)","v":""},null,{"$f":"IF('PJ - P'!O121=\"\",\"\",'PJ - P'!O121)","v":""}]
[null,{"$f":"IF(AND('PJ - P'!$C122=\"\",'PJ - P'!$D122=\"\"),\"\",'PJ - P'!V122)","v":""},{"$f":"IF(AND('PJ - P'!$C122=\"\",'PJ - P'!$D122=\"\"),\"\",'PJ - P'!B122)","v":""},{"$f":"IF('PJ - P'!C122=\"\",\"\",'PJ - P'!C122)","v":""},{"$f":"IF('PJ - P'!D122=\"\",\"\",'PJ - P'!D122)","v":""},{"$f":"IF('PJ - P'!H122=\"\",\"\",'PJ - P'!H122)","v":""},{"$f":"IF('PJ - P'!M122=\"\",\"\",'PJ - P'!M122)","v":""},null,{"$f":"IF('PJ - P'!O122=\"\",\"\",'PJ - P'!O122)","v":""}]
[null,{"$f":"IF(AND('PJ - P'!$C123=\"\",'PJ - P'!$D123=\"\"),\"\",'PJ - P'!V123)","v":""},{"$f":"IF(AND('PJ - P'!$C123=\"\",'PJ - P'!$D123=\"\"),\"\",'PJ - P'!B123)","v":""},{"$f":"IF('PJ - P'!C123=\"\",\"\",'PJ - P'!C123)","v":""},{"$f":"IF('PJ - P'!D123=\"\",\"\",'PJ - P'!D123)","v":""},{"$f":"IF('PJ - P'!H123=\"\",\"\",'PJ - P'!H123)","v":""},{"$f":"IF('PJ - P'!M123=\"\",\"\",'PJ - P'!M123)","v":""},null,{"$f":"IF('PJ - P'!O123=\"\",\"\",'PJ - P'!O123)","v":""}]
[null,{"$f":"IF(AND('PJ - P'!$C124=\"\",'PJ - P'!$D124=\"\"),\"\",'PJ - P'!V124)","v":""},{"$f":"IF(AND('PJ - P'!$C124=\"\",'PJ - P'!$D124=\"\"),\"\",'PJ - P'!B124)","v":""},{"$f":"IF('PJ - P'!C124=\"\",\"\",'PJ - P'!C124)","v":""},{"$f":"IF('PJ - P'!D124=\"\",\"\",'PJ - P'!D124)","v":""},{"$f":"IF('PJ - P'!H124=\"\",\"\",'PJ - P'!H124)","v":""},{"$f":"IF('PJ - P'!M124=\"\",\"\",'PJ - P'!M124)","v":""},null,{"$f":"IF('PJ - P'!O124=\"\",\"\",'PJ - P'!O124)","v":""}]
[null,{"$f":"IF(AND('PJ - P'!$C125=\"\",'PJ - P'!$D125=\"\"),\"\",'PJ - P'!V125)","v":""},{"$f":"IF(AND('PJ - P'!$C125=\"\",'PJ - P'!$D125=\"\"),\"\",'PJ - P'!B125)","v":""},{"$f":"IF('PJ - P'!C125=\"\",\"\",'PJ - P'!C125)","v":""},{"$f":"IF('PJ - P'!D125=\"\",\"\",'PJ - P'!D125)","v":""},{"$f":"IF('PJ - P'!H125=\"\",\"\",'PJ - P'!H125)","v":""},{"$f":"IF('PJ - P'!M125=\"\",\"\",'PJ - P'!M125)","v":""},null,{"$f":"IF('PJ - P'!O125=\"\",\"\",'PJ - P'!O125)","v":""}]
[null,{"$f":"IF(AND('PJ - P'!$C126=\"\",'PJ - P'!$D126=\"\"),\"\",'PJ - P'!V126)","v":""},{"$f":"IF(AND('PJ - P'!$C126=\"\",'PJ - P'!$D126=\"\"),\"\",'PJ - P'!B126)","v":""},{"$f":"IF('PJ - P'!C126=\"\",\"\",'PJ - P'!C126)","v":""},{"$f":"IF('PJ - P'!D126=\"\",\"\",'PJ - P'!D126)","v":""},{"$f":"IF('PJ - P'!H126=\"\",\"\",'PJ - P'!H126)","v":""},{"$f":"IF('PJ - P'!M126=\"\",\"\",'PJ - P'!M126)","v":""},null,{"$f":"IF('PJ - P'!O126=\"\",\"\",'PJ - P'!O126)","v":""}]
[null,{"$f":"IF(AND('PJ - P'!$C127=\"\",'PJ - P'!$D127=\"\"),\"\",'PJ - P'!V127)","v":""},{"$f":"IF(AND('PJ - P'!$C127=\"\",'PJ - P'!$D127=\"\"),\"\",'PJ - P'!B127)","v":""},{"$f":"IF('PJ - P'!C127=\"\",\"\",'PJ - P'!C127)","v":""},{"$f":"IF('PJ - P'!D127=\"\",\"\",'PJ - P'!D127)","v":""},{"$f":"IF('PJ - P'!H127=\"\",\"\",'PJ - P'!H127)","v":""},{"$f":"IF('PJ - P'!M127=\"\",\"\",'PJ - P'!M127)","v":""},null,{"$f":"IF('PJ - P'!O127=\"\",\"\",'PJ - P'!O127)","v":""}]
[null,{"$f":"IF(AND('PJ - P'!$C128=\"\",'PJ - P'!$D128=\"\"),\"\",'PJ - P'!V128)","v":""},{"$f":"IF(AND('PJ - P'!$C128=\"\",'PJ - P'!$D128=\"\"),\"\",'PJ - P'!B128)","v":""},{"$f":"IF('PJ - P'!C128=\"\",\"\",'PJ - P'!C128)","v":""},{"$f":"IF('PJ - P'!D128=\"\",\"\",'PJ - P'!D128)","v":""},{"$f":"IF('PJ - P'!H128=\"\",\"\",'PJ - P'!H128)","v":""},{"$f":"IF('PJ - P'!M128=\"\",\"\",'PJ - P'!M128)","v":""},null,{"$f":"IF('PJ - P'!O128=\"\",\"\",'PJ - P'!O128)","v":""}]
[null,{"$f":"IF(AND('PJ - P'!$C129=\"\",'PJ - P'!$D129=\"\"),\"\",'PJ - P'!V129)","v":""},{"$f":"IF(AND('PJ - P'!$C129=\"\",'PJ - P'!$D129=\"\"),\"\",'PJ - P'!B129)","v":""},{"$f":"IF('PJ - P'!C129=\"\",\"\",'PJ - P'!C129)","v":""},{"$f":"IF('PJ - P'!D129=\"\",\"\",'PJ - P'!D129)","v":""},{"$f":"IF('PJ - P'!H129=\"\",\"\",'PJ - P'!H129)","v":""},{"$f":"IF('PJ - P'!M129=\"\",\"\",'PJ - P'!M129)","v":""},null,{"$f":"IF('PJ - P'!O129=\"\",\"\",'PJ - P'!O129)","v":""}]
[null,{"$f":"IF(AND('PJ - P'!$C130=\"\",'PJ - P'!$D130=\"\"),\"\",'PJ - P'!V130)","v":""},{"$f":"IF(AND('PJ - P'!$C130=\"\",'PJ - P'!$D130=\"\"),\"\",'PJ - P'!B130)","v":""},{"$f":"IF('PJ - P'!C130=\"\",\"\",'PJ - P'!C130)","v":""},{"$f":"IF('PJ - P'!D130=\"\",\"\",'PJ - P'!D130)","v":""},{"$f":"IF('PJ - P'!H130=\"\",\"\",'PJ - P'!H130)","v":""},{"$f":"IF('PJ - P'!M130=\"\",\"\",'PJ - P'!M130)","v":""},null,{"$f":"IF('PJ - P'!O130=\"\",\"\",'PJ - P'!O130)","v":""}]
[null,{"$f":"IF(AND('PJ - P'!$C131=\"\",'PJ - P'!$D131=\"\"),\"\",'PJ - P'!V131)","v":""},{"$f":"IF(AND('PJ - P'!$C131=\"\",'PJ - P'!$D131=\"\"),\"\",'PJ - P'!B131)","v":""},{"$f":"IF('PJ - P'!C131=\"\",\"\",'PJ - P'!C131)","v":""},{"$f":"IF('PJ - P'!D131=\"\",\"\",'PJ - P'!D131)","v":""},{"$f":"IF('PJ - P'!H131=\"\",\"\",'PJ - P'!H131)","v":""},{"$f":"IF('PJ - P'!M131=\"\",\"\",'PJ - P'!M131)","v":""},null,{"$f":"IF('PJ - P'!O131=\"\",\"\",'PJ - P'!O131)","v":""}]
[null,{"$f":"IF(AND('PJ - P'!$C132=\"\",'PJ - P'!$D132=\"\"),\"\",'PJ - P'!V132)","v":""},{"$f":"IF(AND('PJ - P'!$C132=\"\",'PJ - P'!$D132=\"\"),\"\",'PJ - P'!B132)","v":""},{"$f":"IF('PJ - P'!C132=\"\",\"\",'PJ - P'!C132)","v":""},{"$f":"IF('PJ - P'!D132=\"\",\"\",'PJ - P'!D132)","v":""},{"$f":"IF('PJ - P'!H132=\"\",\"\",'PJ - P'!H132)","v":""},{"$f":"IF('PJ - P'!M132=\"\",\"\",'PJ - P'!M132)","v":""},null,{"$f":"IF('PJ - P'!O132=\"\",\"\",'PJ - P'!O132)","v":""}]
[null,{"$f":"IF(AND('PJ - P'!$C133=\"\",'PJ - P'!$D133=\"\"),\"\",'PJ - P'!V133)","v":""},{"$f":"IF(AND('PJ - P'!$C133=\"\",'PJ - P'!$D133=\"\"),\"\",'PJ - P'!B133)","v":""},{"$f":"IF('PJ - P'!C133=\"\",\"\",'PJ - P'!C133)","v":""},{"$f":"IF('PJ - P'!D133=\"\",\"\",'PJ - P'!D133)","v":""},{"$f":"IF('PJ - P'!H133=\"\",\"\",'PJ - P'!H133)","v":""},{"$f":"IF('PJ - P'!M133=\"\",\"\",'PJ - P'!M133)","v":""},null,{"$f":"IF('PJ - P'!O133=\"\",\"\",'PJ - P'!O133)","v":""}]
[null,{"$f":"IF(AND('PJ - P'!$C134=\"\",'PJ - P'!$D134=\"\"),\"\",'PJ - P'!V134)","v":""},{"$f":"IF(AND('PJ - P'!$C134=\"\",'PJ - P'!$D134=\"\"),\"\",'PJ - P'!B134)","v":""},{"$f":"IF('PJ - P'!C134=\"\",\"\",'PJ - P'!C134)","v":""},{"$f":"IF('PJ - P'!D134=\"\",\"\",'PJ - P'!D134)","v":""},{"$f":"IF('PJ - P'!H134=\"\",\"\",'PJ - P'!H134)","v":""},{"$f":"IF('PJ - P'!M134=\"\",\"\",'PJ - P'!M134)","v":""},null,{"$f":"IF('PJ - P'!O134=\"\",\"\",'PJ - P'!O134)","v":""}]
[null,{"$f":"IF(AND('PJ - P'!$C135=\"\",'PJ - P'!$D135=\"\"),\"\",'PJ - P'!V135)","v":""},{"$f":"IF(AND('PJ - P'!$C135=\"\",'PJ - P'!$D135=\"\"),\"\",'PJ - P'!B135)","v":""},{"$f":"IF('PJ - P'!C135=\"\",\"\",'PJ - P'!C135)","v":""},{"$f":"IF('PJ - P'!D135=\"\",\"\",'PJ - P'!D135)","v":""},{"$f":"IF('PJ - P'!H135=\"\",\"\",'PJ - P'!H135)","v":""},{"$f":"IF('PJ - P'!M135=\"\",\"\",'PJ - P'!M135)","v":""},null,{"$f":"IF('PJ - P'!O135=\"\",\"\",'PJ - P'!O135)","v":""}]
[null,{"$f":"IF(AND('PJ - P'!$C136=\"\",'PJ - P'!$D136=\"\"),\"\",'PJ - P'!V136)","v":""},{"$f":"IF(AND('PJ - P'!$C136=\"\",'PJ - P'!$D136=\"\"),\"\",'PJ - P'!B136)","v":""},{"$f":"IF('PJ - P'!C136=\"\",\"\",'PJ - P'!C136)","v":""},{"$f":"IF('PJ - P'!D136=\"\",\"\",'PJ - P'!D136)","v":""},{"$f":"IF('PJ - P'!H136=\"\",\"\",'PJ - P'!H136)","v":""},{"$f":"IF('PJ - P'!M136=\"\",\"\",'PJ - P'!M136)","v":""},null,{"$f":"IF('PJ - P'!O136=\"\",\"\",'PJ - P'!O136)","v":""}]
[null,{"$f":"IF(AND('PJ - P'!$C137=\"\",'PJ - P'!$D137=\"\"),\"\",'PJ - P'!V137)","v":""},{"$f":"IF(AND('PJ - P'!$C137=\"\",'PJ - P'!$D137=\"\"),\"\",'PJ - P'!B137)","v":""},{"$f":"IF('PJ - P'!C137=\"\",\"\",'PJ - P'!C137)","v":""},{"$f":"IF('PJ - P'!D137=\"\",\"\",'PJ - P'!D137)","v":""},{"$f":"IF('PJ - P'!H137=\"\",\"\",'PJ - P'!H137)","v":""},{"$f":"IF('PJ - P'!M137=\"\",\"\",'PJ - P'!M137)","v":""},null,{"$f":"IF('PJ - P'!O137=\"\",\"\",'PJ - P'!O137)","v":""}]
[null,{"$f":"IF(AND('PJ - P'!$C138=\"\",'PJ - P'!$D138=\"\"),\"\",'PJ - P'!V138)","v":""},{"$f":"IF(AND('PJ - P'!$C138=\"\",'PJ - P'!$D138=\"\"),\"\",'PJ - P'!B138)","v":""},{"$f":"IF('PJ - P'!C138=\"\",\"\",'PJ - P'!C138)","v":""},{"$f":"IF('PJ - P'!D138=\"\",\"\",'PJ - P'!D138)","v":""},{"$f":"IF('PJ - P'!H138=\"\",\"\",'PJ - P'!H138)","v":""},{"$f":"IF('PJ - P'!M138=\"\",\"\",'PJ - P'!M138)","v":""},null,{"$f":"IF('PJ - P'!O138=\"\",\"\",'PJ - P'!O138)","v":""}]
[null,{"$f":"IF(AND('PJ - P'!$C139=\"\",'PJ - P'!$D139=\"\"),\"\",'PJ - P'!V139)","v":""},{"$f":"IF(AND('PJ - P'!$C139=\"\",'PJ - P'!$D139=\"\"),\"\",'PJ - P'!B139)","v":""},{"$f":"IF('PJ - P'!C139=\"\",\"\",'PJ - P'!C139)","v":""},{"$f":"IF('PJ - P'!D139=\"\",\"\",'PJ - P'!D139)","v":""},{"$f":"IF('PJ - P'!H139=\"\",\"\",'PJ - P'!H139)","v":""},{"$f":"IF('PJ - P'!M139=\"\",\"\",'PJ - P'!M139)","v":""},null,{"$f":"IF('PJ - P'!O139=\"\",\"\",'PJ - P'!O139)","v":""}]
[null,{"$f":"IF(AND('PJ - P'!$C140=\"\",'PJ - P'!$D140=\"\"),\"\",'PJ - P'!V140)","v":""},{"$f":"IF(AND('PJ - P'!$C140=\"\",'PJ - P'!$D140=\"\"),\"\",'PJ - P'!B140)","v":""},{"$f":"IF('PJ - P'!C140=\"\",\"\",'PJ - P'!C140)","v":""},{"$f":"IF('PJ - P'!D140=\"\",\"\",'PJ - P'!D140)","v":""},{"$f":"IF('PJ - P'!H140=\"\",\"\",'PJ - P'!H140)","v":""},{"$f":"IF('PJ - P'!M140=\"\",\"\",'PJ - P'!M140)","v":""},null,{"$f":"IF('PJ - P'!O140=\"\",\"\",'PJ - P'!O140)","v":""}]
[null,{"$f":"IF(AND('PJ - P'!$C141=\"\",'PJ - P'!$D141=\"\"),\"\",'PJ - P'!V141)","v":""},{"$f":"IF(AND('PJ - P'!$C141=\"\",'PJ - P'!$D141=\"\"),\"\",'PJ - P'!B141)","v":""},{"$f":"IF('PJ - P'!C141=\"\",\"\",'PJ - P'!C141)","v":""},{"$f":"IF('PJ - P'!D141=\"\",\"\",'PJ - P'!D141)","v":""},{"$f":"IF('PJ - P'!H141=\"\",\"\",'PJ - P'!H141)","v":""},{"$f":"IF('PJ - P'!M141=\"\",\"\",'PJ - P'!M141)","v":""},null,{"$f":"IF('PJ - P'!O141=\"\",\"\",'PJ - P'!O141)","v":""}]
[null,{"$f":"IF(AND('PJ - P'!$C142=\"\",'PJ - P'!$D142=\"\"),\"\",'PJ - P'!V142)","v":""},{"$f":"IF(AND('PJ - P'!$C142=\"\",'PJ - P'!$D142=\"\"),\"\",'PJ - P'!B142)","v":""},{"$f":"IF('PJ - P'!C142=\"\",\"\",'PJ - P'!C142)","v":""},{"$f":"IF('PJ - P'!D142=\"\",\"\",'PJ - P'!D142)","v":""},{"$f":"IF('PJ - P'!H142=\"\",\"\",'PJ - P'!H142)","v":""},{"$f":"IF('PJ - P'!M142=\"\",\"\",'PJ - P'!M142)","v":""},null,{"$f":"IF('PJ - P'!O142=\"\",\"\",'PJ - P'!O142)","v":""}]
[null,{"$f":"IF(AND('PJ - P'!$C143=\"\",'PJ - P'!$D143=\"\"),\"\",'PJ - P'!V143)","v":""},{"$f":"IF(AND('PJ - P'!$C143=\"\",'PJ - P'!$D143=\"\"),\"\",'PJ - P'!B143)","v":""},{"$f":"IF('PJ - P'!C143=\"\",\"\",'PJ - P'!C143)","v":""},{"$f":"IF('PJ - P'!D143=\"\",\"\",'PJ - P'!D143)","v":""},{"$f":"IF('PJ - P'!H143=\"\",\"\",'PJ - P'!H143)","v":""},{"$f":"IF('PJ - P'!M143=\"\",\"\",'PJ - P'!M143)","v":""},null,{"$f":"IF('PJ - P'!O143=\"\",\"\",'PJ - P'!O143)","v":""}]
[null,{"$f":"IF(AND('PJ - P'!$C144=\"\",'PJ - P'!$D144=\"\"),\"\",'PJ - P'!V144)","v":""},{"$f":"IF(AND('PJ - P'!$C144=\"\",'PJ - P'!$D144=\"\"),\"\",'PJ - P'!B144)","v":""},{"$f":"IF('PJ - P'!C144=\"\",\"\",'PJ - P'!C144)","v":""},{"$f":"IF('PJ - P'!D144=\"\",\"\",'PJ - P'!D144)","v":""},{"$f":"IF('PJ - P'!H144=\"\",\"\",'PJ - P'!H144)","v":""},{"$f":"IF('PJ - P'!M144=\"\",\"\",'PJ - P'!M144)","v":""},null,{"$f":"IF('PJ - P'!O144=\"\",\"\",'PJ - P'!O144)","v":""}]
[null,{"$f":"B130","v":"Běh na 100m s přek. - D - Pořadí jednotlivců"}]
[]
[null,{"$f":"$B$3","v":"Krajské kolo dorostu"},null,null,{"$f":"$E$3","v":"18.06.2022 Pardubice"}]
[]
[null,{"$f":"Start!$D$5","v":"dorostenky"}]
[null,"Pořadí","Start. číslo","Jméno","kolektiv","čas           I. pokusu","čas          II. pokusu",null,"Výsledný čas"]
[]
[null,{"$f":"IF(AND('PJ - P'!$C145=\"\",'PJ - P'!$D145=\"\"),\"\",'PJ - P'!V145)","v":""},{"$f":"IF(AND('PJ - P'!$C145=\"\",'PJ - P'!$D145=\"\"),\"\",'PJ - P'!B145)","v":""},{"$f":"IF('PJ - P'!C145=\"\",\"\",'PJ - P'!C145)","v":""},{"$f":"IF('PJ - P'!D145=\"\",\"\",'PJ - P'!D145)","v":""},{"$f":"IF('PJ - P'!H145=\"\",\"\",'PJ - P'!H145)","v":""},{"$f":"IF('PJ - P'!M145=\"\",\"\",'PJ - P'!M145)","v":""},null,{"$f":"IF('PJ - P'!O145=\"\",\"\",'PJ - P'!O145)","v":""}]
[null,{"$f":"IF(AND('PJ - P'!$C146=\"\",'PJ - P'!$D146=\"\"),\"\",'PJ - P'!V146)","v":""},{"$f":"IF(AND('PJ - P'!$C146=\"\",'PJ - P'!$D146=\"\"),\"\",'PJ - P'!B146)","v":""},{"$f":"IF('PJ - P'!C146=\"\",\"\",'PJ - P'!C146)","v":""},{"$f":"IF('PJ - P'!D146=\"\",\"\",'PJ - P'!D146)","v":""},{"$f":"IF('PJ - P'!H146=\"\",\"\",'PJ - P'!H146)","v":""},{"$f":"IF('PJ - P'!M146=\"\",\"\",'PJ - P'!M146)","v":""},null,{"$f":"IF('PJ - P'!O146=\"\",\"\",'PJ - P'!O146)","v":""}]
[null,{"$f":"IF(AND('PJ - P'!$C147=\"\",'PJ - P'!$D147=\"\"),\"\",'PJ - P'!V147)","v":""},{"$f":"IF(AND('PJ - P'!$C147=\"\",'PJ - P'!$D147=\"\"),\"\",'PJ - P'!B147)","v":""},{"$f":"IF('PJ - P'!C147=\"\",\"\",'PJ - P'!C147)","v":""},{"$f":"IF('PJ - P'!D147=\"\",\"\",'PJ - P'!D147)","v":""},{"$f":"IF('PJ - P'!H147=\"\",\"\",'PJ - P'!H147)","v":""},{"$f":"IF('PJ - P'!M147=\"\",\"\",'PJ - P'!M147)","v":""},null,{"$f":"IF('PJ - P'!O147=\"\",\"\",'PJ - P'!O147)","v":""}]
[null,{"$f":"IF(AND('PJ - P'!$C148=\"\",'PJ - P'!$D148=\"\"),\"\",'PJ - P'!V148)","v":""},{"$f":"IF(AND('PJ - P'!$C148=\"\",'PJ - P'!$D148=\"\"),\"\",'PJ - P'!B148)","v":""},{"$f":"IF('PJ - P'!C148=\"\",\"\",'PJ - P'!C148)","v":""},{"$f":"IF('PJ - P'!D148=\"\",\"\",'PJ - P'!D148)","v":""},{"$f":"IF('PJ - P'!H148=\"\",\"\",'PJ - P'!H148)","v":""},{"$f":"IF('PJ - P'!M148=\"\",\"\",'PJ - P'!M148)","v":""},null,{"$f":"IF('PJ - P'!O148=\"\",\"\",'PJ - P'!O148)","v":""}]
[null,{"$f":"IF(AND('PJ - P'!$C149=\"\",'PJ - P'!$D149=\"\"),\"\",'PJ - P'!V149)","v":""},{"$f":"IF(AND('PJ - P'!$C149=\"\",'PJ - P'!$D149=\"\"),\"\",'PJ - P'!B149)","v":""},{"$f":"IF('PJ - P'!C149=\"\",\"\",'PJ - P'!C149)","v":""},{"$f":"IF('PJ - P'!D149=\"\",\"\",'PJ - P'!D149)","v":""},{"$f":"IF('PJ - P'!H149=\"\",\"\",'PJ - P'!H149)","v":""},{"$f":"IF('PJ - P'!M149=\"\",\"\",'PJ - P'!M149)","v":""},null,{"$f":"IF('PJ - P'!O149=\"\",\"\",'PJ - P'!O149)","v":""}]
[null,{"$f":"IF(AND('PJ - P'!$C150=\"\",'PJ - P'!$D150=\"\"),\"\",'PJ - P'!V150)","v":""},{"$f":"IF(AND('PJ - P'!$C150=\"\",'PJ - P'!$D150=\"\"),\"\",'PJ - P'!B150)","v":""},{"$f":"IF('PJ - P'!C150=\"\",\"\",'PJ - P'!C150)","v":""},{"$f":"IF('PJ - P'!D150=\"\",\"\",'PJ - P'!D150)","v":""},{"$f":"IF('PJ - P'!H150=\"\",\"\",'PJ - P'!H150)","v":""},{"$f":"IF('PJ - P'!M150=\"\",\"\",'PJ - P'!M150)","v":""},null,{"$f":"IF('PJ - P'!O150=\"\",\"\",'PJ - P'!O150)","v":""}]
[null,{"$f":"IF(AND('PJ - P'!$C151=\"\",'PJ - P'!$D151=\"\"),\"\",'PJ - P'!V151)","v":""},{"$f":"IF(AND('PJ - P'!$C151=\"\",'PJ - P'!$D151=\"\"),\"\",'PJ - P'!B151)","v":""},{"$f":"IF('PJ - P'!C151=\"\",\"\",'PJ - P'!C151)","v":""},{"$f":"IF('PJ - P'!D151=\"\",\"\",'PJ - P'!D151)","v":""},{"$f":"IF('PJ - P'!H151=\"\",\"\",'PJ - P'!H151)","v":""},{"$f":"IF('PJ - P'!M151=\"\",\"\",'PJ - P'!M151)","v":""},null,{"$f":"IF('PJ - P'!O151=\"\",\"\",'PJ - P'!O151)","v":""}]
[null,{"$f":"IF(AND('PJ - P'!$C152=\"\",'PJ - P'!$D152=\"\"),\"\",'PJ - P'!V152)","v":""},{"$f":"IF(AND('PJ - P'!$C152=\"\",'PJ - P'!$D152=\"\"),\"\",'PJ - P'!B152)","v":""},{"$f":"IF('PJ - P'!C152=\"\",\"\",'PJ - P'!C152)","v":""},{"$f":"IF('PJ - P'!D152=\"\",\"\",'PJ - P'!D152)","v":""},{"$f":"IF('PJ - P'!H152=\"\",\"\",'PJ - P'!H152)","v":""},{"$f":"IF('PJ - P'!M152=\"\",\"\",'PJ - P'!M152)","v":""},null,{"$f":"IF('PJ - P'!O152=\"\",\"\",'PJ - P'!O152)","v":""}]
[null,{"$f":"IF(AND('PJ - P'!$C153=\"\",'PJ - P'!$D153=\"\"),\"\",'PJ - P'!V153)","v":""},{"$f":"IF(AND('PJ - P'!$C153=\"\",'PJ - P'!$D153=\"\"),\"\",'PJ - P'!B153)","v":""},{"$f":"IF('PJ - P'!C153=\"\",\"\",'PJ - P'!C153)","v":""},{"$f":"IF('PJ - P'!D153=\"\",\"\",'PJ - P'!D153)","v":""},{"$f":"IF('PJ - P'!H153=\"\",\"\",'PJ - P'!H153)","v":""},{"$f":"IF('PJ - P'!M153=\"\",\"\",'PJ - P'!M153)","v":""},null,{"$f":"IF('PJ - P'!O153=\"\",\"\",'PJ - P'!O153)","v":""}]
[null,{"$f":"IF(AND('PJ - P'!$C154=\"\",'PJ - P'!$D154=\"\"),\"\",'PJ - P'!V154)","v":""},{"$f":"IF(AND('PJ - P'!$C154=\"\",'PJ - P'!$D154=\"\"),\"\",'PJ - P'!B154)","v":""},{"$f":"IF('PJ - P'!C154=\"\",\"\",'PJ - P'!C154)","v":""},{"$f":"IF('PJ - P'!D154=\"\",\"\",'PJ - P'!D154)","v":""},{"$f":"IF('PJ - P'!H154=\"\",\"\",'PJ - P'!H154)","v":""},{"$f":"IF('PJ - P'!M154=\"\",\"\",'PJ - P'!M154)","v":""},null,{"$f":"IF('PJ - P'!O154=\"\",\"\",'PJ - P'!O154)","v":""}]
[null,{"$f":"IF(AND('PJ - P'!$C155=\"\",'PJ - P'!$D155=\"\"),\"\",'PJ - P'!V155)","v":""},{"$f":"IF(AND('PJ - P'!$C155=\"\",'PJ - P'!$D155=\"\"),\"\",'PJ - P'!B155)","v":""},{"$f":"IF('PJ - P'!C155=\"\",\"\",'PJ - P'!C155)","v":""},{"$f":"IF('PJ - P'!D155=\"\",\"\",'PJ - P'!D155)","v":""},{"$f":"IF('PJ - P'!H155=\"\",\"\",'PJ - P'!H155)","v":""},{"$f":"IF('PJ - P'!M155=\"\",\"\",'PJ - P'!M155)","v":""},null,{"$f":"IF('PJ - P'!O155=\"\",\"\",'PJ - P'!O155)","v":""}]
[null,{"$f":"IF(AND('PJ - P'!$C156=\"\",'PJ - P'!$D156=\"\"),\"\",'PJ - P'!V156)","v":""},{"$f":"IF(AND('PJ - P'!$C156=\"\",'PJ - P'!$D156=\"\"),\"\",'PJ - P'!B156)","v":""},{"$f":"IF('PJ - P'!C156=\"\",\"\",'PJ - P'!C156)","v":""},{"$f":"IF('PJ - P'!D156=\"\",\"\",'PJ - P'!D156)","v":""},{"$f":"IF('PJ - P'!H156=\"\",\"\",'PJ - P'!H156)","v":""},{"$f":"IF('PJ - P'!M156=\"\",\"\",'PJ - P'!M156)","v":""},null,{"$f":"IF('PJ - P'!O156=\"\",\"\",'PJ - P'!O156)","v":""}]
[null,{"$f":"IF(AND('PJ - P'!$C157=\"\",'PJ - P'!$D157=\"\"),\"\",'PJ - P'!V157)","v":""},{"$f":"IF(AND('PJ - P'!$C157=\"\",'PJ - P'!$D157=\"\"),\"\",'PJ - P'!B157)","v":""},{"$f":"IF('PJ - P'!C157=\"\",\"\",'PJ - P'!C157)","v":""},{"$f":"IF('PJ - P'!D157=\"\",\"\",'PJ - P'!D157)","v":""},{"$f":"IF('PJ - P'!H157=\"\",\"\",'PJ - P'!H157)","v":""},{"$f":"IF('PJ - P'!M157=\"\",\"\",'PJ - P'!M157)","v":""},null,{"$f":"IF('PJ - P'!O157=\"\",\"\",'PJ - P'!O157)","v":""}]
[null,{"$f":"IF(AND('PJ - P'!$C158=\"\",'PJ - P'!$D158=\"\"),\"\",'PJ - P'!V158)","v":""},{"$f":"IF(AND('PJ - P'!$C158=\"\",'PJ - P'!$D158=\"\"),\"\",'PJ - P'!B158)","v":""},{"$f":"IF('PJ - P'!C158=\"\",\"\",'PJ - P'!C158)","v":""},{"$f":"IF('PJ - P'!D158=\"\",\"\",'PJ - P'!D158)","v":""},{"$f":"IF('PJ - P'!H158=\"\",\"\",'PJ - P'!H158)","v":""},{"$f":"IF('PJ - P'!M158=\"\",\"\",'PJ - P'!M158)","v":""},null,{"$f":"IF('PJ - P'!O158=\"\",\"\",'PJ - P'!O158)","v":""}]
[null,{"$f":"IF(AND('PJ - P'!$C159=\"\",'PJ - P'!$D159=\"\"),\"\",'PJ - P'!V159)","v":""},{"$f":"IF(AND('PJ - P'!$C159=\"\",'PJ - P'!$D159=\"\"),\"\",'PJ - P'!B159)","v":""},{"$f":"IF('PJ - P'!C159=\"\",\"\",'PJ - P'!C159)","v":""},{"$f":"IF('PJ - P'!D159=\"\",\"\",'PJ - P'!D159)","v":""},{"$f":"IF('PJ - P'!H159=\"\",\"\",'PJ - P'!H159)","v":""},{"$f":"IF('PJ - P'!M159=\"\",\"\",'PJ - P'!M159)","v":""},null,{"$f":"IF('PJ - P'!O159=\"\",\"\",'PJ - P'!O159)","v":""}]
[null,{"$f":"IF(AND('PJ - P'!$C160=\"\",'PJ - P'!$D160=\"\"),\"\",'PJ - P'!V160)","v":""},{"$f":"IF(AND('PJ - P'!$C160=\"\",'PJ - P'!$D160=\"\"),\"\",'PJ - P'!B160)","v":""},{"$f":"IF('PJ - P'!C160=\"\",\"\",'PJ - P'!C160)","v":""},{"$f":"IF('PJ - P'!D160=\"\",\"\",'PJ - P'!D160)","v":""},{"$f":"IF('PJ - P'!H160=\"\",\"\",'PJ - P'!H160)","v":""},{"$f":"IF('PJ - P'!M160=\"\",\"\",'PJ - P'!M160)","v":""},null,{"$f":"IF('PJ - P'!O160=\"\",\"\",'PJ - P'!O160)","v":""}]
[null,{"$f":"IF(AND('PJ - P'!$C161=\"\",'PJ - P'!$D161=\"\"),\"\",'PJ - P'!V161)","v":""},{"$f":"IF(AND('PJ - P'!$C161=\"\",'PJ - P'!$D161=\"\"),\"\",'PJ - P'!B161)","v":""},{"$f":"IF('PJ - P'!C161=\"\",\"\",'PJ - P'!C161)","v":""},{"$f":"IF('PJ - P'!D161=\"\",\"\",'PJ - P'!D161)","v":""},{"$f":"IF('PJ - P'!H161=\"\",\"\",'PJ - P'!H161)","v":""},{"$f":"IF('PJ - P'!M161=\"\",\"\",'PJ - P'!M161)","v":""},null,{"$f":"IF('PJ - P'!O161=\"\",\"\",'PJ - P'!O161)","v":""}]
[null,{"$f":"IF(AND('PJ - P'!$C162=\"\",'PJ - P'!$D162=\"\"),\"\",'PJ - P'!V162)","v":""},{"$f":"IF(AND('PJ - P'!$C162=\"\",'PJ - P'!$D162=\"\"),\"\",'PJ - P'!B162)","v":""},{"$f":"IF('PJ - P'!C162=\"\",\"\",'PJ - P'!C162)","v":""},{"$f":"IF('PJ - P'!D162=\"\",\"\",'PJ - P'!D162)","v":""},{"$f":"IF('PJ - P'!H162=\"\",\"\",'PJ - P'!H162)","v":""},{"$f":"IF('PJ - P'!M162=\"\",\"\",'PJ - P'!M162)","v":""},null,{"$f":"IF('PJ - P'!O162=\"\",\"\",'PJ - P'!O162)","v":""}]
[null,{"$f":"IF(AND('PJ - P'!$C163=\"\",'PJ - P'!$D163=\"\"),\"\",'PJ - P'!V163)","v":""},{"$f":"IF(AND('PJ - P'!$C163=\"\",'PJ - P'!$D163=\"\"),\"\",'PJ - P'!B163)","v":""},{"$f":"IF('PJ - P'!C163=\"\",\"\",'PJ - P'!C163)","v":""},{"$f":"IF('PJ - P'!D163=\"\",\"\",'PJ - P'!D163)","v":""},{"$f":"IF('PJ - P'!H163=\"\",\"\",'PJ - P'!H163)","v":""},{"$f":"IF('PJ - P'!M163=\"\",\"\",'PJ - P'!M163)","v":""},null,{"$f":"IF('PJ - P'!O163=\"\",\"\",'PJ - P'!O163)","v":""}]
[null,{"$f":"IF(AND('PJ - P'!$C164=\"\",'PJ - P'!$D164=\"\"),\"\",'PJ - P'!V164)","v":""},{"$f":"IF(AND('PJ - P'!$C164=\"\",'PJ - P'!$D164=\"\"),\"\",'PJ - P'!B164)","v":""},{"$f":"IF('PJ - P'!C164=\"\",\"\",'PJ - P'!C164)","v":""},{"$f":"IF('PJ - P'!D164=\"\",\"\",'PJ - P'!D164)","v":""},{"$f":"IF('PJ - P'!H164=\"\",\"\",'PJ - P'!H164)","v":""},{"$f":"IF('PJ - P'!M164=\"\",\"\",'PJ - P'!M164)","v":""},null,{"$f":"IF('PJ - P'!O164=\"\",\"\",'PJ - P'!O164)","v":""}]
[null,{"$f":"IF(AND('PJ - P'!$C165=\"\",'PJ - P'!$D165=\"\"),\"\",'PJ - P'!V165)","v":""},{"$f":"IF(AND('PJ - P'!$C165=\"\",'PJ - P'!$D165=\"\"),\"\",'PJ - P'!B165)","v":""},{"$f":"IF('PJ - P'!C165=\"\",\"\",'PJ - P'!C165)","v":""},{"$f":"IF('PJ - P'!D165=\"\",\"\",'PJ - P'!D165)","v":""},{"$f":"IF('PJ - P'!H165=\"\",\"\",'PJ - P'!H165)","v":""},{"$f":"IF('PJ - P'!M165=\"\",\"\",'PJ - P'!M165)","v":""},null,{"$f":"IF('PJ - P'!O165=\"\",\"\",'PJ - P'!O165)","v":""}]
[null,{"$f":"IF(AND('PJ - P'!$C166=\"\",'PJ - P'!$D166=\"\"),\"\",'PJ - P'!V166)","v":""},{"$f":"IF(AND('PJ - P'!$C166=\"\",'PJ - P'!$D166=\"\"),\"\",'PJ - P'!B166)","v":""},{"$f":"IF('PJ - P'!C166=\"\",\"\",'PJ - P'!C166)","v":""},{"$f":"IF('PJ - P'!D166=\"\",\"\",'PJ - P'!D166)","v":""},{"$f":"IF('PJ - P'!H166=\"\",\"\",'PJ - P'!H166)","v":""},{"$f":"IF('PJ - P'!M166=\"\",\"\",'PJ - P'!M166)","v":""},null,{"$f":"IF('PJ - P'!O166=\"\",\"\",'PJ - P'!O166)","v":""}]
[null,{"$f":"IF(AND('PJ - P'!$C167=\"\",'PJ - P'!$D167=\"\"),\"\",'PJ - P'!V167)","v":""},{"$f":"IF(AND('PJ - P'!$C167=\"\",'PJ - P'!$D167=\"\"),\"\",'PJ - P'!B167)","v":""},{"$f":"IF('PJ - P'!C167=\"\",\"\",'PJ - P'!C167)","v":""},{"$f":"IF('PJ - P'!D167=\"\",\"\",'PJ - P'!D167)","v":""},{"$f":"IF('PJ - P'!H167=\"\",\"\",'PJ - P'!H167)","v":""},{"$f":"IF('PJ - P'!M167=\"\",\"\",'PJ - P'!M167)","v":""},null,{"$f":"IF('PJ - P'!O167=\"\",\"\",'PJ - P'!O167)","v":""}]
[null,{"$f":"IF(AND('PJ - P'!$C168=\"\",'PJ - P'!$D168=\"\"),\"\",'PJ - P'!V168)","v":""},{"$f":"IF(AND('PJ - P'!$C168=\"\",'PJ - P'!$D168=\"\"),\"\",'PJ - P'!B168)","v":""},{"$f":"IF('PJ - P'!C168=\"\",\"\",'PJ - P'!C168)","v":""},{"$f":"IF('PJ - P'!D168=\"\",\"\",'PJ - P'!D168)","v":""},{"$f":"IF('PJ - P'!H168=\"\",\"\",'PJ - P'!H168)","v":""},{"$f":"IF('PJ - P'!M168=\"\",\"\",'PJ - P'!M168)","v":""},null,{"$f":"IF('PJ - P'!O168=\"\",\"\",'PJ - P'!O168)","v":""}]
[null,{"$f":"IF(AND('PJ - P'!$C169=\"\",'PJ - P'!$D169=\"\"),\"\",'PJ - P'!V169)","v":""},{"$f":"IF(AND('PJ - P'!$C169=\"\",'PJ - P'!$D169=\"\"),\"\",'PJ - P'!B169)","v":""},{"$f":"IF('PJ - P'!C169=\"\",\"\",'PJ - P'!C169)","v":""},{"$f":"IF('PJ - P'!D169=\"\",\"\",'PJ - P'!D169)","v":""},{"$f":"IF('PJ - P'!H169=\"\",\"\",'PJ - P'!H169)","v":""},{"$f":"IF('PJ - P'!M169=\"\",\"\",'PJ - P'!M169)","v":""},null,{"$f":"IF('PJ - P'!O169=\"\",\"\",'PJ - P'!O169)","v":""}]
[null,{"$f":"IF(AND('PJ - P'!$C170=\"\",'PJ - P'!$D170=\"\"),\"\",'PJ - P'!V170)","v":""},{"$f":"IF(AND('PJ - P'!$C170=\"\",'PJ - P'!$D170=\"\"),\"\",'PJ - P'!B170)","v":""},{"$f":"IF('PJ - P'!C170=\"\",\"\",'PJ - P'!C170)","v":""},{"$f":"IF('PJ - P'!D170=\"\",\"\",'PJ - P'!D170)","v":""},{"$f":"IF('PJ - P'!H170=\"\",\"\",'PJ - P'!H170)","v":""},{"$f":"IF('PJ - P'!M170=\"\",\"\",'PJ - P'!M170)","v":""},null,{"$f":"IF('PJ - P'!O170=\"\",\"\",'PJ - P'!O170)","v":""}]
[null,{"$f":"IF(AND('PJ - P'!$C171=\"\",'PJ - P'!$D171=\"\"),\"\",'PJ - P'!V171)","v":""},{"$f":"IF(AND('PJ - P'!$C171=\"\",'PJ - P'!$D171=\"\"),\"\",'PJ - P'!B171)","v":""},{"$f":"IF('PJ - P'!C171=\"\",\"\",'PJ - P'!C171)","v":""},{"$f":"IF('PJ - P'!D171=\"\",\"\",'PJ - P'!D171)","v":""},{"$f":"IF('PJ - P'!H171=\"\",\"\",'PJ - P'!H171)","v":""},{"$f":"IF('PJ - P'!M171=\"\",\"\",'PJ - P'!M171)","v":""},null,{"$f":"IF('PJ - P'!O171=\"\",\"\",'PJ - P'!O171)","v":""}]
[null,{"$f":"IF(AND('PJ - P'!$C172=\"\",'PJ - P'!$D172=\"\"),\"\",'PJ - P'!V172)","v":""},{"$f":"IF(AND('PJ - P'!$C172=\"\",'PJ - P'!$D172=\"\"),\"\",'PJ - P'!B172)","v":""},{"$f":"IF('PJ - P'!C172=\"\",\"\",'PJ - P'!C172)","v":""},{"$f":"IF('PJ - P'!D172=\"\",\"\",'PJ - P'!D172)","v":""},{"$f":"IF('PJ - P'!H172=\"\",\"\",'PJ - P'!H172)","v":""},{"$f":"IF('PJ - P'!M172=\"\",\"\",'PJ - P'!M172)","v":""},null,{"$f":"IF('PJ - P'!O172=\"\",\"\",'PJ - P'!O172)","v":""}]
[null,{"$f":"IF(AND('PJ - P'!$C173=\"\",'PJ - P'!$D173=\"\"),\"\",'PJ - P'!V173)","v":""},{"$f":"IF(AND('PJ - P'!$C173=\"\",'PJ - P'!$D173=\"\"),\"\",'PJ - P'!B173)","v":""},{"$f":"IF('PJ - P'!C173=\"\",\"\",'PJ - P'!C173)","v":""},{"$f":"IF('PJ - P'!D173=\"\",\"\",'PJ - P'!D173)","v":""},{"$f":"IF('PJ - P'!H173=\"\",\"\",'PJ - P'!H173)","v":""},{"$f":"IF('PJ - P'!M173=\"\",\"\",'PJ - P'!M173)","v":""},null,{"$f":"IF('PJ - P'!O173=\"\",\"\",'PJ - P'!O173)","v":""}]
[null,{"$f":"IF(AND('PJ - P'!$C174=\"\",'PJ - P'!$D174=\"\"),\"\",'PJ - P'!V174)","v":""},{"$f":"IF(AND('PJ - P'!$C174=\"\",'PJ - P'!$D174=\"\"),\"\",'PJ - P'!B174)","v":""},{"$f":"IF('PJ - P'!C174=\"\",\"\",'PJ - P'!C174)","v":""},{"$f":"IF('PJ - P'!D174=\"\",\"\",'PJ - P'!D174)","v":""},{"$f":"IF('PJ - P'!H174=\"\",\"\",'PJ - P'!H174)","v":""},{"$f":"IF('PJ - P'!M174=\"\",\"\",'PJ - P'!M174)","v":""},null,{"$f":"IF('PJ - P'!O174=\"\",\"\",'PJ - P'!O174)","v":""}]
[null,{"$f":"IF(AND('PJ - P'!$C175=\"\",'PJ - P'!$D175=\"\"),\"\",'PJ - P'!V175)","v":""},{"$f":"IF(AND('PJ - P'!$C175=\"\",'PJ - P'!$D175=\"\"),\"\",'PJ - P'!B175)","v":""},{"$f":"IF('PJ - P'!C175=\"\",\"\",'PJ - P'!C175)","v":""},{"$f":"IF('PJ - P'!D175=\"\",\"\",'PJ - P'!D175)","v":""},{"$f":"IF('PJ - P'!H175=\"\",\"\",'PJ - P'!H175)","v":""},{"$f":"IF('PJ - P'!M175=\"\",\"\",'PJ - P'!M175)","v":""},null,{"$f":"IF('PJ - P'!O175=\"\",\"\",'PJ - P'!O175)","v":""}]

{"sheet":"PJ-PAll","index":15,"n_rows":274,"n_cols":9,"rows_kept":274,"cut":false,"hidden":false,"merged":[[263,4,264,4],[263,5,264,5],[263,6,264,6],[263,8,264,8],[262,1,262,2],[263,1,264,1],[263,2,264,2],[263,3,264,3],[220,8,221,8],[258,1,258,8],[260,1,260,3],[260,4,260,8],[220,3,221,3],[220,4,221,4],[220,5,221,5],[220,6,221,6],[220,1,221,1],[220,2,221,2],[134,6,135,6],[215,1,215,8],[217,1,217,3],[217,4,217,8],[219,1,219,2],[177,5,178,5],[177,6,178,6],[177,8,178,8],[177,1,178,1],[177,2,178,2],[177,3,178,3],[134,1,135,1],[134,2,135,2],[134,3,135,3],[134,4,135,4],[134,5,135,5],[177,4,178,4],[172,1,172,8],[174,1,174,3],[174,4,174,8],[176,1,176,2],[134,8,135,8],[91,2,92,2],[91,3,92,3],[91,4,92,4],[86,1,86,8],[88,1,88,3],[88,4,88,8],[90,1,90,2],[91,5,92,5],[91,6,92,6],[91,8,92,8],[129,1,129,8],[91,1,92,1],[131,1,131,3],[131,4,131,8],[133,1,133,2],[45,1,45,3],[45,4,45,8],[47,1,47,2],[48,1,49,1],[48,2,49,2],[48,3,49,3],[48,4,49,4],[48,5,49,5],[48,6,49,6],[48,8,49,8],[43,1,43,8],[5,1,6,1],[5,2,6,2],[5,3,6,3],[5,4,6,4],[0,1,0,8],[2,1,2,3],[2,4,2,8],[4,1,4,2],[5,5,6,5],[5,6,6,6],[5,8,6,8]]}
[null,"Běh na 100m s přek. - Pořadí jednotlivců - All"]
[]
[null,{"$f":"Start!$B$2","v":"Krajské kolo dorostu"},null,null,{"$f":"Start!$B$3","v":"18.06.2022 Pardubice"}]
[]
[null,{"$f":"Start!$D$5","v":"dorostenky"}]
[null,"Pořadí","Start. číslo","Jméno","kolektiv","čas             I. pokusu","čas            II. pokusu",null,"Výsledný čas"]
[]
[null,{"$f":"IF(AND('PJ - PAll'!$C1=\"\",'PJ - PAll'!$D1=\"\"),\"\",'PJ - PAll'!V1)","v":""},{"$f":"IF(AND('PJ - PAll'!$C1=\"\",'PJ - PAll'!$D1=\"\"),\"\",'PJ - PAll'!B1)","v":""},{"$f":"IF('PJ - PAll'!C1=\"\",\"\",'PJ - PAll'!C1)","v":""},{"$f":"IF('PJ - PAll'!D1=\"\",\"\",'PJ - PAll'!D1)","v":""},{"$f":"IF('PJ - PAll'!H1=\"\",\"\",'PJ - PAll'!H1)","v":""},{"$f":"IF('PJ - PAll'!M1=\"\",\"\",'PJ - PAll'!M1)","v":""},null,{"$f":"IF('PJ - PAll'!O1=\"\",\"\",'PJ - PAll'!O1)","v":""}]
[null,{"$f":"IF(AND('PJ - PAll'!$C2=\"\",'PJ - PAll'!$D2=\"\"),\"\",'PJ - PAll'!V2)","v":""},{"$f":"IF(AND('PJ - PAll'!$C2=\"\",'PJ - PAll'!$D2=\"\"),\"\",'PJ - PAll'!B2)","v":""},{"$f":"IF('PJ - PAll'!C2=\"\",\"\",'PJ - PAll'!C2)","v":""},{"$f":"IF('PJ - PAll'!D2=\"\",\"\",'PJ - PAll'!D2)","v":""},{"$f":"IF('PJ - PAll'!H2=\"\",\"\",'PJ - PAll'!H2)","v":""},{"$f":"IF('PJ - PAll'!M2=\"\",\"\",'PJ - PAll'!M2)","v":""},null,{"$f":"IF('PJ - PAll'!O2=\"\",\"\",'PJ - PAll'!O2)","v":""}]
[null,{"$f":"IF(AND('PJ - PAll'!$C3=\"\",'PJ - PAll'!$D3=\"\"),\"\",'PJ - PAll'!V3)","v":""},{"$f":"IF(AND('PJ - PAll'!$C3=\"\",'PJ - PAll'!$D3=\"\"),\"\",'PJ - PAll'!B3)","v":""},{"$f":"IF('PJ - PAll'!C3=\"\",\"\",'PJ - PAll'!C3)","v":""},{"$f":"IF('PJ - PAll'!D3=\"\",\"\",'PJ - PAll'!D3)","v":""},{"$f":"IF('PJ - PAll'!H3=\"\",\"\",'PJ - PAll'!H3)","v":""},{"$f":"IF('PJ - PAll'!M3=\"\",\"\",'PJ - PAll'!M3)","v":""},null,{"$f":"IF('PJ - PAll'!O3=\"\",\"\",'PJ - PAll'!O3)","v":""}]
[null,{"$f":"IF(AND('PJ - PAll'!$C4=\"\",'PJ - PAll'!$D4=\"\"),\"\",'PJ - PAll'!V4)","v":""},{"$f":"IF(AND('PJ - PAll'!$C4=\"\",'PJ - PAll'!$D4=\"\"),\"\",'PJ - PAll'!B4)","v":""},{"$f":"IF('PJ - PAll'!C4=\"\",\"\",'PJ - PAll'!C4)","v":""},{"$f":"IF('PJ - PAll'!D4=\"\",\"\",'PJ - PAll'!D4)","v":""},{"$f":"IF('PJ - PAll'!H4=\"\",\"\",'PJ - PAll'!H4)","v":""},{"$f":"IF('PJ - PAll'!M4=\"\",\"\",'PJ - PAll'!M4)","v":""},null,{"$f":"IF('PJ - PAll'!O4=\"\",\"\",'PJ - PAll'!O4)","v":""}]
[null,{"$f":"IF(AND('PJ - PAll'!$C5=\"\",'PJ - PAll'!$D5=\"\"),\"\",'PJ - PAll'!V5)","v":""},{"$f":"IF(AND('PJ - PAll'!$C5=\"\",'PJ - PAll'!$D5=\"\"),\"\",'PJ - PAll'!B5)","v":""},{"$f":"IF('PJ - PAll'!C5=\"\",\"\",'PJ - PAll'!C5)","v":""},{"$f":"IF('PJ - PAll'!D5=\"\",\"\",'PJ - PAll'!D5)","v":""},{"$f":"IF('PJ - PAll'!H5=\"\",\"\",'PJ - PAll'!H5)","v":""},{"$f":"IF('PJ - PAll'!M5=\"\",\"\",'PJ - PAll'!M5)","v":""},null,{"$f":"IF('PJ - PAll'!O5=\"\",\"\",'PJ - PAll'!O5)","v":""}]
[null,{"$f":"IF(AND('PJ - PAll'!$C6=\"\",'PJ - PAll'!$D6=\"\"),\"\",'PJ - PAll'!V6)","v":""},{"$f":"IF(AND('PJ - PAll'!$C6=\"\",'PJ - PAll'!$D6=\"\"),\"\",'PJ - PAll'!B6)","v":""},{"$f":"IF('PJ - PAll'!C6=\"\",\"\",'PJ - PAll'!C6)","v":""},{"$f":"IF('PJ - PAll'!D6=\"\",\"\",'PJ - PAll'!D6)","v":""},{"$f":"IF('PJ - PAll'!H6=\"\",\"\",'PJ - PAll'!H6)","v":""},{"$f":"IF('PJ - PAll'!M6=\"\",\"\",'PJ - PAll'!M6)","v":""},null,{"$f":"IF('PJ - PAll'!O6=\"\",\"\",'PJ - PAll'!O6)","v":""}]
[null,{"$f":"IF(AND('PJ - PAll'!$C7=\"\",'PJ - PAll'!$D7=\"\"),\"\",'PJ - PAll'!V7)","v":""},{"$f":"IF(AND('PJ - PAll'!$C7=\"\",'PJ - PAll'!$D7=\"\"),\"\",'PJ - PAll'!B7)","v":""},{"$f":"IF('PJ - PAll'!C7=\"\",\"\",'PJ - PAll'!C7)","v":""},{"$f":"IF('PJ - PAll'!D7=\"\",\"\",'PJ - PAll'!D7)","v":""},{"$f":"IF('PJ - PAll'!H7=\"\",\"\",'PJ - PAll'!H7)","v":""},{"$f":"IF('PJ - PAll'!M7=\"\",\"\",'PJ - PAll'!M7)","v":""},null,{"$f":"IF('PJ - PAll'!O7=\"\",\"\",'PJ - PAll'!O7)","v":""}]
[null,{"$f":"IF(AND('PJ - PAll'!$C8=\"\",'PJ - PAll'!$D8=\"\"),\"\",'PJ - PAll'!V8)","v":""},{"$f":"IF(AND('PJ - PAll'!$C8=\"\",'PJ - PAll'!$D8=\"\"),\"\",'PJ - PAll'!B8)","v":""},{"$f":"IF('PJ - PAll'!C8=\"\",\"\",'PJ - PAll'!C8)","v":""},{"$f":"IF('PJ - PAll'!D8=\"\",\"\",'PJ - PAll'!D8)","v":""},{"$f":"IF('PJ - PAll'!H8=\"\",\"\",'PJ - PAll'!H8)","v":""},{"$f":"IF('PJ - PAll'!M8=\"\",\"\",'PJ - PAll'!M8)","v":""},null,{"$f":"IF('PJ - PAll'!O8=\"\",\"\",'PJ - PAll'!O8)","v":""}]
[null,{"$f":"IF(AND('PJ - PAll'!$C9=\"\",'PJ - PAll'!$D9=\"\"),\"\",'PJ - PAll'!V9)","v":""},{"$f":"IF(AND('PJ - PAll'!$C9=\"\",'PJ - PAll'!$D9=\"\"),\"\",'PJ - PAll'!B9)","v":""},{"$f":"IF('PJ - PAll'!C9=\"\",\"\",'PJ - PAll'!C9)","v":""},{"$f":"IF('PJ - PAll'!D9=\"\",\"\",'PJ - PAll'!D9)","v":""},{"$f":"IF('PJ - PAll'!H9=\"\",\"\",'PJ - PAll'!H9)","v":""},{"$f":"IF('PJ - PAll'!M9=\"\",\"\",'PJ - PAll'!M9)","v":""},null,{"$f":"IF('PJ - PAll'!O9=\"\",\"\",'PJ - PAll'!O9)","v":""}]
[null,{"$f":"IF(AND('PJ - PAll'!$C10=\"\",'PJ - PAll'!$D10=\"\"),\"\",'PJ - PAll'!V10)","v":""},{"$f":"IF(AND('PJ - PAll'!$C10=\"\",'PJ - PAll'!$D10=\"\"),\"\",'PJ - PAll'!B10)","v":""},{"$f":"IF('PJ - PAll'!C10=\"\",\"\",'PJ - PAll'!C10)","v":""},{"$f":"IF('PJ - PAll'!D10=\"\",\"\",'PJ - PAll'!D10)","v":""},{"$f":"IF('PJ - PAll'!H10=\"\",\"\",'PJ - PAll'!H10)","v":""},{"$f":"IF('PJ - PAll'!M10=\"\",\"\",'PJ - PAll'!M10)","v":""},null,{"$f":"IF('PJ - PAll'!O10=\"\",\"\",'PJ - PAll'!O10)","v":""}]
[null,{"$f":"IF(AND('PJ - PAll'!$C11=\"\",'PJ - PAll'!$D11=\"\"),\"\",'PJ - PAll'!V11)","v":""},{"$f":"IF(AND('PJ - PAll'!$C11=\"\",'PJ - PAll'!$D11=\"\"),\"\",'PJ - PAll'!B11)","v":""},{"$f":"IF('PJ - PAll'!C11=\"\",\"\",'PJ - PAll'!C11)","v":""},{"$f":"IF('PJ - PAll'!D11=\"\",\"\",'PJ - PAll'!D11)","v":""},{"$f":"IF('PJ - PAll'!H11=\"\",\"\",'PJ - PAll'!H11)","v":""},{"$f":"IF('PJ - PAll'!M11=\"\",\"\",'PJ - PAll'!M11)","v":""},null,{"$f":"IF('PJ - PAll'!O11=\"\",\"\",'PJ - PAll'!O11)","v":""}]
[null,{"$f":"IF(AND('PJ - PAll'!$C12=\"\",'PJ - PAll'!$D12=\"\"),\"\",'PJ - PAll'!V12)","v":""},{"$f":"IF(AND('PJ - PAll'!$C12=\"\",'PJ - PAll'!$D12=\"\"),\"\",'PJ - PAll'!B12)","v":""},{"$f":"IF('PJ - PAll'!C12=\"\",\"\",'PJ - PAll'!C12)","v":""},{"$f":"IF('PJ - PAll'!D12=\"\",\"\",'PJ - PAll'!D12)","v":""},{"$f":"IF('PJ - PAll'!H12=\"\",\"\",'PJ - PAll'!H12)","v":""},{"$f":"IF('PJ - PAll'!M12=\"\",\"\",'PJ - PAll'!M12)","v":""},null,{"$f":"IF('PJ - PAll'!O12=\"\",\"\",'PJ - PAll'!O12)","v":""}]
[null,{"$f":"IF(AND('PJ - PAll'!$C13=\"\",'PJ - PAll'!$D13=\"\"),\"\",'PJ - PAll'!V13)","v":""},{"$f":"IF(AND('PJ - PAll'!$C13=\"\",'PJ - PAll'!$D13=\"\"),\"\",'PJ - PAll'!B13)","v":""},{"$f":"IF('PJ - PAll'!C13=\"\",\"\",'PJ - PAll'!C13)","v":""},{"$f":"IF('PJ - PAll'!D13=\"\",\"\",'PJ - PAll'!D13)","v":""},{"$f":"IF('PJ - PAll'!H13=\"\",\"\",'PJ - PAll'!H13)","v":""},{"$f":"IF('PJ - PAll'!M13=\"\",\"\",'PJ - PAll'!M13)","v":""},null,{"$f":"IF('PJ - PAll'!O13=\"\",\"\",'PJ - PAll'!O13)","v":""}]
[null,{"$f":"IF(AND('PJ - PAll'!$C14=\"\",'PJ - PAll'!$D14=\"\"),\"\",'PJ - PAll'!V14)","v":""},{"$f":"IF(AND('PJ - PAll'!$C14=\"\",'PJ - PAll'!$D14=\"\"),\"\",'PJ - PAll'!B14)","v":""},{"$f":"IF('PJ - PAll'!C14=\"\",\"\",'PJ - PAll'!C14)","v":""},{"$f":"IF('PJ - PAll'!D14=\"\",\"\",'PJ - PAll'!D14)","v":""},{"$f":"IF('PJ - PAll'!H14=\"\",\"\",'PJ - PAll'!H14)","v":""},{"$f":"IF('PJ - PAll'!M14=\"\",\"\",'PJ - PAll'!M14)","v":""},null,{"$f":"IF('PJ - PAll'!O14=\"\",\"\",'PJ - PAll'!O14)","v":""}]
[null,{"$f":"IF(AND('PJ - PAll'!$C15=\"\",'PJ - PAll'!$D15=\"\"),\"\",'PJ - PAll'!V15)","v":""},{"$f":"IF(AND('PJ - PAll'!$C15=\"\",'PJ - PAll'!$D15=\"\"),\"\",'PJ - PAll'!B15)","v":""},{"$f":"IF('PJ - PAll'!C15=\"\",\"\",'PJ - PAll'!C15)","v":""},{"$f":"IF('PJ - PAll'!D15=\"\",\"\",'PJ - PAll'!D15)","v":""},{"$f":"IF('PJ - PAll'!H15=\"\",\"\",'PJ - PAll'!H15)","v":""},{"$f":"IF('PJ - PAll'!M15=\"\",\"\",'PJ - PAll'!M15)","v":""},null,{"$f":"IF('PJ - PAll'!O15=\"\",\"\",'PJ - PAll'!O15)","v":""}]
[null,{"$f":"IF(AND('PJ - PAll'!$C16=\"\",'PJ - PAll'!$D16=\"\"),\"\",'PJ - PAll'!V16)","v":""},{"$f":"IF(AND('PJ - PAll'!$C16=\"\",'PJ - PAll'!$D16=\"\"),\"\",'PJ - PAll'!B16)","v":""},{"$f":"IF('PJ - PAll'!C16=\"\",\"\",'PJ - PAll'!C16)","v":""},{"$f":"IF('PJ - PAll'!D16=\"\",\"\",'PJ - PAll'!D16)","v":""},{"$f":"IF('PJ - PAll'!H16=\"\",\"\",'PJ - PAll'!H16)","v":""},{"$f":"IF('PJ - PAll'!M16=\"\",\"\",'PJ - PAll'!M16)","v":""},null,{"$f":"IF('PJ - PAll'!O16=\"\",\"\",'PJ - PAll'!O16)","v":""}]
[null,{"$f":"IF(AND('PJ - PAll'!$C17=\"\",'PJ - PAll'!$D17=\"\"),\"\",'PJ - PAll'!V17)","v":""},{"$f":"IF(AND('PJ - PAll'!$C17=\"\",'PJ - PAll'!$D17=\"\"),\"\",'PJ - PAll'!B17)","v":""},{"$f":"IF('PJ - PAll'!C17=\"\",\"\",'PJ - PAll'!C17)","v":""},{"$f":"IF('PJ - PAll'!D17=\"\",\"\",'PJ - PAll'!D17)","v":""},{"$f":"IF('PJ - PAll'!H17=\"\",\"\",'PJ - PAll'!H17)","v":""},{"$f":"IF('PJ - PAll'!M17=\"\",\"\",'PJ - PAll'!M17)","v":""},null,{"$f":"IF('PJ - PAll'!O17=\"\",\"\",'PJ - PAll'!O17)","v":""}]
[null,{"$f":"IF(AND('PJ - PAll'!$C18=\"\",'PJ - PAll'!$D18=\"\"),\"\",'PJ - PAll'!V18)","v":""},{"$f":"IF(AND('PJ - PAll'!$C18=\"\",'PJ - PAll'!$D18=\"\"),\"\",'PJ - PAll'!B18)","v":""},{"$f":"IF('PJ - PAll'!C18=\"\",\"\",'PJ - PAll'!C18)","v":""},{"$f":"IF('PJ - PAll'!D18=\"\",\"\",'PJ - PAll'!D18)","v":""},{"$f":"IF('PJ - PAll'!H18=\"\",\"\",'PJ - PAll'!H18)","v":""},{"$f":"IF('PJ - PAll'!M18=\"\",\"\",'PJ - PAll'!M18)","v":""},null,{"$f":"IF('PJ - PAll'!O18=\"\",\"\",'PJ - PAll'!O18)","v":""}]
[null,{"$f":"IF(AND('PJ - PAll'!$C19=\"\",'PJ - PAll'!$D19=\"\"),\"\",'PJ - PAll'!V19)","v":""},{"$f":"IF(AND('PJ - PAll'!$C19=\"\",'PJ - PAll'!$D19=\"\"),\"\",'PJ - PAll'!B19)","v":""},{"$f":"IF('PJ - PAll'!C19=\"\",\"\",'PJ - PAll'!C19)","v":""},{"$f":"IF('PJ - PAll'!D19=\"\",\"\",'PJ - PAll'!D19)","v":""},{"$f":"IF('PJ - PAll'!H19=\"\",\"\",'PJ - PAll'!H19)","v":""},{"$f":"IF('PJ - PAll'!M19=\"\",\"\",'PJ - PAll'!M19)","v":""},null,{"$f":"IF('PJ - PAll'!O19=\"\",\"\",'PJ - PAll'!O19)","v":""}]
[null,{"$f":"IF(AND('PJ - PAll'!$C20=\"\",'PJ - PAll'!$D20=\"\"),\"\",'PJ - PAll'!V20)","v":""},{"$f":"IF(AND('PJ - PAll'!$C20=\"\",'PJ - PAll'!$D20=\"\"),\"\",'PJ - PAll'!B20)","v":""},{"$f":"IF('PJ - PAll'!C20=\"\",\"\",'PJ - PAll'!C20)","v":""},{"$f":"IF('PJ - PAll'!D20=\"\",\"\",'PJ - PAll'!D20)","v":""},{"$f":"IF('PJ - PAll'!H20=\"\",\"\",'PJ - PAll'!H20)","v":""},{"$f":"IF('PJ - PAll'!M20=\"\",\"\",'PJ - PAll'!M20)","v":""},null,{"$f":"IF('PJ - PAll'!O20=\"\",\"\",'PJ - PAll'!O20)","v":""}]
[null,{"$f":"IF(AND('PJ - PAll'!$C21=\"\",'PJ - PAll'!$D21=\"\"),\"\",'PJ - PAll'!V21)","v":""},{"$f":"IF(AND('PJ - PAll'!$C21=\"\",'PJ - PAll'!$D21=\"\"),\"\",'PJ - PAll'!B21)","v":""},{"$f":"IF('PJ - PAll'!C21=\"\",\"\",'PJ - PAll'!C21)","v":""},{"$f":"IF('PJ - PAll'!D21=\"\",\"\",'PJ - PAll'!D21)","v":""},{"$f":"IF('PJ - PAll'!H21=\"\",\"\",'PJ - PAll'!H21)","v":""},{"$f":"IF('PJ - PAll'!M21=\"\",\"\",'PJ - PAll'!M21)","v":""},null,{"$f":"IF('PJ - PAll'!O21=\"\",\"\",'PJ - PAll'!O21)","v":""}]
[null,{"$f":"IF(AND('PJ - PAll'!$C22=\"\",'PJ - PAll'!$D22=\"\"),\"\",'PJ - PAll'!V22)","v":""},{"$f":"IF(AND('PJ - PAll'!$C22=\"\",'PJ - PAll'!$D22=\"\"),\"\",'PJ - PAll'!B22)","v":""},{"$f":"IF('PJ - PAll'!C22=\"\",\"\",'PJ - PAll'!C22)","v":""},{"$f":"IF('PJ - PAll'!D22=\"\",\"\",'PJ - PAll'!D22)","v":""},{"$f":"IF('PJ - PAll'!H22=\"\",\"\",'PJ - PAll'!H22)","v":""},{"$f":"IF('PJ - PAll'!M22=\"\",\"\",'PJ - PAll'!M22)","v":""},null,{"$f":"IF('PJ - PAll'!O22=\"\",\"\",'PJ - PAll'!O22)","v":""}]
[null,{"$f":"IF(AND('PJ - PAll'!$C23=\"\",'PJ - PAll'!$D23=\"\"),\"\",'PJ - PAll'!V23)","v":""},{"$f":"IF(AND('PJ - PAll'!$C23=\"\",'PJ - PAll'!$D23=\"\"),\"\",'PJ - PAll'!B23)","v":""},{"$f":"IF('PJ - PAll'!C23=\"\",\"\",'PJ - PAll'!C23)","v":""},{"$f":"IF('PJ - PAll'!D23=\"\",\"\",'PJ - PAll'!D23)","v":""},{"$f":"IF('PJ - PAll'!H23=\"\",\"\",'PJ - PAll'!H23)","v":""},{"$f":"IF('PJ - PAll'!M23=\"\",\"\",'PJ - PAll'!M23)","v":""},null,{"$f":"IF('PJ - PAll'!O23=\"\",\"\",'PJ - PAll'!O23)","v":""}]
[null,{"$f":"IF(AND('PJ - PAll'!$C24=\"\",'PJ - PAll'!$D24=\"\"),\"\",'PJ - PAll'!V24)","v":""},{"$f":"IF(AND('PJ - PAll'!$C24=\"\",'PJ - PAll'!$D24=\"\"),\"\",'PJ - PAll'!B24)","v":""},{"$f":"IF('PJ - PAll'!C24=\"\",\"\",'PJ - PAll'!C24)","v":""},{"$f":"IF('PJ - PAll'!D24=\"\",\"\",'PJ - PAll'!D24)","v":""},{"$f":"IF('PJ - PAll'!H24=\"\",\"\",'PJ - PAll'!H24)","v":""},{"$f":"IF('PJ - PAll'!M24=\"\",\"\",'PJ - PAll'!M24)","v":""},null,{"$f":"IF('PJ - PAll'!O24=\"\",\"\",'PJ - PAll'!O24)","v":""}]
[null,{"$f":"IF(AND('PJ - PAll'!$C25=\"\",'PJ - PAll'!$D25=\"\"),\"\",'PJ - PAll'!V25)","v":""},{"$f":"IF(AND('PJ - PAll'!$C25=\"\",'PJ - PAll'!$D25=\"\"),\"\",'PJ - PAll'!B25)","v":""},{"$f":"IF('PJ - PAll'!C25=\"\",\"\",'PJ - PAll'!C25)","v":""},{"$f":"IF('PJ - PAll'!D25=\"\",\"\",'PJ - PAll'!D25)","v":""},{"$f":"IF('PJ - PAll'!H25=\"\",\"\",'PJ - PAll'!H25)","v":""},{"$f":"IF('PJ - PAll'!M25=\"\",\"\",'PJ - PAll'!M25)","v":""},null,{"$f":"IF('PJ - PAll'!O25=\"\",\"\",'PJ - PAll'!O25)","v":""}]
[null,{"$f":"IF(AND('PJ - PAll'!$C26=\"\",'PJ - PAll'!$D26=\"\"),\"\",'PJ - PAll'!V26)","v":""},{"$f":"IF(AND('PJ - PAll'!$C26=\"\",'PJ - PAll'!$D26=\"\"),\"\",'PJ - PAll'!B26)","v":""},{"$f":"IF('PJ - PAll'!C26=\"\",\"\",'PJ - PAll'!C26)","v":""},{"$f":"IF('PJ - PAll'!D26=\"\",\"\",'PJ - PAll'!D26)","v":""},{"$f":"IF('PJ - PAll'!H26=\"\",\"\",'PJ - PAll'!H26)","v":""},{"$f":"IF('PJ - PAll'!M26=\"\",\"\",'PJ - PAll'!M26)","v":""},null,{"$f":"IF('PJ - PAll'!O26=\"\",\"\",'PJ - PAll'!O26)","v":""}]
[null,{"$f":"IF(AND('PJ - PAll'!$C27=\"\",'PJ - PAll'!$D27=\"\"),\"\",'PJ - PAll'!V27)","v":""},{"$f":"IF(AND('PJ - PAll'!$C27=\"\",'PJ - PAll'!$D27=\"\"),\"\",'PJ - PAll'!B27)","v":""},{"$f":"IF('PJ - PAll'!C27=\"\",\"\",'PJ - PAll'!C27)","v":""},{"$f":"IF('PJ - PAll'!D27=\"\",\"\",'PJ - PAll'!D27)","v":""},{"$f":"IF('PJ - PAll'!H27=\"\",\"\",'PJ - PAll'!H27)","v":""},{"$f":"IF('PJ - PAll'!M27=\"\",\"\",'PJ - PAll'!M27)","v":""},null,{"$f":"IF('PJ - PAll'!O27=\"\",\"\",'PJ - PAll'!O27)","v":""}]
[null,{"$f":"IF(AND('PJ - PAll'!$C28=\"\",'PJ - PAll'!$D28=\"\"),\"\",'PJ - PAll'!V28)","v":""},{"$f":"IF(AND('PJ - PAll'!$C28=\"\",'PJ - PAll'!$D28=\"\"),\"\",'PJ - PAll'!B28)","v":""},{"$f":"IF('PJ - PAll'!C28=\"\",\"\",'PJ - PAll'!C28)","v":""},{"$f":"IF('PJ - PAll'!D28=\"\",\"\",'PJ - PAll'!D28)","v":""},{"$f":"IF('PJ - PAll'!H28=\"\",\"\",'PJ - PAll'!H28)","v":""},{"$f":"IF('PJ - PAll'!M28=\"\",\"\",'PJ - PAll'!M28)","v":""},null,{"$f":"IF('PJ - PAll'!O28=\"\",\"\",'PJ - PAll'!O28)","v":""}]
[null,{"$f":"IF(AND('PJ - PAll'!$C29=\"\",'PJ - PAll'!$D29=\"\"),\"\",'PJ - PAll'!V29)","v":""},{"$f":"IF(AND('PJ - PAll'!$C29=\"\",'PJ - PAll'!$D29=\"\"),\"\",'PJ - PAll'!B29)","v":""},{"$f":"IF('PJ - PAll'!C29=\"\",\"\",'PJ - PAll'!C29)","v":""},{"$f":"IF('PJ - PAll'!D29=\"\",\"\",'PJ - PAll'!D29)","v":""},{"$f":"IF('PJ - PAll'!H29=\"\",\"\",'PJ - PAll'!H29)","v":""},{"$f":"IF('PJ - PAll'!M29=\"\",\"\",'PJ - PAll'!M29)","v":""},null,{"$f":"IF('PJ - PAll'!O29=\"\",\"\",'PJ - PAll'!O29)","v":""}]
[null,{"$f":"IF(AND('PJ - PAll'!$C30=\"\",'PJ - PAll'!$D30=\"\"),\"\",'PJ - PAll'!V30)","v":""},{"$f":"IF(AND('PJ - PAll'!$C30=\"\",'PJ - PAll'!$D30=\"\"),\"\",'PJ - PAll'!B30)","v":""},{"$f":"IF('PJ - PAll'!C30=\"\",\"\",'PJ - PAll'!C30)","v":""},{"$f":"IF('PJ - PAll'!D30=\"\",\"\",'PJ - PAll'!D30)","v":""},{"$f":"IF('PJ - PAll'!H30=\"\",\"\",'PJ - PAll'!H30)","v":""},{"$f":"IF('PJ - PAll'!M30=\"\",\"\",'PJ - PAll'!M30)","v":""},null,{"$f":"IF('PJ - PAll'!O30=\"\",\"\",'PJ - PAll'!O30)","v":""}]
[null,{"$f":"IF(AND('PJ - PAll'!$C31=\"\",'PJ - PAll'!$D31=\"\"),\"\",'PJ - PAll'!V31)","v":""},{"$f":"IF(AND('PJ - PAll'!$C31=\"\",'PJ - PAll'!$D31=\"\"),\"\",'PJ - PAll'!B31)","v":""},{"$f":"IF('PJ - PAll'!C31=\"\",\"\",'PJ - PAll'!C31)","v":""},{"$f":"IF('PJ - PAll'!D31=\"\",\"\",'PJ - PAll'!D31)","v":""},{"$f":"IF('PJ - PAll'!H31=\"\",\"\",'PJ - PAll'!H31)","v":""},{"$f":"IF('PJ - PAll'!M31=\"\",\"\",'PJ - PAll'!M31)","v":""},null,{"$f":"IF('PJ - PAll'!O31=\"\",\"\",'PJ - PAll'!O31)","v":""}]
[null,{"$f":"IF(AND('PJ - PAll'!$C32=\"\",'PJ - PAll'!$D32=\"\"),\"\",'PJ - PAll'!V32)","v":""},{"$f":"IF(AND('PJ - PAll'!$C32=\"\",'PJ - PAll'!$D32=\"\"),\"\",'PJ - PAll'!B32)","v":""},{"$f":"IF('PJ - PAll'!C32=\"\",\"\",'PJ - PAll'!C32)","v":""},{"$f":"IF('PJ - PAll'!D32=\"\",\"\",'PJ - PAll'!D32)","v":""},{"$f":"IF('PJ - PAll'!H32=\"\",\"\",'PJ - PAll'!H32)","v":""},{"$f":"IF('PJ - PAll'!M32=\"\",\"\",'PJ - PAll'!M32)","v":""},null,{"$f":"IF('PJ - PAll'!O32=\"\",\"\",'PJ - PAll'!O32)","v":""}]
[null,{"$f":"IF(AND('PJ - PAll'!$C33=\"\",'PJ - PAll'!$D33=\"\"),\"\",'PJ - PAll'!V33)","v":""},{"$f":"IF(AND('PJ - PAll'!$C33=\"\",'PJ - PAll'!$D33=\"\"),\"\",'PJ - PAll'!B33)","v":""},{"$f":"IF('PJ - PAll'!C33=\"\",\"\",'PJ - PAll'!C33)","v":""},{"$f":"IF('PJ - PAll'!D33=\"\",\"\",'PJ - PAll'!D33)","v":""},{"$f":"IF('PJ - PAll'!H33=\"\",\"\",'PJ - PAll'!H33)","v":""},{"$f":"IF('PJ - PAll'!M33=\"\",\"\",'PJ - PAll'!M33)","v":""},null,{"$f":"IF('PJ - PAll'!O33=\"\",\"\",'PJ - PAll'!O33)","v":""}]
[null,{"$f":"IF(AND('PJ - PAll'!$C34=\"\",'PJ - PAll'!$D34=\"\"),\"\",'PJ - PAll'!V34)","v":""},{"$f":"IF(AND('PJ - PAll'!$C34=\"\",'PJ - PAll'!$D34=\"\"),\"\",'PJ - PAll'!B34)","v":""},{"$f":"IF('PJ - PAll'!C34=\"\",\"\",'PJ - PAll'!C34)","v":""},{"$f":"IF('PJ - PAll'!D34=\"\",\"\",'PJ - PAll'!D34)","v":""},{"$f":"IF('PJ - PAll'!H34=\"\",\"\",'PJ - PAll'!H34)","v":""},{"$f":"IF('PJ - PAll'!M34=\"\",\"\",'PJ - PAll'!M34)","v":""},null,{"$f":"IF('PJ - PAll'!O34=\"\",\"\",'PJ - PAll'!O34)","v":""}]
[null,{"$f":"IF(AND('PJ - PAll'!$C35=\"\",'PJ - PAll'!$D35=\"\"),\"\",'PJ - PAll'!V35)","v":""},{"$f":"IF(AND('PJ - PAll'!$C35=\"\",'PJ - PAll'!$D35=\"\"),\"\",'PJ - PAll'!B35)","v":""},{"$f":"IF('PJ - PAll'!C35=\"\",\"\",'PJ - PAll'!C35)","v":""},{"$f":"IF('PJ - PAll'!D35=\"\",\"\",'PJ - PAll'!D35)","v":""},{"$f":"IF('PJ - PAll'!H35=\"\",\"\",'PJ - PAll'!H35)","v":""},{"$f":"IF('PJ - PAll'!M35=\"\",\"\",'PJ - PAll'!M35)","v":""},null,{"$f":"IF('PJ - PAll'!O35=\"\",\"\",'PJ - PAll'!O35)","v":""}]
[null,{"$f":"IF(AND('PJ - PAll'!$C36=\"\",'PJ - PAll'!$D36=\"\"),\"\",'PJ - PAll'!V36)","v":""},{"$f":"IF(AND('PJ - PAll'!$C36=\"\",'PJ - PAll'!$D36=\"\"),\"\",'PJ - PAll'!B36)","v":""},{"$f":"IF('PJ - PAll'!C36=\"\",\"\",'PJ - PAll'!C36)","v":""},{"$f":"IF('PJ - PAll'!D36=\"\",\"\",'PJ - PAll'!D36)","v":""},{"$f":"IF('PJ - PAll'!H36=\"\",\"\",'PJ - PAll'!H36)","v":""},{"$f":"IF('PJ - PAll'!M36=\"\",\"\",'PJ - PAll'!M36)","v":""},null,{"$f":"IF('PJ - PAll'!O36=\"\",\"\",'PJ - PAll'!O36)","v":""}]
[null,{"$f":"B1","v":"Běh na 100m s přek. - Pořadí jednotlivců - All"}]
[]
[null,{"$f":"$B$3","v":"Krajské kolo dorostu"},null,null,{"$f":"$E$3","v":"18.06.2022 Pardubice"}]
[]
[null,{"$f":"Start!$D$5","v":"dorostenky"}]
[null,"Pořadí","Start. číslo","Jméno","kolektiv","čas             I. pokusu","čas            II. pokusu",null,"Výsledný čas"]
[]
[null,{"$f":"IF(AND('PJ - PAll'!$C37=\"\",'PJ - PAll'!$D37=\"\"),\"\",'PJ - PAll'!V37)","v":""},{"$f":"IF(AND('PJ - PAll'!$C37=\"\",'PJ - PAll'!$D37=\"\"),\"\",'PJ - PAll'!B37)","v":""},{"$f":"IF('PJ - PAll'!C37=\"\",\"\",'PJ - PAll'!C37)","v":""},{"$f":"IF('PJ - PAll'!D37=\"\",\"\",'PJ - PAll'!D37)","v":""},{"$f":"IF('PJ - PAll'!H37=\"\",\"\",'PJ - PAll'!H37)","v":""},{"$f":"IF('PJ - PAll'!M37=\"\",\"\",'PJ - PAll'!M37)","v":""},null,{"$f":"IF('PJ - PAll'!O37=\"\",\"\",'PJ - PAll'!O37)","v":""}]
[null,{"$f":"IF(AND('PJ - PAll'!$C38=\"\",'PJ - PAll'!$D38=\"\"),\"\",'PJ - PAll'!V38)","v":""},{"$f":"IF(AND('PJ - PAll'!$C38=\"\",'PJ - PAll'!$D38=\"\"),\"\",'PJ - PAll'!B38)","v":""},{"$f":"IF('PJ - PAll'!C38=\"\",\"\",'PJ - PAll'!C38)","v":""},{"$f":"IF('PJ - PAll'!D38=\"\",\"\",'PJ - PAll'!D38)","v":""},{"$f":"IF('PJ - PAll'!H38=\"\",\"\",'PJ - PAll'!H38)","v":""},{"$f":"IF('PJ - PAll'!M38=\"\",\"\",'PJ - PAll'!M38)","v":""},null,{"$f":"IF('PJ - PAll'!O38=\"\",\"\",'PJ - PAll'!O38)","v":""}]
[null,{"$f":"IF(AND('PJ - PAll'!$C39=\"\",'PJ - PAll'!$D39=\"\"),\"\",'PJ - PAll'!V39)","v":""},{"$f":"IF(AND('PJ - PAll'!$C39=\"\",'PJ - PAll'!$D39=\"\"),\"\",'PJ - PAll'!B39)","v":""},{"$f":"IF('PJ - PAll'!C39=\"\",\"\",'PJ - PAll'!C39)","v":""},{"$f":"IF('PJ - PAll'!D39=\"\",\"\",'PJ - PAll'!D39)","v":""},{"$f":"IF('PJ - PAll'!H39=\"\",\"\",'PJ - PAll'!H39)","v":""},{"$f":"IF('PJ - PAll'!M39=\"\",\"\",'PJ - PAll'!M39)","v":""},null,{"$f":"IF('PJ - PAll'!O39=\"\",\"\",'PJ - PAll'!O39)","v":""}]
[null,{"$f":"IF(AND('PJ - PAll'!$C40=\"\",'PJ - PAll'!$D40=\"\"),\"\",'PJ - PAll'!V40)","v":""},{"$f":"IF(AND('PJ - PAll'!$C40=\"\",'PJ - PAll'!$D40=\"\"),\"\",'PJ - PAll'!B40)","v":""},{"$f":"IF('PJ - PAll'!C40=\"\",\"\",'PJ - PAll'!C40)","v":""},{"$f":"IF('PJ - PAll'!D40=\"\",\"\",'PJ - PAll'!D40)","v":""},{"$f":"IF('PJ - PAll'!H40=\"\",\"\",'PJ - PAll'!H40)","v":""},{"$f":"IF('PJ - PAll'!M40=\"\",\"\",'PJ - PAll'!M40)","v":""},null,{"$f":"IF('PJ - PAll'!O40=\"\",\"\",'PJ - PAll'!O40)","v":""}]
[null,{"$f":"IF(AND('PJ - PAll'!$C41=\"\",'PJ - PAll'!$D41=\"\"),\"\",'PJ - PAll'!V41)","v":""},{"$f":"IF(AND('PJ - PAll'!$C41=\"\",'PJ - PAll'!$D41=\"\"),\"\",'PJ - PAll'!B41)","v":""},{"$f":"IF('PJ - PAll'!C41=\"\",\"\",'PJ - PAll'!C41)","v":""},{"$f":"IF('PJ - PAll'!D41=\"\",\"\",'PJ - PAll'!D41)","v":""},{"$f":"IF('PJ - PAll'!H41=\"\",\"\",'PJ - PAll'!H41)","v":""},{"$f":"IF('PJ - PAll'!M41=\"\",\"\",'PJ - PAll'!M41)","v":""},null,{"$f":"IF('PJ - PAll'!O41=\"\",\"\",'PJ - PAll'!O41)","v":""}]
[null,{"$f":"IF(AND('PJ - PAll'!$C42=\"\",'PJ - PAll'!$D42=\"\"),\"\",'PJ - PAll'!V42)","v":""},{"$f":"IF(AND('PJ - PAll'!$C42=\"\",'PJ - PAll'!$D42=\"\"),\"\",'PJ - PAll'!B42)","v":""},{"$f":"IF('PJ - PAll'!C42=\"\",\"\",'PJ - PAll'!C42)","v":""},{"$f":"IF('PJ - PAll'!D42=\"\",\"\",'PJ - PAll'!D42)","v":""},{"$f":"IF('PJ - PAll'!H42=\"\",\"\",'PJ - PAll'!H42)","v":""},{"$f":"IF('PJ - PAll'!M42=\"\",\"\",'PJ - PAll'!M42)","v":""},null,{"$f":"IF('PJ - PAll'!O42=\"\",\"\",'PJ - PAll'!O42)","v":""}]
[null,{"$f":"IF(AND('PJ - PAll'!$C43=\"\",'PJ - PAll'!$D43=\"\"),\"\",'PJ - PAll'!V43)","v":""},{"$f":"IF(AND('PJ - PAll'!$C43=\"\",'PJ - PAll'!$D43=\"\"),\"\",'PJ - PAll'!B43)","v":""},{"$f":"IF('PJ - PAll'!C43=\"\",\"\",'PJ - PAll'!C43)","v":""},{"$f":"IF('PJ - PAll'!D43=\"\",\"\",'PJ - PAll'!D43)","v":""},{"$f":"IF('PJ - PAll'!H43=\"\",\"\",'PJ - PAll'!H43)","v":""},{"$f":"IF('PJ - PAll'!M43=\"\",\"\",'PJ - PAll'!M43)","v":""},null,{"$f":"IF('PJ - PAll'!O43=\"\",\"\",'PJ - PAll'!O43)","v":""}]
[null,{"$f":"IF(AND('PJ - PAll'!$C44=\"\",'PJ - PAll'!$D44=\"\"),\"\",'PJ - PAll'!V44)","v":""},{"$f":"IF(AND('PJ - PAll'!$C44=\"\",'PJ - PAll'!$D44=\"\"),\"\",'PJ - PAll'!B44)","v":""},{"$f":"IF('PJ - PAll'!C44=\"\",\"\",'PJ - PAll'!C44)","v":""},{"$f":"IF('PJ - PAll'!D44=\"\",\"\",'PJ - PAll'!D44)","v":""},{"$f":"IF('PJ - PAll'!H44=\"\",\"\",'PJ - PAll'!H44)","v":""},{"$f":"IF('PJ - PAll'!M44=\"\",\"\",'PJ - PAll'!M44)","v":""},null,{"$f":"IF('PJ - PAll'!O44=\"\",\"\",'PJ - PAll'!O44)","v":""}]
[null,{"$f":"IF(AND('PJ - PAll'!$C45=\"\",'PJ - PAll'!$D45=\"\"),\"\",'PJ - PAll'!V45)","v":""},{"$f":"IF(AND('PJ - PAll'!$C45=\"\",'PJ - PAll'!$D45=\"\"),\"\",'PJ - PAll'!B45)","v":""},{"$f":"IF('PJ - PAll'!C45=\"\",\"\",'PJ - PAll'!C45)","v":""},{"$f":"IF('PJ - PAll'!D45=\"\",\"\",'PJ - PAll'!D45)","v":""},{"$f":"IF('PJ - PAll'!H45=\"\",\"\",'PJ - PAll'!H45)","v":""},{"$f":"IF('PJ - PAll'!M45=\"\",\"\",'PJ - PAll'!M45)","v":""},null,{"$f":"IF('PJ - PAll'!O45=\"\",\"\",'PJ - PAll'!O45)","v":""}]
[null,{"$f":"IF(AND('PJ - PAll'!$C46=\"\",'PJ - PAll'!$D46=\"\"),\"\",'PJ - PAll'!V46)","v":""},{"$f":"IF(AND('PJ - PAll'!$C46=\"\",'PJ - PAll'!$D46=\"\"),\"\",'PJ - PAll'!B46)","v":""},{"$f":"IF('PJ - PAll'!C46=\"\",\"\",'PJ - PAll'!C46)","v":""},{"$f":"IF('PJ - PAll'!D46=\"\",\"\",'PJ - PAll'!D46)","v":""},{"$f":"IF('PJ - PAll'!H46=\"\",\"\",'PJ - PAll'!H46)","v":""},{"$f":"IF('PJ - PAll'!M46=\"\",\"\",'PJ - PAll'!M46)","v":""},null,{"$f":"IF('PJ - PAll'!O46=\"\",\"\",'PJ - PAll'!O46)","v":""}]
[null,{"$f":"IF(AND('PJ - PAll'!$C47=\"\",'PJ - PAll'!$D47=\"\"),\"\",'PJ - PAll'!V47)","v":""},{"$f":"IF(AND('PJ - PAll'!$C47=\"\",'PJ - PAll'!$D47=\"\"),\"\",'PJ - PAll'!B47)","v":""},{"$f":"IF('PJ - PAll'!C47=\"\",\"\",'PJ - PAll'!C47)","v":""},{"$f":"IF('PJ - PAll'!D47=\"\",\"\",'PJ - PAll'!D47)","v":""},{"$f":"IF('PJ - PAll'!H47=\"\",\"\",'PJ - PAll'!H47)","v":""},{"$f":"IF('PJ - PAll'!M47=\"\",\"\",'PJ - PAll'!M47)","v":""},null,{"$f":"IF('PJ - PAll'!O47=\"\",\"\",'PJ - PAll'!O47)","v":""}]
[null,{"$f":"IF(AND('PJ - PAll'!$C48=\"\",'PJ - PAll'!$D48=\"\"),\"\",'PJ - PAll'!V48)","v":""},{"$f":"IF(AND('PJ - PAll'!$C48=\"\",'PJ - PAll'!$D48=\"\"),\"\",'PJ - PAll'!B48)","v":""},{"$f":"IF('PJ - PAll'!C48=\"\",\"\",'PJ - PAll'!C48)","v":""},{"$f":"IF('PJ - PAll'!D48=\"\",\"\",'PJ - PAll'!D48)","v":""},{"$f":"IF('PJ - PAll'!H48=\"\",\"\",'PJ - PAll'!H48)","v":""},{"$f":"IF('PJ - PAll'!M48=\"\",\"\",'PJ - PAll'!M48)","v":""},null,{"$f":"IF('PJ - PAll'!O48=\"\",\"\",'PJ - PAll'!O48)","v":""}]
[null,{"$f":"IF(AND('PJ - PAll'!$C49=\"\",'PJ - PAll'!$D49=\"\"),\"\",'PJ - PAll'!V49)","v":""},{"$f":"IF(AND('PJ - PAll'!$C49=\"\",'PJ - PAll'!$D49=\"\"),\"\",'PJ - PAll'!B49)","v":""},{"$f":"IF('PJ - PAll'!C49=\"\",\"\",'PJ - PAll'!C49)","v":""},{"$f":"IF('PJ - PAll'!D49=\"\",\"\",'PJ - PAll'!D49)","v":""},{"$f":"IF('PJ - PAll'!H49=\"\",\"\",'PJ - PAll'!H49)","v":""},{"$f":"IF('PJ - PAll'!M49=\"\",\"\",'PJ - PAll'!M49)","v":""},null,{"$f":"IF('PJ - PAll'!O49=\"\",\"\",'PJ - PAll'!O49)","v":""}]
[null,{"$f":"IF(AND('PJ - PAll'!$C50=\"\",'PJ - PAll'!$D50=\"\"),\"\",'PJ - PAll'!V50)","v":""},{"$f":"IF(AND('PJ - PAll'!$C50=\"\",'PJ - PAll'!$D50=\"\"),\"\",'PJ - PAll'!B50)","v":""},{"$f":"IF('PJ - PAll'!C50=\"\",\"\",'PJ - PAll'!C50)","v":""},{"$f":"IF('PJ - PAll'!D50=\"\",\"\",'PJ - PAll'!D50)","v":""},{"$f":"IF('PJ - PAll'!H50=\"\",\"\",'PJ - PAll'!H50)","v":""},{"$f":"IF('PJ - PAll'!M50=\"\",\"\",'PJ - PAll'!M50)","v":""},null,{"$f":"IF('PJ - PAll'!O50=\"\",\"\",'PJ - PAll'!O50)","v":""}]
[null,{"$f":"IF(AND('PJ - PAll'!$C51=\"\",'PJ - PAll'!$D51=\"\"),\"\",'PJ - PAll'!V51)","v":""},{"$f":"IF(AND('PJ - PAll'!$C51=\"\",'PJ - PAll'!$D51=\"\"),\"\",'PJ - PAll'!B51)","v":""},{"$f":"IF('PJ - PAll'!C51=\"\",\"\",'PJ - PAll'!C51)","v":""},{"$f":"IF('PJ - PAll'!D51=\"\",\"\",'PJ - PAll'!D51)","v":""},{"$f":"IF('PJ - PAll'!H51=\"\",\"\",'PJ - PAll'!H51)","v":""},{"$f":"IF('PJ - PAll'!M51=\"\",\"\",'PJ - PAll'!M51)","v":""},null,{"$f":"IF('PJ - PAll'!O51=\"\",\"\",'PJ - PAll'!O51)","v":""}]
[null,{"$f":"IF(AND('PJ - PAll'!$C52=\"\",'PJ - PAll'!$D52=\"\"),\"\",'PJ - PAll'!V52)","v":""},{"$f":"IF(AND('PJ - PAll'!$C52=\"\",'PJ - PAll'!$D52=\"\"),\"\",'PJ - PAll'!B52)","v":""},{"$f":"IF('PJ - PAll'!C52=\"\",\"\",'PJ - PAll'!C52)","v":""},{"$f":"IF('PJ - PAll'!D52=\"\",\"\",'PJ - PAll'!D52)","v":""},{"$f":"IF('PJ - PAll'!H52=\"\",\"\",'PJ - PAll'!H52)","v":""},{"$f":"IF('PJ - PAll'!M52=\"\",\"\",'PJ - PAll'!M52)","v":""},null,{"$f":"IF('PJ - PAll'!O52=\"\",\"\",'PJ - PAll'!O52)","v":""}]
[null,{"$f":"IF(AND('PJ - PAll'!$C53=\"\",'PJ - PAll'!$D53=\"\"),\"\",'PJ - PAll'!V53)","v":""},{"$f":"IF(AND('PJ - PAll'!$C53=\"\",'PJ - PAll'!$D53=\"\"),\"\",'PJ - PAll'!B53)","v":""},{"$f":"IF('PJ - PAll'!C53=\"\",\"\",'PJ - PAll'!C53)","v":""},{"$f":"IF('PJ - PAll'!D53=\"\",\"\",'PJ - PAll'!D53)","v":""},{"$f":"IF('PJ - PAll'!H53=\"\",\"\",'PJ - PAll'!H53)","v":""},{"$f":"IF('PJ - PAll'!M53=\"\",\"\",'PJ - PAll'!M53)","v":""},null,{"$f":"IF('PJ - PAll'!O53=\"\",\"\",'PJ - PAll'!O53)","v":""}]
[null,{"$f":"IF(AND('PJ - PAll'!$C54=\"\",'PJ - PAll'!$D54=\"\"),\"\",'PJ - PAll'!V54)","v":""},{"$f":"IF(AND('PJ - PAll'!$C54=\"\",'PJ - PAll'!$D54=\"\"),\"\",'PJ - PAll'!B54)","v":""},{"$f":"IF('PJ - PAll'!C54=\"\",\"\",'PJ - PAll'!C54)","v":""},{"$f":"IF('PJ - PAll'!D54=\"\",\"\",'PJ - PAll'!D54)","v":""},{"$f":"IF('PJ - PAll'!H54=\"\",\"\",'PJ - PAll'!H54)","v":""},{"$f":"IF('PJ - PAll'!M54=\"\",\"\",'PJ - PAll'!M54)","v":""},null,{"$f":"IF('PJ - PAll'!O54=\"\",\"\",'PJ - PAll'!O54)","v":""}]
[null,{"$f":"IF(AND('PJ - PAll'!$C55=\"\",'PJ - PAll'!$D55=\"\"),\"\",'PJ - PAll'!V55)","v":""},{"$f":"IF(AND('PJ - PAll'!$C55=\"\",'PJ - PAll'!$D55=\"\"),\"\",'PJ - PAll'!B55)","v":""},{"$f":"IF('PJ - PAll'!C55=\"\",\"\",'PJ - PAll'!C55)","v":""},{"$f":"IF('PJ - PAll'!D55=\"\",\"\",'PJ - PAll'!D55)","v":""},{"$f":"IF('PJ - PAll'!H55=\"\",\"\",'PJ - PAll'!H55)","v":""},{"$f":"IF('PJ - PAll'!M55=\"\",\"\",'PJ - PAll'!M55)","v":""},null,{"$f":"IF('PJ - PAll'!O55=\"\",\"\",'PJ - PAll'!O55)","v":""}]
[null,{"$f":"IF(AND('PJ - PAll'!$C56=\"\",'PJ - PAll'!$D56=\"\"),\"\",'PJ - PAll'!V56)","v":""},{"$f":"IF(AND('PJ - PAll'!$C56=\"\",'PJ - PAll'!$D56=\"\"),\"\",'PJ - PAll'!B56)","v":""},{"$f":"IF('PJ - PAll'!C56=\"\",\"\",'PJ - PAll'!C56)","v":""},{"$f":"IF('PJ - PAll'!D56=\"\",\"\",'PJ - PAll'!D56)","v":""},{"$f":"IF('PJ - PAll'!H56=\"\",\"\",'PJ - PAll'!H56)","v":""},{"$f":"IF('PJ - PAll'!M56=\"\",\"\",'PJ - PAll'!M56)","v":""},null,{"$f":"IF('PJ - PAll'!O56=\"\",\"\",'PJ - PAll'!O56)","v":""}]
[null,{"$f":"IF(AND('PJ - PAll'!$C57=\"\",'PJ - PAll'!$D57=\"\"),\"\",'PJ - PAll'!V57)","v":""},{"$f":"IF(AND('PJ - PAll'!$C57=\"\",'PJ - PAll'!$D57=\"\"),\"\",'PJ - PAll'!B57)","v":""},{"$f":"IF('PJ - PAll'!C57=\"\",\"\",'PJ - PAll'!C57)","v":""},{"$f":"IF('PJ - PAll'!D57=\"\",\"\",'PJ - PAll'!D57)","v":""},{"$f":"IF('PJ - PAll'!H57=\"\",\"\",'PJ - PAll'!H57)","v":""},{"$f":"IF('PJ - PAll'!M57=\"\",\"\",'PJ - PAll'!M57)","v":""},null,{"$f":"IF('PJ - PAll'!O57=\"\",\"\",'PJ - PAll'!O57)","v":""}]
[null,{"$f":"IF(AND('PJ - PAll'!$C58=\"\",'PJ - PAll'!$D58=\"\"),\"\",'PJ - PAll'!V58)","v":""},{"$f":"IF(AND('PJ - PAll'!$C58=\"\",'PJ - PAll'!$D58=\"\"),\"\",'PJ - PAll'!B58)","v":""},{"$f":"IF('PJ - PAll'!C58=\"\",\"\",'PJ - PAll'!C58)","v":""},{"$f":"IF('PJ - PAll'!D58=\"\",\"\",'PJ - PAll'!D58)","v":""},{"$f":"IF('PJ - PAll'!H58=\"\",\"\",'PJ - PAll'!H58)","v":""},{"$f":"IF('PJ - PAll'!M58=\"\",\"\",'PJ - PAll'!M58)","v":""},null,{"$f":"IF('PJ - PAll'!O58=\"\",\"\",'PJ - PAll'!O58)","v":""}]
[null,{"$f":"IF(AND('PJ - PAll'!$C59=\"\",'PJ - PAll'!$D59=\"\"),\"\",'PJ - PAll'!V59)","v":""},{"$f":"IF(AND('PJ - PAll'!$C59=\"\",'PJ - PAll'!$D59=\"\"),\"\",'PJ - PAll'!B59)","v":""},{"$f":"IF('PJ - PAll'!C59=\"\",\"\",'PJ - PAll'!C59)","v":""},{"$f":"IF('PJ - PAll'!D59=\"\",\"\",'PJ - PAll'!D59)","v":""},{"$f":"IF('PJ - PAll'!H59=\"\",\"\",'PJ - PAll'!H59)","v":""},{"$f":"IF('PJ - PAll'!M59=\"\",\"\",'PJ - PAll'!M59)","v":""},null,{"$f":"IF('PJ - PAll'!O59=\"\",\"\",'PJ - PAll'!O59)","v":""}]
[null,{"$f":"IF(AND('PJ - PAll'!$C60=\"\",'PJ - PAll'!$D60=\"\"),\"\",'PJ - PAll'!V60)","v":""},{"$f":"IF(AND('PJ - PAll'!$C60=\"\",'PJ - PAll'!$D60=\"\"),\"\",'PJ - PAll'!B60)","v":""},{"$f":"IF('PJ - PAll'!C60=\"\",\"\",'PJ - PAll'!C60)","v":""},{"$f":"IF('PJ - PAll'!D60=\"\",\"\",'PJ - PAll'!D60)","v":""},{"$f":"IF('PJ - PAll'!H60=\"\",\"\",'PJ - PAll'!H60)","v":""},{"$f":"IF('PJ - PAll'!M60=\"\",\"\",'PJ - PAll'!M60)","v":""},null,{"$f":"IF('PJ - PAll'!O60=\"\",\"\",'PJ - PAll'!O60)","v":""}]
[null,{"$f":"IF(AND('PJ - PAll'!$C61=\"\",'PJ - PAll'!$D61=\"\"),\"\",'PJ - PAll'!V61)","v":""},{"$f":"IF(AND('PJ - PAll'!$C61=\"\",'PJ - PAll'!$D61=\"\"),\"\",'PJ - PAll'!B61)","v":""},{"$f":"IF('PJ - PAll'!C61=\"\",\"\",'PJ - PAll'!C61)","v":""},{"$f":"IF('PJ - PAll'!D61=\"\",\"\",'PJ - PAll'!D61)","v":""},{"$f":"IF('PJ - PAll'!H61=\"\",\"\",'PJ - PAll'!H61)","v":""},{"$f":"IF('PJ - PAll'!M61=\"\",\"\",'PJ - PAll'!M61)","v":""},null,{"$f":"IF('PJ - PAll'!O61=\"\",\"\",'PJ - PAll'!O61)","v":""}]
[null,{"$f":"IF(AND('PJ - PAll'!$C62=\"\",'PJ - PAll'!$D62=\"\"),\"\",'PJ - PAll'!V62)","v":""},{"$f":"IF(AND('PJ - PAll'!$C62=\"\",'PJ - PAll'!$D62=\"\"),\"\",'PJ - PAll'!B62)","v":""},{"$f":"IF('PJ - PAll'!C62=\"\",\"\",'PJ - PAll'!C62)","v":""},{"$f":"IF('PJ - PAll'!D62=\"\",\"\",'PJ - PAll'!D62)","v":""},{"$f":"IF('PJ - PAll'!H62=\"\",\"\",'PJ - PAll'!H62)","v":""},{"$f":"IF('PJ - PAll'!M62=\"\",\"\",'PJ - PAll'!M62)","v":""},null,{"$f":"IF('PJ - PAll'!O62=\"\",\"\",'PJ - PAll'!O62)","v":""}]
[null,{"$f":"IF(AND('PJ - PAll'!$C63=\"\",'PJ - PAll'!$D63=\"\"),\"\",'PJ - PAll'!V63)","v":""},{"$f":"IF(AND('PJ - PAll'!$C63=\"\",'PJ - PAll'!$D63=\"\"),\"\",'PJ - PAll'!B63)","v":""},{"$f":"IF('PJ - PAll'!C63=\"\",\"\",'PJ - PAll'!C63)","v":""},{"$f":"IF('PJ - PAll'!D63=\"\",\"\",'PJ - PAll'!D63)","v":""},{"$f":"IF('PJ - PAll'!H63=\"\",\"\",'PJ - PAll'!H63)","v":""},{"$f":"IF('PJ - PAll'!M63=\"\",\"\",'PJ - PAll'!M63)","v":""},null,{"$f":"IF('PJ - PAll'!O63=\"\",\"\",'PJ - PAll'!O63)","v":""}]
[null,{"$f":"IF(AND('PJ - PAll'!$C64=\"\",'PJ - PAll'!$D64=\"\"),\"\",'PJ - PAll'!V64)","v":""},{"$f":"IF(AND('PJ - PAll'!$C64=\"\",'PJ - PAll'!$D64=\"\"),\"\",'PJ - PAll'!B64)","v":""},{"$f":"IF('PJ - PAll'!C64=\"\",\"\",'PJ - PAll'!C64)","v":""},{"$f":"IF('PJ - PAll'!D64=\"\",\"\",'PJ - PAll'!D64)","v":""},{"$f":"IF('PJ - PAll'!H64=\"\",\"\",'PJ - PAll'!H64)","v":""},{"$f":"IF('PJ - PAll'!M64=\"\",\"\",'PJ - PAll'!M64)","v":""},null,{"$f":"IF('PJ - PAll'!O64=\"\",\"\",'PJ - PAll'!O64)","v":""}]
[null,{"$f":"IF(AND('PJ - PAll'!$C65=\"\",'PJ - PAll'!$D65=\"\"),\"\",'PJ - PAll'!V65)","v":""},{"$f":"IF(AND('PJ - PAll'!$C65=\"\",'PJ - PAll'!$D65=\"\"),\"\",'PJ - PAll'!B65)","v":""},{"$f":"IF('PJ - PAll'!C65=\"\",\"\",'PJ - PAll'!C65)","v":""},{"$f":"IF('PJ - PAll'!D65=\"\",\"\",'PJ - PAll'!D65)","v":""},{"$f":"IF('PJ - PAll'!H65=\"\",\"\",'PJ - PAll'!H65)","v":""},{"$f":"IF('PJ - PAll'!M65=\"\",\"\",'PJ - PAll'!M65)","v":""},null,{"$f":"IF('PJ - PAll'!O65=\"\",\"\",'PJ - PAll'!O65)","v":""}]
[null,{"$f":"IF(AND('PJ - PAll'!$C66=\"\",'PJ - PAll'!$D66=\"\"),\"\",'PJ - PAll'!V66)","v":""},{"$f":"IF(AND('PJ - PAll'!$C66=\"\",'PJ - PAll'!$D66=\"\"),\"\",'PJ - PAll'!B66)","v":""},{"$f":"IF('PJ - PAll'!C66=\"\",\"\",'PJ - PAll'!C66)","v":""},{"$f":"IF('PJ - PAll'!D66=\"\",\"\",'PJ - PAll'!D66)","v":""},{"$f":"IF('PJ - PAll'!H66=\"\",\"\",'PJ - PAll'!H66)","v":""},{"$f":"IF('PJ - PAll'!M66=\"\",\"\",'PJ - PAll'!M66)","v":""},null,{"$f":"IF('PJ - PAll'!O66=\"\",\"\",'PJ - PAll'!O66)","v":""}]
[null,{"$f":"IF(AND('PJ - PAll'!$C67=\"\",'PJ - PAll'!$D67=\"\"),\"\",'PJ - PAll'!V67)","v":""},{"$f":"IF(AND('PJ - PAll'!$C67=\"\",'PJ - PAll'!$D67=\"\"),\"\",'PJ - PAll'!B67)","v":""},{"$f":"IF('PJ - PAll'!C67=\"\",\"\",'PJ - PAll'!C67)","v":""},{"$f":"IF('PJ - PAll'!D67=\"\",\"\",'PJ - PAll'!D67)","v":""},{"$f":"IF('PJ - PAll'!H67=\"\",\"\",'PJ - PAll'!H67)","v":""},{"$f":"IF('PJ - PAll'!M67=\"\",\"\",'PJ - PAll'!M67)","v":""},null,{"$f":"IF('PJ - PAll'!O67=\"\",\"\",'PJ - PAll'!O67)","v":""}]
[null,{"$f":"IF(AND('PJ - PAll'!$C68=\"\",'PJ - PAll'!$D68=\"\"),\"\",'PJ - PAll'!V68)","v":""},{"$f":"IF(AND('PJ - PAll'!$C68=\"\",'PJ - PAll'!$D68=\"\"),\"\",'PJ - PAll'!B68)","v":""},{"$f":"IF('PJ - PAll'!C68=\"\",\"\",'PJ - PAll'!C68)","v":""},{"$f":"IF('PJ - PAll'!D68=\"\",\"\",'PJ - PAll'!D68)","v":""},{"$f":"IF('PJ - PAll'!H68=\"\",\"\",'PJ - PAll'!H68)","v":""},{"$f":"IF('PJ - PAll'!M68=\"\",\"\",'PJ - PAll'!M68)","v":""},null,{"$f":"IF('PJ - PAll'!O68=\"\",\"\",'PJ - PAll'!O68)","v":""}]
[null,{"$f":"IF(AND('PJ - PAll'!$C69=\"\",'PJ - PAll'!$D69=\"\"),\"\",'PJ - PAll'!V69)","v":""},{"$f":"IF(AND('PJ - PAll'!$C69=\"\",'PJ - PAll'!$D69=\"\"),\"\",'PJ - PAll'!B69)","v":""},{"$f":"IF('PJ - PAll'!C69=\"\",\"\",'PJ - PAll'!C69)","v":""},{"$f":"IF('PJ - PAll'!D69=\"\",\"\",'PJ - PAll'!D69)","v":""},{"$f":"IF('PJ - PAll'!H69=\"\",\"\",'PJ - PAll'!H69)","v":""},{"$f":"IF('PJ - PAll'!M69=\"\",\"\",'PJ - PAll'!M69)","v":""},null,{"$f":"IF('PJ - PAll'!O69=\"\",\"\",'PJ - PAll'!O69)","v":""}]
[null,{"$f":"IF(AND('PJ - PAll'!$C70=\"\",'PJ - PAll'!$D70=\"\"),\"\",'PJ - PAll'!V70)","v":""},{"$f":"IF(AND('PJ - PAll'!$C70=\"\",'PJ - PAll'!$D70=\"\"),\"\",'PJ - PAll'!B70)","v":""},{"$f":"IF('PJ - PAll'!C70=\"\",\"\",'PJ - PAll'!C70)","v":""},{"$f":"IF('PJ - PAll'!D70=\"\",\"\",'PJ - PAll'!D70)","v":""},{"$f":"IF('PJ - PAll'!H70=\"\",\"\",'PJ - PAll'!H70)","v":""},{"$f":"IF('PJ - PAll'!M70=\"\",\"\",'PJ - PAll'!M70)","v":""},null,{"$f":"IF('PJ - PAll'!O70=\"\",\"\",'PJ - PAll'!O70)","v":""}]
[null,{"$f":"IF(AND('PJ - PAll'!$C71=\"\",'PJ - PAll'!$D71=\"\"),\"\",'PJ - PAll'!V71)","v":""},{"$f":"IF(AND('PJ - PAll'!$C71=\"\",'PJ - PAll'!$D71=\"\"),\"\",'PJ - PAll'!B71)","v":""},{"$f":"IF('PJ - PAll'!C71=\"\",\"\",'PJ - PAll'!C71)","v":""},{"$f":"IF('PJ - PAll'!D71=\"\",\"\",'PJ - PAll'!D71)","v":""},{"$f":"IF('PJ - PAll'!H71=\"\",\"\",'PJ - PAll'!H71)","v":""},{"$f":"IF('PJ - PAll'!M71=\"\",\"\",'PJ - PAll'!M71)","v":""},null,{"$f":"IF('PJ - PAll'!O71=\"\",\"\",'PJ - PAll'!O71)","v":""}]
[null,{"$f":"IF(AND('PJ - PAll'!$C72=\"\",'PJ - PAll'!$D72=\"\"),\"\",'PJ - PAll'!V72)","v":""},{"$f":"IF(AND('PJ - PAll'!$C72=\"\",'PJ - PAll'!$D72=\"\"),\"\",'PJ - PAll'!B72)","v":""},{"$f":"IF('PJ - PAll'!C72=\"\",\"\",'PJ - PAll'!C72)","v":""},{"$f":"IF('PJ - PAll'!D72=\"\",\"\",'PJ - PAll'!D72)","v":""},{"$f":"IF('PJ - PAll'!H72=\"\",\"\",'PJ - PAll'!H72)","v":""},{"$f":"IF('PJ - PAll'!M72=\"\",\"\",'PJ - PAll'!M72)","v":""},null,{"$f":"IF('PJ - PAll'!O72=\"\",\"\",'PJ - PAll'!O72)","v":""}]
[null,{"$f":"B44","v":"Běh na 100m s přek. - Pořadí jednotlivců - All"}]
[]
[null,{"$f":"$B$3","v":"Krajské kolo dorostu"},null,null,{"$f":"$E$3","v":"18.06.2022 Pardubice"}]
[]
[null,{"$f":"Start!$D$5","v":"dorostenky"}]
[null,"Pořadí","Start. číslo","Jméno","kolektiv","čas             I. pokusu","čas            II. pokusu",null,"Výsledný čas"]
[]
[null,{"$f":"IF(AND('PJ - PAll'!$C73=\"\",'PJ - PAll'!$D73=\"\"),\"\",'PJ - PAll'!V73)","v":""},{"$f":"IF(AND('PJ - PAll'!$C73=\"\",'PJ - PAll'!$D73=\"\"),\"\",'PJ - PAll'!B73)","v":""},{"$f":"IF('PJ - PAll'!C73=\"\",\"\",'PJ - PAll'!C73)","v":""},{"$f":"IF('PJ - PAll'!D73=\"\",\"\",'PJ - PAll'!D73)","v":""},{"$f":"IF('PJ - PAll'!H73=\"\",\"\",'PJ - PAll'!H73)","v":""},{"$f":"IF('PJ - PAll'!M73=\"\",\"\",'PJ - PAll'!M73)","v":""},null,{"$f":"IF('PJ - PAll'!O73=\"\",\"\",'PJ - PAll'!O73)","v":""}]
[null,{"$f":"IF(AND('PJ - PAll'!$C74=\"\",'PJ - PAll'!$D74=\"\"),\"\",'PJ - PAll'!V74)","v":""},{"$f":"IF(AND('PJ - PAll'!$C74=\"\",'PJ - PAll'!$D74=\"\"),\"\",'PJ - PAll'!B74)","v":""},{"$f":"IF('PJ - PAll'!C74=\"\",\"\",'PJ - PAll'!C74)","v":""},{"$f":"IF('PJ - PAll'!D74=\"\",\"\",'PJ - PAll'!D74)","v":""},{"$f":"IF('PJ - PAll'!H74=\"\",\"\",'PJ - PAll'!H74)","v":""},{"$f":"IF('PJ - PAll'!M74=\"\",\"\",'PJ - PAll'!M74)","v":""},null,{"$f":"IF('PJ - PAll'!O74=\"\",\"\",'PJ - PAll'!O74)","v":""}]
[null,{"$f":"IF(AND('PJ - PAll'!$C75=\"\",'PJ - PAll'!$D75=\"\"),\"\",'PJ - PAll'!V75)","v":""},{"$f":"IF(AND('PJ - PAll'!$C75=\"\",'PJ - PAll'!$D75=\"\"),\"\",'PJ - PAll'!B75)","v":""},{"$f":"IF('PJ - PAll'!C75=\"\",\"\",'PJ - PAll'!C75)","v":""},{"$f":"IF('PJ - PAll'!D75=\"\",\"\",'PJ - PAll'!D75)","v":""},{"$f":"IF('PJ - PAll'!H75=\"\",\"\",'PJ - PAll'!H75)","v":""},{"$f":"IF('PJ - PAll'!M75=\"\",\"\",'PJ - PAll'!M75)","v":""},null,{"$f":"IF('PJ - PAll'!O75=\"\",\"\",'PJ - PAll'!O75)","v":""}]
[null,{"$f":"IF(AND('PJ - PAll'!$C76=\"\",'PJ - PAll'!$D76=\"\"),\"\",'PJ - PAll'!V76)","v":""},{"$f":"IF(AND('PJ - PAll'!$C76=\"\",'PJ - PAll'!$D76=\"\"),\"\",'PJ - PAll'!B76)","v":""},{"$f":"IF('PJ - PAll'!C76=\"\",\"\",'PJ - PAll'!C76)","v":""},{"$f":"IF('PJ - PAll'!D76=\"\",\"\",'PJ - PAll'!D76)","v":""},{"$f":"IF('PJ - PAll'!H76=\"\",\"\",'PJ - PAll'!H76)","v":""},{"$f":"IF('PJ - PAll'!M76=\"\",\"\",'PJ - PAll'!M76)","v":""},null,{"$f":"IF('PJ - PAll'!O76=\"\",\"\",'PJ - PAll'!O76)","v":""}]
[null,{"$f":"IF(AND('PJ - PAll'!$C77=\"\",'PJ - PAll'!$D77=\"\"),\"\",'PJ - PAll'!V77)","v":""},{"$f":"IF(AND('PJ - PAll'!$C77=\"\",'PJ - PAll'!$D77=\"\"),\"\",'PJ - PAll'!B77)","v":""},{"$f":"IF('PJ - PAll'!C77=\"\",\"\",'PJ - PAll'!C77)","v":""},{"$f":"IF('PJ - PAll'!D77=\"\",\"\",'PJ - PAll'!D77)","v":""},{"$f":"IF('PJ - PAll'!H77=\"\",\"\",'PJ - PAll'!H77)","v":""},{"$f":"IF('PJ - PAll'!M77=\"\",\"\",'PJ - PAll'!M77)","v":""},null,{"$f":"IF('PJ - PAll'!O77=\"\",\"\",'PJ - PAll'!O77)","v":""}]
[null,{"$f":"IF(AND('PJ - PAll'!$C78=\"\",'PJ - PAll'!$D78=\"\"),\"\",'PJ - PAll'!V78)","v":""},{"$f":"IF(AND('PJ - PAll'!$C78=\"\",'PJ - PAll'!$D78=\"\"),\"\",'PJ - PAll'!B78)","v":""},{"$f":"IF('PJ - PAll'!C78=\"\",\"\",'PJ - PAll'!C78)","v":""},{"$f":"IF('PJ - PAll'!D78=\"\",\"\",'PJ - PAll'!D78)","v":""},{"$f":"IF('PJ - PAll'!H78=\"\",\"\",'PJ - PAll'!H78)","v":""},{"$f":"IF('PJ - PAll'!M78=\"\",\"\",'PJ - PAll'!M78)","v":""},null,{"$f":"IF('PJ - PAll'!O78=\"\",\"\",'PJ - PAll'!O78)","v":""}]
[null,{"$f":"IF(AND('PJ - PAll'!$C79=\"\",'PJ - PAll'!$D79=\"\"),\"\",'PJ - PAll'!V79)","v":""},{"$f":"IF(AND('PJ - PAll'!$C79=\"\",'PJ - PAll'!$D79=\"\"),\"\",'PJ - PAll'!B79)","v":""},{"$f":"IF('PJ - PAll'!C79=\"\",\"\",'PJ - PAll'!C79)","v":""},{"$f":"IF('PJ - PAll'!D79=\"\",\"\",'PJ - PAll'!D79)","v":""},{"$f":"IF('PJ - PAll'!H79=\"\",\"\",'PJ - PAll'!H79)","v":""},{"$f":"IF('PJ - PAll'!M79=\"\",\"\",'PJ - PAll'!M79)","v":""},null,{"$f":"IF('PJ - PAll'!O79=\"\",\"\",'PJ - PAll'!O79)","v":""}]
[null,{"$f":"IF(AND('PJ - PAll'!$C80=\"\",'PJ - PAll'!$D80=\"\"),\"\",'PJ - PAll'!V80)","v":""},{"$f":"IF(AND('PJ - PAll'!$C80=\"\",'PJ - PAll'!$D80=\"\"),\"\",'PJ - PAll'!B80)","v":""},{"$f":"IF('PJ - PAll'!C80=\"\",\"\",'PJ - PAll'!C80)","v":""},{"$f":"IF('PJ - PAll'!D80=\"\",\"\",'PJ - PAll'!D80)","v":""},{"$f":"IF('PJ - PAll'!H80=\"\",\"\",'PJ - PAll'!H80)","v":""},{"$f":"IF('PJ - PAll'!M80=\"\",\"\",'PJ - PAll'!M80)","v":""},null,{"$f":"IF('PJ - PAll'!O80=\"\",\"\",'PJ - PAll'!O80)","v":""}]
[null,{"$f":"IF(AND('PJ - PAll'!$C81=\"\",'PJ - PAll'!$D81=\"\"),\"\",'PJ - PAll'!V81)","v":""},{"$f":"IF(AND('PJ - PAll'!$C81=\"\",'PJ - PAll'!$D81=\"\"),\"\",'PJ - PAll'!B81)","v":""},{"$f":"IF('PJ - PAll'!C81=\"\",\"\",'PJ - PAll'!C81)","v":""},{"$f":"IF('PJ - PAll'!D81=\"\",\"\",'PJ - PAll'!D81)","v":""},{"$f":"IF('PJ - PAll'!H81=\"\",\"\",'PJ - PAll'!H81)","v":""},{"$f":"IF('PJ - PAll'!M81=\"\",\"\",'PJ - PAll'!M81)","v":""},null,{"$f":"IF('PJ - PAll'!O81=\"\",\"\",'PJ - PAll'!O81)","v":""}]
[null,{"$f":"IF(AND('PJ - PAll'!$C82=\"\",'PJ - PAll'!$D82=\"\"),\"\",'PJ - PAll'!V82)","v":""},{"$f":"IF(AND('PJ - PAll'!$C82=\"\",'PJ - PAll'!$D82=\"\"),\"\",'PJ - PAll'!B82)","v":""},{"$f":"IF('PJ - PAll'!C82=\"\",\"\",'PJ - PAll'!C82)","v":""},{"$f":"IF('PJ - PAll'!D82=\"\",\"\",'PJ - PAll'!D82)","v":""},{"$f":"IF('PJ - PAll'!H82=\"\",\"\",'PJ - PAll'!H82)","v":""},{"$f":"IF('PJ - PAll'!M82=\"\",\"\",'PJ - PAll'!M82)","v":""},null,{"$f":"IF('PJ - PAll'!O82=\"\",\"\",'PJ - PAll'!O82)","v":""}]
[null,{"$f":"IF(AND('PJ - PAll'!$C83=\"\",'PJ - PAll'!$D83=\"\"),\"\",'PJ - PAll'!V83)","v":""},{"$f":"IF(AND('PJ - PAll'!$C83=\"\",'PJ - PAll'!$D83=\"\"),\"\",'PJ - PAll'!B83)","v":""},{"$f":"IF('PJ - PAll'!C83=\"\",\"\",'PJ - PAll'!C83)","v":""},{"$f":"IF('PJ - PAll'!D83=\"\",\"\",'PJ - PAll'!D83)","v":""},{"$f":"IF('PJ - PAll'!H83=\"\",\"\",'PJ - PAll'!H83)","v":""},{"$f":"IF('PJ - PAll'!M83=\"\",\"\",'PJ - PAll'!M83)","v":""},null,{"$f":"IF('PJ - PAll'!O83=\"\",\"\",'PJ - PAll'!O83)","v":""}]
[null,{"$f":"IF(AND('PJ - PAll'!$C84=\"\",'PJ - PAll'!$D84=\"\"),\"\",'PJ - PAll'!V84)","v":""},{"$f":"IF(AND('PJ - PAll'!$C84=\"\",'PJ - PAll'!$D84=\"\"),\"\",'PJ - PAll'!B84)","v":""},{"$f":"IF('PJ - PAll'!C84=\"\",\"\",'PJ - PAll'!C84)","v":""},{"$f":"IF('PJ - PAll'!D84=\"\",\"\",'PJ - PAll'!D84)","v":""},{"$f":"IF('PJ - PAll'!H84=\"\",\"\",'PJ - PAll'!H84)","v":""},{"$f":"IF('PJ - PAll'!M84=\"\",\"\",'PJ - PAll'!M84)","v":""},null,{"$f":"IF('PJ - PAll'!O84=\"\",\"\",'PJ - PAll'!O84)","v":""}]
[null,{"$f":"IF(AND('PJ - PAll'!$C85=\"\",'PJ - PAll'!$D85=\"\"),\"\",'PJ - PAll'!V85)","v":""},{"$f":"IF(AND('PJ - PAll'!$C85=\"\",'PJ - PAll'!$D85=\"\"),\"\",'PJ - PAll'!B85)","v":""},{"$f":"IF('PJ - PAll'!C85=\"\",\"\",'PJ - PAll'!C85)","v":""},{"$f":"IF('PJ - PAll'!D85=\"\",\"\",'PJ - PAll'!D85)","v":""},{"$f":"IF('PJ - PAll'!H85=\"\",\"\",'PJ - PAll'!H85)","v":""},{"$f":"IF('PJ - PAll'!M85=\"\",\"\",'PJ - PAll'!M85)","v":""},null,{"$f":"IF('PJ - PAll'!O85=\"\",\"\",'PJ - PAll'!O85)","v":""}]
[null,{"$f":"IF(AND('PJ - PAll'!$C86=\"\",'PJ - PAll'!$D86=\"\"),\"\",'PJ - PAll'!V86)","v":""},{"$f":"IF(AND('PJ - PAll'!$C86=\"\",'PJ - PAll'!$D86=\"\"),\"\",'PJ - PAll'!B86)","v":""},{"$f":"IF('PJ - PAll'!C86=\"\",\"\",'PJ - PAll'!C86)","v":""},{"$f":"IF('PJ - PAll'!D86=\"\",\"\",'PJ - PAll'!D86)","v":""},{"$f":"IF('PJ - PAll'!H86=\"\",\"\",'PJ - PAll'!H86)","v":""},{"$f":"IF('PJ - PAll'!M86=\"\",\"\",'PJ - PAll'!M86)","v":""},null,{"$f":"IF('PJ - PAll'!O86=\"\",\"\",'PJ - PAll'!O86)","v":""}]
[null,{"$f":"IF(AND('PJ - PAll'!$C87=\"\",'PJ - PAll'!$D87=\"\"),\"\",'PJ - PAll'!V87)","v":""},{"$f":"IF(AND('PJ - PAll'!$C87=\"\",'PJ - PAll'!$D87=\"\"),\"\",'PJ - PAll'!B87)","v":""},{"$f":"IF('PJ - PAll'!C87=\"\",\"\",'PJ - PAll'!C87)","v":""},{"$f":"IF('PJ - PAll'!D87=\"\",\"\",'PJ - PAll'!D87)","v":""},{"$f":"IF('PJ - PAll'!H87=\"\",\"\",'PJ - PAll'!H87)","v":""},{"$f":"IF('PJ - PAll'!M87=\"\",\"\",'PJ - PAll'!M87)","v":""},null,{"$f":"IF('PJ - PAll'!O87=\"\",\"\",'PJ - PAll'!O87)","v":""}]
[null,{"$f":"IF(AND('PJ - PAll'!$C88=\"\",'PJ - PAll'!$D88=\"\"),\"\",'PJ - PAll'!V88)","v":""},{"$f":"IF(AND('PJ - PAll'!$C88=\"\",'PJ - PAll'!$D88=\"\"),\"\",'PJ - PAll'!B88)","v":""},{"$f":"IF('PJ - PAll'!C88=\"\",\"\",'PJ - PAll'!C88)","v":""},{"$f":"IF('PJ - PAll'!D88=\"\",\"\",'PJ - PAll'!D88)","v":""},{"$f":"IF('PJ - PAll'!H88=\"\",\"\",'PJ - PAll'!H88)","v":""},{"$f":"IF('PJ - PAll'!M88=\"\",\"\",'PJ - PAll'!M88)","v":""},null,{"$f":"IF('PJ - PAll'!O88=\"\",\"\",'PJ - PAll'!O88)","v":""}]
[null,{"$f":"IF(AND('PJ - PAll'!$C89=\"\",'PJ - PAll'!$D89=\"\"),\"\",'PJ - PAll'!V89)","v":""},{"$f":"IF(AND('PJ - PAll'!$C89=\"\",'PJ - PAll'!$D89=\"\"),\"\",'PJ - PAll'!B89)","v":""},{"$f":"IF('PJ - PAll'!C89=\"\",\"\",'PJ - PAll'!C89)","v":""},{"$f":"IF('PJ - PAll'!D89=\"\",\"\",'PJ - PAll'!D89)","v":""},{"$f":"IF('PJ - PAll'!H89=\"\",\"\",'PJ - PAll'!H89)","v":""},{"$f":"IF('PJ - PAll'!M89=\"\",\"\",'PJ - PAll'!M89)","v":""},null,{"$f":"IF('PJ - PAll'!O89=\"\",\"\",'PJ - PAll'!O89)","v":""}]
[null,{"$f":"IF(AND('PJ - PAll'!$C90=\"\",'PJ - PAll'!$D90=\"\"),\"\",'PJ - PAll'!V90)","v":""},{"$f":"IF(AND('PJ - PAll'!$C90=\"\",'PJ - PAll'!$D90=\"\"),\"\",'PJ - PAll'!B90)","v":""},{"$f":"IF('PJ - PAll'!C90=\"\",\"\",'PJ - PAll'!C90)","v":""},{"$f":"IF('PJ - PAll'!D90=\"\",\"\",'PJ - PAll'!D90)","v":""},{"$f":"IF('PJ - PAll'!H90=\"\",\"\",'PJ - PAll'!H90)","v":""},{"$f":"IF('PJ - PAll'!M90=\"\",\"\",'PJ - PAll'!M90)","v":""},null,{"$f":"IF('PJ - PAll'!O90=\"\",\"\",'PJ - PAll'!O90)","v":""}]
[null,{"$f":"IF(AND('PJ - PAll'!$C91=\"\",'PJ - PAll'!$D91=\"\"),\"\",'PJ - PAll'!V91)","v":""},{"$f":"IF(AND('PJ - PAll'!$C91=\"\",'PJ - PAll'!$D91=\"\"),\"\",'PJ - PAll'!B91)","v":""},{"$f":"IF('PJ - PAll'!C91=\"\",\"\",'PJ - PAll'!C91)","v":""},{"$f":"IF('PJ - PAll'!D91=\"\",\"\",'PJ - PAll'!D91)","v":""},{"$f":"IF('PJ - PAll'!H91=\"\",\"\",'PJ - PAll'!H91)","v":""},{"$f":"IF('PJ - PAll'!M91=\"\",\"\",'PJ - PAll'!M91)","v":""},null,{"$f":"IF('PJ - PAll'!O91=\"\",\"\",'PJ - PAll'!O91)","v":""}]
[null,{"$f":"IF(AND('PJ - PAll'!$C92=\"\",'PJ - PAll'!$D92=\"\"),\"\",'PJ - PAll'!V92)","v":""},{"$f":"IF(AND('PJ - PAll'!$C92=\"\",'PJ - PAll'!$D92=\"\"),\"\",'PJ - PAll'!B92)","v":""},{"$f":"IF('PJ - PAll'!C92=\"\",\"\",'PJ - PAll'!C92)","v":""},{"$f":"IF('PJ - PAll'!D92=\"\",\"\",'PJ - PAll'!D92)","v":""},{"$f":"IF('PJ - PAll'!H92=\"\",\"\",'PJ - PAll'!H92)","v":""},{"$f":"IF('PJ - PAll'!M92=\"\",\"\",'PJ - PAll'!M92)","v":""},null,{"$f":"IF('PJ - PAll'!O92=\"\",\"\",'PJ - PAll'!O92)","v":""}]
[null,{"$f":"IF(AND('PJ - PAll'!$C93=\"\",'PJ - PAll'!$D93=\"\"),\"\",'PJ - PAll'!V93)","v":""},{"$f":"IF(AND('PJ - PAll'!$C93=\"\",'PJ - PAll'!$D93=\"\"),\"\",'PJ - PAll'!B93)","v":""},{"$f":"IF('PJ - PAll'!C93=\"\",\"\",'PJ - PAll'!C93)","v":""},{"$f":"IF('PJ - PAll'!D93=\"\",\"\",'PJ - PAll'!D93)","v":""},{"$f":"IF('PJ - PAll'!H93=\"\",\"\",'PJ - PAll'!H93)","v":""},{"$f":"IF('PJ - PAll'!M93=\"\",\"\",'PJ - PAll'!M93)","v":""},null,{"$f":"IF('PJ - PAll'!O93=\"\",\"\",'PJ - PAll'!O93)","v":""}]
[null,{"$f":"IF(AND('PJ - PAll'!$C94=\"\",'PJ - PAll'!$D94=\"\"),\"\",'PJ - PAll'!V94)","v":""},{"$f":"IF(AND('PJ - PAll'!$C94=\"\",'PJ - PAll'!$D94=\"\"),\"\",'PJ - PAll'!B94)","v":""},{"$f":"IF('PJ - PAll'!C94=\"\",\"\",'PJ - PAll'!C94)","v":""},{"$f":"IF('PJ - PAll'!D94=\"\",\"\",'PJ - PAll'!D94)","v":""},{"$f":"IF('PJ - PAll'!H94=\"\",\"\",'PJ - PAll'!H94)","v":""},{"$f":"IF('PJ - PAll'!M94=\"\",\"\",'PJ - PAll'!M94)","v":""},null,{"$f":"IF('PJ - PAll'!O94=\"\",\"\",'PJ - PAll'!O94)","v":""}]
[null,{"$f":"IF(AND('PJ - PAll'!$C95=\"\",'PJ - PAll'!$D95=\"\"),\"\",'PJ - PAll'!V95)","v":""},{"$f":"IF(AND('PJ - PAll'!$C95=\"\",'PJ - PAll'!$D95=\"\"),\"\",'PJ - PAll'!B95)","v":""},{"$f":"IF('PJ - PAll'!C95=\"\",\"\",'PJ - PAll'!C95)","v":""},{"$f":"IF('PJ - PAll'!D95=\"\",\"\",'PJ - PAll'!D95)","v":""},{"$f":"IF('PJ - PAll'!H95=\"\",\"\",'PJ - PAll'!H95)","v":""},{"$f":"IF('PJ - PAll'!M95=\"\",\"\",'PJ - PAll'!M95)","v":""},null,{"$f":"IF('PJ - PAll'!O95=\"\",\"\",'PJ - PAll'!O95)","v":""}]
[null,{"$f":"IF(AND('PJ - PAll'!$C96=\"\",'PJ - PAll'!$D96=\"\"),\"\",'PJ - PAll'!V96)","v":""},{"$f":"IF(AND('PJ - PAll'!$C96=\"\",'PJ - PAll'!$D96=\"\"),\"\",'PJ - PAll'!B96)","v":""},{"$f":"IF('PJ - PAll'!C96=\"\",\"\",'PJ - PAll'!C96)","v":""},{"$f":"IF('PJ - PAll'!D96=\"\",\"\",'PJ - PAll'!D96)","v":""},{"$f":"IF('PJ - PAll'!H96=\"\",\"\",'PJ - PAll'!H96)","v":""},{"$f":"IF('PJ - PAll'!M96=\"\",\"\",'PJ - PAll'!M96)","v":""},null,{"$f":"IF('PJ - PAll'!O96=\"\",\"\",'PJ - PAll'!O96)","v":""}]
[null,{"$f":"IF(AND('PJ - PAll'!$C97=\"\",'PJ - PAll'!$D97=\"\"),\"\",'PJ - PAll'!V97)","v":""},{"$f":"IF(AND('PJ - PAll'!$C97=\"\",'PJ - PAll'!$D97=\"\"),\"\",'PJ - PAll'!B97)","v":""},{"$f":"IF('PJ - PAll'!C97=\"\",\"\",'PJ - PAll'!C97)","v":""},{"$f":"IF('PJ - PAll'!D97=\"\",\"\",'PJ - PAll'!D97)","v":""},{"$f":"IF('PJ - PAll'!H97=\"\",\"\",'PJ - PAll'!H97)","v":""},{"$f":"IF('PJ - PAll'!M97=\"\",\"\",'PJ - PAll'!M97)","v":""},null,{"$f":"IF('PJ - PAll'!O97=\"\",\"\",'PJ - PAll'!O97)","v":""}]
[null,{"$f":"IF(AND('PJ - PAll'!$C98=\"\",'PJ - PAll'!$D98=\"\"),\"\",'PJ - PAll'!V98)","v":""},{"$f":"IF(AND('PJ - PAll'!$C98=\"\",'PJ - PAll'!$D98=\"\"),\"\",'PJ - PAll'!B98)","v":""},{"$f":"IF('PJ - PAll'!C98=\"\",\"\",'PJ - PAll'!C98)","v":""},{"$f":"IF('PJ - PAll'!D98=\"\",\"\",'PJ - PAll'!D98)","v":""},{"$f":"IF('PJ - PAll'!H98=\"\",\"\",'PJ - PAll'!H98)","v":""},{"$f":"IF('PJ - PAll'!M98=\"\",\"\",'PJ - PAll'!M98)","v":""},null,{"$f":"IF('PJ - PAll'!O98=\"\",\"\",'PJ - PAll'!O98)","v":""}]
[null,{"$f":"IF(AND('PJ - PAll'!$C99=\"\",'PJ - PAll'!$D99=\"\"),\"\",'PJ - PAll'!V99)","v":""},{"$f":"IF(AND('PJ - PAll'!$C99=\"\",'PJ - PAll'!$D99=\"\"),\"\",'PJ - PAll'!B99)","v":""},{"$f":"IF('PJ - PAll'!C99=\"\",\"\",'PJ - PAll'!C99)","v":""},{"$f":"IF('PJ - PAll'!D99=\"\",\"\",'PJ - PAll'!D99)","v":""},{"$f":"IF('PJ - PAll'!H99=\"\",\"\",'PJ - PAll'!H99)","v":""},{"$f":"IF('PJ - PAll'!M99=\"\",\"\",'PJ - PAll'!M99)","v":""},null,{"$f":"IF('PJ - PAll'!O99=\"\",\"\",'PJ - PAll'!O99)","v":""}]
[null,{"$f":"IF(AND('PJ - PAll'!$C100=\"\",'PJ - PAll'!$D100=\"\"),\"\",'PJ - PAll'!V100)","v":""},{"$f":"IF(AND('PJ - PAll'!$C100=\"\",'PJ - PAll'!$D100=\"\"),\"\",'PJ - PAll'!B100)","v":""},{"$f":"IF('PJ - PAll'!C100=\"\",\"\",'PJ - PAll'!C100)","v":""},{"$f":"IF('PJ - PAll'!D100=\"\",\"\",'PJ - PAll'!D100)","v":""},{"$f":"IF('PJ - PAll'!H100=\"\",\"\",'PJ - PAll'!H100)","v":""},{"$f":"IF('PJ - PAll'!M100=\"\",\"\",'PJ - PAll'!M100)","v":""},null,{"$f":"IF('PJ - PAll'!O100=\"\",\"\",'PJ - PAll'!O100)","v":""}]
[null,{"$f":"IF(AND('PJ - PAll'!$C101=\"\",'PJ - PAll'!$D101=\"\"),\"\",'PJ - PAll'!V101)","v":""},{"$f":"IF(AND('PJ - PAll'!$C101=\"\",'PJ - PAll'!$D101=\"\"),\"\",'PJ - PAll'!B101)","v":""},{"$f":"IF('PJ - PAll'!C101=\"\",\"\",'PJ - PAll'!C101)","v":""},{"$f":"IF('PJ - PAll'!D101=\"\",\"\",'PJ - PAll'!D101)","v":""},{"$f":"IF('PJ - PAll'!H101=\"\",\"\",'PJ - PAll'!H101)","v":""},{"$f":"IF('PJ - PAll'!M101=\"\",\"\",'PJ - PAll'!M101)","v":""},null,{"$f":"IF('PJ - PAll'!O101=\"\",\"\",'PJ - PAll'!O101)","v":""}]
[null,{"$f":"IF(AND('PJ - PAll'!$C102=\"\",'PJ - PAll'!$D102=\"\"),\"\",'PJ - PAll'!V102)","v":""},{"$f":"IF(AND('PJ - PAll'!$C102=\"\",'PJ - PAll'!$D102=\"\"),\"\",'PJ - PAll'!B102)","v":""},{"$f":"IF('PJ - PAll'!C102=\"\",\"\",'PJ - PAll'!C102)","v":""},{"$f":"IF('PJ - PAll'!D102=\"\",\"\",'PJ - PAll'!D102)","v":""},{"$f":"IF('PJ - PAll'!H102=\"\",\"\",'PJ - PAll'!H102)","v":""},{"$f":"IF('PJ - PAll'!M102=\"\",\"\",'PJ - PAll'!M102)","v":""},null,{"$f":"IF('PJ - PAll'!O102=\"\",\"\",'PJ - PAll'!O102)","v":""}]
[null,{"$f":"IF(AND('PJ - PAll'!$C103=\"\",'PJ - PAll'!$D103=\"\"),\"\",'PJ - PAll'!V103)","v":""},{"$f":"IF(AND('PJ - PAll'!$C103=\"\",'PJ - PAll'!$D103=\"\"),\"\",'PJ - PAll'!B103)","v":""},{"$f":"IF('PJ - PAll'!C103=\"\",\"\",'PJ - PAll'!C103)","v":""},{"$f":"IF('PJ - PAll'!D103=\"\",\"\",'PJ - PAll'!D103)","v":""},{"$f":"IF('PJ - PAll'!H103=\"\",\"\",'PJ - PAll'!H103)","v":""},{"$f":"IF('PJ - PAll'!M103=\"\",\"\",'PJ - PAll'!M103)","v":""},null,{"$f":"IF('PJ - PAll'!O103=\"\",\"\",'PJ - PAll'!O103)","v":""}]
[null,{"$f":"IF(AND('PJ - PAll'!$C104=\"\",'PJ - PAll'!$D104=\"\"),\"\",'PJ - PAll'!V104)","v":""},{"$f":"IF(AND('PJ - PAll'!$C104=\"\",'PJ - PAll'!$D104=\"\"),\"\",'PJ - PAll'!B104)","v":""},{"$f":"IF('PJ - PAll'!C104=\"\",\"\",'PJ - PAll'!C104)","v":""},{"$f":"IF('PJ - PAll'!D104=\"\",\"\",'PJ - PAll'!D104)","v":""},{"$f":"IF('PJ - PAll'!H104=\"\",\"\",'PJ - PAll'!H104)","v":""},{"$f":"IF('PJ - PAll'!M104=\"\",\"\",'PJ - PAll'!M104)","v":""},null,{"$f":"IF('PJ - PAll'!O104=\"\",\"\",'PJ - PAll'!O104)","v":""}]
[null,{"$f":"IF(AND('PJ - PAll'!$C105=\"\",'PJ - PAll'!$D105=\"\"),\"\",'PJ - PAll'!V105)","v":""},{"$f":"IF(AND('PJ - PAll'!$C105=\"\",'PJ - PAll'!$D105=\"\"),\"\",'PJ - PAll'!B105)","v":""},{"$f":"IF('PJ - PAll'!C105=\"\",\"\",'PJ - PAll'!C105)","v":""},{"$f":"IF('PJ - PAll'!D105=\"\",\"\",'PJ - PAll'!D105)","v":""},{"$f":"IF('PJ - PAll'!H105=\"\",\"\",'PJ - PAll'!H105)","v":""},{"$f":"IF('PJ - PAll'!M105=\"\",\"\",'PJ - PAll'!M105)","v":""},null,{"$f":"IF('PJ - PAll'!O105=\"\",\"\",'PJ - PAll'!O105)","v":""}]
[null,{"$f":"IF(AND('PJ - PAll'!$C106=\"\",'PJ - PAll'!$D106=\"\"),\"\",'PJ - PAll'!V106)","v":""},{"$f":"IF(AND('PJ - PAll'!$C106=\"\",'PJ - PAll'!$D106=\"\"),\"\",'PJ - PAll'!B106)","v":""},{"$f":"IF('PJ - PAll'!C106=\"\",\"\",'PJ - PAll'!C106)","v":""},{"$f":"IF('PJ - PAll'!D106=\"\",\"\",'PJ - PAll'!D106)","v":""},{"$f":"IF('PJ - PAll'!H106=\"\",\"\",'PJ - PAll'!H106)","v":""},{"$f":"IF('PJ - PAll'!M106=\"\",\"\",'PJ - PAll'!M106)","v":""},null,{"$f":"IF('PJ - PAll'!O106=\"\",\"\",'PJ - PAll'!O106)","v":""}]
[null,{"$f":"IF(AND('PJ - PAll'!$C107=\"\",'PJ - PAll'!$D107=\"\"),\"\",'PJ - PAll'!V107)","v":""},{"$f":"IF(AND('PJ - PAll'!$C107=\"\",'PJ - PAll'!$D107=\"\"),\"\",'PJ - PAll'!B107)","v":""},{"$f":"IF('PJ - PAll'!C107=\"\",\"\",'PJ - PAll'!C107)","v":""},{"$f":"IF('PJ - PAll'!D107=\"\",\"\",'PJ - PAll'!D107)","v":""},{"$f":"IF('PJ - PAll'!H107=\"\",\"\",'PJ - PAll'!H107)","v":""},{"$f":"IF('PJ - PAll'!M107=\"\",\"\",'PJ - PAll'!M107)","v":""},null,{"$f":"IF('PJ - PAll'!O107=\"\",\"\",'PJ - PAll'!O107)","v":""}]
[null,{"$f":"IF(AND('PJ - PAll'!$C108=\"\",'PJ - PAll'!$D108=\"\"),\"\",'PJ - PAll'!V108)","v":""},{"$f":"IF(AND('PJ - PAll'!$C108=\"\",'PJ - PAll'!$D108=\"\"),\"\",'PJ - PAll'!B108)","v":""},{"$f":"IF('PJ - PAll'!C108=\"\",\"\",'PJ - PAll'!C108)","v":""},{"$f":"IF('PJ - PAll'!D108=\"\",\"\",'PJ - PAll'!D108)","v":""},{"$f":"IF('PJ - PAll'!H108=\"\",\"\",'PJ - PAll'!H108)","v":""},{"$f":"IF('PJ - PAll'!M108=\"\",\"\",'PJ - PAll'!M108)","v":""},null,{"$f":"IF('PJ - PAll'!O108=\"\",\"\",'PJ - PAll'!O108)","v":""}]
[null,{"$f":"B87","v":"Běh na 100m s přek. - Pořadí jednotlivců - All"}]
[]
[null,{"$f":"$B$3","v":"Krajské kolo dorostu"},null,null,{"$f":"$E$3","v":"18.06.2022 Pardubice"}]
[]
[null,{"$f":"Start!$D$5","v":"dorostenky"}]
[null,"Pořadí","Start. číslo","Jméno","kolektiv","čas             I. pokusu","čas            II. pokusu",null,"Výsledný čas"]
[]
[null,{"$f":"IF(AND('PJ - PAll'!$C109=\"\",'PJ - PAll'!$D109=\"\"),\"\",'PJ - PAll'!V109)","v":""},{"$f":"IF(AND('PJ - PAll'!$C109=\"\",'PJ - PAll'!$D109=\"\"),\"\",'PJ - PAll'!B109)","v":""},{"$f":"IF('PJ - PAll'!C109=\"\",\"\",'PJ - PAll'!C109)","v":""},{"$f":"IF('PJ - PAll'!D109=\"\",\"\",'PJ - PAll'!D109)","v":""},{"$f":"IF('PJ - PAll'!H109=\"\",\"\",'PJ - PAll'!H109)","v":""},{"$f":"IF('PJ - PAll'!M109=\"\",\"\",'PJ - PAll'!M109)","v":""},null,{"$f":"IF('PJ - PAll'!O109=\"\",\"\",'PJ - PAll'!O109)","v":""}]
[null,{"$f":"IF(AND('PJ - PAll'!$C110=\"\",'PJ - PAll'!$D110=\"\"),\"\",'PJ - PAll'!V110)","v":""},{"$f":"IF(AND('PJ - PAll'!$C110=\"\",'PJ - PAll'!$D110=\"\"),\"\",'PJ - PAll'!B110)","v":""},{"$f":"IF('PJ - PAll'!C110=\"\",\"\",'PJ - PAll'!C110)","v":""},{"$f":"IF('PJ - PAll'!D110=\"\",\"\",'PJ - PAll'!D110)","v":""},{"$f":"IF('PJ - PAll'!H110=\"\",\"\",'PJ - PAll'!H110)","v":""},{"$f":"IF('PJ - PAll'!M110=\"\",\"\",'PJ - PAll'!M110)","v":""},null,{"$f":"IF('PJ - PAll'!O110=\"\",\"\",'PJ - PAll'!O110)","v":""}]
[null,{"$f":"IF(AND('PJ - PAll'!$C111=\"\",'PJ - PAll'!$D111=\"\"),\"\",'PJ - PAll'!V111)","v":""},{"$f":"IF(AND('PJ - PAll'!$C111=\"\",'PJ - PAll'!$D111=\"\"),\"\",'PJ - PAll'!B111)","v":""},{"$f":"IF('PJ - PAll'!C111=\"\",\"\",'PJ - PAll'!C111)","v":""},{"$f":"IF('PJ - PAll'!D111=\"\",\"\",'PJ - PAll'!D111)","v":""},{"$f":"IF('PJ - PAll'!H111=\"\",\"\",'PJ - PAll'!H111)","v":""},{"$f":"IF('PJ - PAll'!M111=\"\",\"\",'PJ - PAll'!M111)","v":""},null,{"$f":"IF('PJ - PAll'!O111=\"\",\"\",'PJ - PAll'!O111)","v":""}]
[null,{"$f":"IF(AND('PJ - PAll'!$C112=\"\",'PJ - PAll'!$D112=\"\"),\"\",'PJ - PAll'!V112)","v":""},{"$f":"IF(AND('PJ - PAll'!$C112=\"\",'PJ - PAll'!$D112=\"\"),\"\",'PJ - PAll'!B112)","v":""},{"$f":"IF('PJ - PAll'!C112=\"\",\"\",'PJ - PAll'!C112)","v":""},{"$f":"IF('PJ - PAll'!D112=\"\",\"\",'PJ - PAll'!D112)","v":""},{"$f":"IF('PJ - PAll'!H112=\"\",\"\",'PJ - PAll'!H112)","v":""},{"$f":"IF('PJ - PAll'!M112=\"\",\"\",'PJ - PAll'!M112)","v":""},null,{"$f":"IF('PJ - PAll'!O112=\"\",\"\",'PJ - PAll'!O112)","v":""}]
[null,{"$f":"IF(AND('PJ - PAll'!$C113=\"\",'PJ - PAll'!$D113=\"\"),\"\",'PJ - PAll'!V113)","v":""},{"$f":"IF(AND('PJ - PAll'!$C113=\"\",'PJ - PAll'!$D113=\"\"),\"\",'PJ - PAll'!B113)","v":""},{"$f":"IF('PJ - PAll'!C113=\"\",\"\",'PJ - PAll'!C113)","v":""},{"$f":"IF('PJ - PAll'!D113=\"\",\"\",'PJ - PAll'!D113)","v":""},{"$f":"IF('PJ - PAll'!H113=\"\",\"\",'PJ - PAll'!H113)","v":""},{"$f":"IF('PJ - PAll'!M113=\"\",\"\",'PJ - PAll'!M113)","v":""},null,{"$f":"IF('PJ - PAll'!O113=\"\",\"\",'PJ - PAll'!O113)","v":""}]
[null,{"$f":"IF(AND('PJ - PAll'!$C114=\"\",'PJ - PAll'!$D114=\"\"),\"\",'PJ - PAll'!V114)","v":""},{"$f":"IF(AND('PJ - PAll'!$C114=\"\",'PJ - PAll'!$D114=\"\"),\"\",'PJ - PAll'!B114)","v":""},{"$f":"IF('PJ - PAll'!C114=\"\",\"\",'PJ - PAll'!C114)","v":""},{"$f":"IF('PJ - PAll'!D114=\"\",\"\",'PJ - PAll'!D114)","v":""},{"$f":"IF('PJ - PAll'!H114=\"\",\"\",'PJ - PAll'!H114)","v":""},{"$f":"IF('PJ - PAll'!M114=\"\",\"\",'PJ - PAll'!M114)","v":""},null,{"$f":"IF('PJ - PAll'!O114=\"\",\"\",'PJ - PAll'!O114)","v":""}]
[null,{"$f":"IF(AND('PJ - PAll'!$C115=\"\",'PJ - PAll'!$D115=\"\"),\"\",'PJ - PAll'!V115)","v":""},{"$f":"IF(AND('PJ - PAll'!$C115=\"\",'PJ - PAll'!$D115=\"\"),\"\",'PJ - PAll'!B115)","v":""},{"$f":"IF('PJ - PAll'!C115=\"\",\"\",'PJ - PAll'!C115)","v":""},{"$f":"IF('PJ - PAll'!D115=\"\",\"\",'PJ - PAll'!D115)","v":""},{"$f":"IF('PJ - PAll'!H115=\"\",\"\",'PJ - PAll'!H115)","v":""},{"$f":"IF('PJ - PAll'!M115=\"\",\"\",'PJ - PAll'!M115)","v":""},null,{"$f":"IF('PJ - PAll'!O115=\"\",\"\",'PJ - PAll'!O115)","v":""}]
[null,{"$f":"IF(AND('PJ - PAll'!$C116=\"\",'PJ - PAll'!$D116=\"\"),\"\",'PJ - PAll'!V116)","v":""},{"$f":"IF(AND('PJ - PAll'!$C116=\"\",'PJ - PAll'!$D116=\"\"),\"\",'PJ - PAll'!B116)","v":""},{"$f":"IF('PJ - PAll'!C116=\"\",\"\",'PJ - PAll'!C116)","v":""},{"$f":"IF('PJ - PAll'!D116=\"\",\"\",'PJ - PAll'!D116)","v":""},{"$f":"IF('PJ - PAll'!H116=\"\",\"\",'PJ - PAll'!H116)","v":""},{"$f":"IF('PJ - PAll'!M116=\"\",\"\",'PJ - PAll'!M116)","v":""},null,{"$f":"IF('PJ - PAll'!O116=\"\",\"\",'PJ - PAll'!O116)","v":""}]
[null,{"$f":"IF(AND('PJ - PAll'!$C117=\"\",'PJ - PAll'!$D117=\"\"),\"\",'PJ - PAll'!V117)","v":""},{"$f":"IF(AND('PJ - PAll'!$C117=\"\",'PJ - PAll'!$D117=\"\"),\"\",'PJ - PAll'!B117)","v":""},{"$f":"IF('PJ - PAll'!C117=\"\",\"\",'PJ - PAll'!C117)","v":""},{"$f":"IF('PJ - PAll'!D117=\"\",\"\",'PJ - PAll'!D117)","v":""},{"$f":"IF('PJ - PAll'!H117=\"\",\"\",'PJ - PAll'!H117)","v":""},{"$f":"IF('PJ - PAll'!M117=\"\",\"\",'PJ - PAll'!M117)","v":""},null,{"$f":"IF('PJ - PAll'!O117=\"\",\"\",'PJ - PAll'!O117)","v":""}]
[null,{"$f":"IF(AND('PJ - PAll'!$C118=\"\",'PJ - PAll'!$D118=\"\"),\"\",'PJ - PAll'!V118)","v":""},{"$f":"IF(AND('PJ - PAll'!$C118=\"\",'PJ - PAll'!$D118=\"\"),\"\",'PJ - PAll'!B118)","v":""},{"$f":"IF('PJ - PAll'!C118=\"\",\"\",'PJ - PAll'!C118)","v":""},{"$f":"IF('PJ - PAll'!D118=\"\",\"\",'PJ - PAll'!D118)","v":""},{"$f":"IF('PJ - PAll'!H118=\"\",\"\",'PJ - PAll'!H118)","v":""},{"$f":"IF('PJ - PAll'!M118=\"\",\"\",'PJ - PAll'!M118)","v":""},null,{"$f":"IF('PJ - PAll'!O118=\"\",\"\",'PJ - PAll'!O118)","v":""}]
[null,{"$f":"IF(AND('PJ - PAll'!$C119=\"\",'PJ - PAll'!$D119=\"\"),\"\",'PJ - PAll'!V119)","v":""},{"$f":"IF(AND('PJ - PAll'!$C119=\"\",'PJ - PAll'!$D119=\"\"),\"\",'PJ - PAll'!B119)","v":""},{"$f":"IF('PJ - PAll'!C119=\"\",\"\",'PJ - PAll'!C119)","v":""},{"$f":"IF('PJ - PAll'!D119=\"\",\"\",'PJ - PAll'!D119)","v":""},{"$f":"IF('PJ - PAll'!H119=\"\",\"\",'PJ - PAll'!H119)","v":""},{"$f":"IF('PJ - PAll'!M119=\"\",\"\",'PJ - PAll'!M119)","v":""},null,{"$f":"IF('PJ - PAll'!O119=\"\",\"\",'PJ - PAll'!O119)","v":""}]
[null,{"$f":"IF(AND('PJ - PAll'!$C120=\"\",'PJ - PAll'!$D120=\"\"),\"\",'PJ - PAll'!V120)","v":""},{"$f":"IF(AND('PJ - PAll'!$C120=\"\",'PJ - PAll'!$D120=\"\"),\"\",'PJ - PAll'!B120)","v":""},{"$f":"IF('PJ - PAll'!C120=\"\",\"\",'PJ - PAll'!C120)","v":""},{"$f":"IF('PJ - PAll'!D120=\"\",\"\",'PJ - PAll'!D120)","v":""},{"$f":"IF('PJ - PAll'!H120=\"\",\"\",'PJ - PAll'!H120)","v":""},{"$f":"IF('PJ - PAll'!M120=\"\",\"\",'PJ - PAll'!M120)","v":""},null,{"$f":"IF('PJ - PAll'!O120=\"\",\"\",'PJ - PAll'!O120)","v":""}]
[null,{"$f":"IF(AND('PJ - PAll'!$C121=\"\",'PJ - PAll'!$D121=\"\"),\"\",'PJ - PAll'!V121)","v":""},{"$f":"IF(AND('PJ - PAll'!$C121=\"\",'PJ - PAll'!$D121=\"\"),\"\",'PJ - PAll'!B121)","v":""},{"$f":"IF('PJ - PAll'!C121=\"\",\"\",'PJ - PAll'!C121)","v":""},{"$f":"IF('PJ - PAll'!D121=\"\",\"\",'PJ - PAll'!D121)","v":""},{"$f":"IF('PJ - PAll'!H121=\"\",\"\",'PJ - PAll'!H121)","v":""},{"$f":"IF('PJ - PAll'!M121=\"\",\"\",'PJ - PAll'!M121)","v":""},null,{"$f":"IF('PJ - PAll'!O121=\"\",\"\",'PJ - PAll'!O121)","v":""}]
[null,{"$f":"IF(AND('PJ - PAll'!$C122=\"\",'PJ - PAll'!$D122=\"\"),\"\",'PJ - PAll'!V122)","v":""},{"$f":"IF(AND('PJ - PAll'!$C122=\"\",'PJ - PAll'!$D122=\"\"),\"\",'PJ - PAll'!B122)","v":""},{"$f":"IF('PJ - PAll'!C122=\"\",\"\",'PJ - PAll'!C122)","v":""},{"$f":"IF('PJ - PAll'!D122=\"\",\"\",'PJ - PAll'!D122)","v":""},{"$f":"IF('PJ - PAll'!H122=\"\",\"\",'PJ - PAll'!H122)","v":""},{"$f":"IF('PJ - PAll'!M122=\"\",\"\",'PJ - PAll'!M122)","v":""},null,{"$f":"IF('PJ - PAll'!O122=\"\",\"\",'PJ - PAll'!O122)","v":""}]
[null,{"$f":"IF(AND('PJ - PAll'!$C123=\"\",'PJ - PAll'!$D123=\"\"),\"\",'PJ - PAll'!V123)","v":""},{"$f":"IF(AND('PJ - PAll'!$C123=\"\",'PJ - PAll'!$D123=\"\"),\"\",'PJ - PAll'!B123)","v":""},{"$f":"IF('PJ - PAll'!C123=\"\",\"\",'PJ - PAll'!C123)","v":""},{"$f":"IF('PJ - PAll'!D123=\"\",\"\",'PJ - PAll'!D123)","v":""},{"$f":"IF('PJ - PAll'!H123=\"\",\"\",'PJ - PAll'!H123)","v":""},{"$f":"IF('PJ - PAll'!M123=\"\",\"\",'PJ - PAll'!M123)","v":""},null,{"$f":"IF('PJ - PAll'!O123=\"\",\"\",'PJ - PAll'!O123)","v":""}]
[null,{"$f":"IF(AND('PJ - PAll'!$C124=\"\",'PJ - PAll'!$D124=\"\"),\"\",'PJ - PAll'!V124)","v":""},{"$f":"IF(AND('PJ - PAll'!$C124=\"\",'PJ - PAll'!$D124=\"\"),\"\",'PJ - PAll'!B124)","v":""},{"$f":"IF('PJ - PAll'!C124=\"\",\"\",'PJ - PAll'!C124)","v":""},{"$f":"IF('PJ - PAll'!D124=\"\",\"\",'PJ - PAll'!D124)","v":""},{"$f":"IF('PJ - PAll'!H124=\"\",\"\",'PJ - PAll'!H124)","v":""},{"$f":"IF('PJ - PAll'!M124=\"\",\"\",'PJ - PAll'!M124)","v":""},null,{"$f":"IF('PJ - PAll'!O124=\"\",\"\",'PJ - PAll'!O124)","v":""}]
[null,{"$f":"IF(AND('PJ - PAll'!$C125=\"\",'PJ - PAll'!$D125=\"\"),\"\",'PJ - PAll'!V125)","v":""},{"$f":"IF(AND('PJ - PAll'!$C125=\"\",'PJ - PAll'!$D125=\"\"),\"\",'PJ - PAll'!B125)","v":""},{"$f":"IF('PJ - PAll'!C125=\"\",\"\",'PJ - PAll'!C125)","v":""},{"$f":"IF('PJ - PAll'!D125=\"\",\"\",'PJ - PAll'!D125)","v":""},{"$f":"IF('PJ - PAll'!H125=\"\",\"\",'PJ - PAll'!H125)","v":""},{"$f":"IF('PJ - PAll'!M125=\"\",\"\",'PJ - PAll'!M125)","v":""},null,{"$f":"IF('PJ - PAll'!O125=\"\",\"\",'PJ - PAll'!O125)","v":""}]
[null,{"$f":"IF(AND('PJ - PAll'!$C126=\"\",'PJ - PAll'!$D126=\"\"),\"\",'PJ - PAll'!V126)","v":""},{"$f":"IF(AND('PJ - PAll'!$C126=\"\",'PJ - PAll'!$D126=\"\"),\"\",'PJ - PAll'!B126)","v":""},{"$f":"IF('PJ - PAll'!C126=\"\",\"\",'PJ - PAll'!C126)","v":""},{"$f":"IF('PJ - PAll'!D126=\"\",\"\",'PJ - PAll'!D126)","v":""},{"$f":"IF('PJ - PAll'!H126=\"\",\"\",'PJ - PAll'!H126)","v":""},{"$f":"IF('PJ - PAll'!M126=\"\",\"\",'PJ - PAll'!M126)","v":""},null,{"$f":"IF('PJ - PAll'!O126=\"\",\"\",'PJ - PAll'!O126)","v":""}]
[null,{"$f":"IF(AND('PJ - PAll'!$C127=\"\",'PJ - PAll'!$D127=\"\"),\"\",'PJ - PAll'!V127)","v":""},{"$f":"IF(AND('PJ - PAll'!$C127=\"\",'PJ - PAll'!$D127=\"\"),\"\",'PJ - PAll'!B127)","v":""},{"$f":"IF('PJ - PAll'!C127=\"\",\"\",'PJ - PAll'!C127)","v":""},{"$f":"IF('PJ - PAll'!D127=\"\",\"\",'PJ - PAll'!D127)","v":""},{"$f":"IF('PJ - PAll'!H127=\"\",\"\",'PJ - PAll'!H127)","v":""},{"$f":"IF('PJ - PAll'!M127=\"\",\"\",'PJ - PAll'!M127)","v":""},null,{"$f":"IF('PJ - PAll'!O127=\"\",\"\",'PJ - PAll'!O127)","v":""}]
[null,{"$f":"IF(AND('PJ - PAll'!$C128=\"\",'PJ - PAll'!$D128=\"\"),\"\",'PJ - PAll'!V128)","v":""},{"$f":"IF(AND('PJ - PAll'!$C128=\"\",'PJ - PAll'!$D128=\"\"),\"\",'PJ - PAll'!B128)","v":""},{"$f":"IF('PJ - PAll'!C128=\"\",\"\",'PJ - PAll'!C128)","v":""},{"$f":"IF('PJ - PAll'!D128=\"\",\"\",'PJ - PAll'!D128)","v":""},{"$f":"IF('PJ - PAll'!H128=\"\",\"\",'PJ - PAll'!H128)","v":""},{"$f":"IF('PJ - PAll'!M128=\"\",\"\",'PJ - PAll'!M128)","v":""},null,{"$f":"IF('PJ - PAll'!O128=\"\",\"\",'PJ - PAll'!O128)","v":""}]
[null,{"$f":"IF(AND('PJ - PAll'!$C129=\"\",'PJ - PAll'!$D129=\"\"),\"\",'PJ - PAll'!V129)","v":""},{"$f":"IF(AND('PJ - PAll'!$C129=\"\",'PJ - PAll'!$D129=\"\"),\"\",'PJ - PAll'!B129)","v":""},{"$f":"IF('PJ - PAll'!C129=\"\",\"\",'PJ - PAll'!C129)","v":""},{"$f":"IF('PJ - PAll'!D129=\"\",\"\",'PJ - PAll'!D129)","v":""},{"$f":"IF('PJ - PAll'!H129=\"\",\"\",'PJ - PAll'!H129)","v":""},{"$f":"IF('PJ - PAll'!M129=\"\",\"\",'PJ - PAll'!M129)","v":""},null,{"$f":"IF('PJ - PAll'!O129=\"\",\"\",'PJ - PAll'!O129)","v":""}]
[null,{"$f":"IF(AND('PJ - PAll'!$C130=\"\",'PJ - PAll'!$D130=\"\"),\"\",'PJ - PAll'!V130)","v":""},{"$f":"IF(AND('PJ - PAll'!$C130=\"\",'PJ - PAll'!$D130=\"\"),\"\",'PJ - PAll'!B130)","v":""},{"$f":"IF('PJ - PAll'!C130=\"\",\"\",'PJ - PAll'!C130)","v":""},{"$f":"IF('PJ - PAll'!D130=\"\",\"\",'PJ - PAll'!D130)","v":""},{"$f":"IF('PJ - PAll'!H130=\"\",\"\",'PJ - PAll'!H130)","v":""},{"$f":"IF('PJ - PAll'!M130=\"\",\"\",'PJ - PAll'!M130)","v":""},null,{"$f":"IF('PJ - PAll'!O130=\"\",\"\",'PJ - PAll'!O130)","v":""}]
[null,{"$f":"IF(AND('PJ - PAll'!$C131=\"\",'PJ - PAll'!$D131=\"\"),\"\",'PJ - PAll'!V131)","v":""},{"$f":"IF(AND('PJ - PAll'!$C131=\"\",'PJ - PAll'!$D131=\"\"),\"\",'PJ - PAll'!B131)","v":""},{"$f":"IF('PJ - PAll'!C131=\"\",\"\",'PJ - PAll'!C131)","v":""},{"$f":"IF('PJ - PAll'!D131=\"\",\"\",'PJ - PAll'!D131)","v":""},{"$f":"IF('PJ - PAll'!H131=\"\",\"\",'PJ - PAll'!H131)","v":""},{"$f":"IF('PJ - PAll'!M131=\"\",\"\",'PJ - PAll'!M131)","v":""},null,{"$f":"IF('PJ - PAll'!O131=\"\",\"\",'PJ - PAll'!O131)","v":""}]
[null,{"$f":"IF(AND('PJ - PAll'!$C132=\"\",'PJ - PAll'!$D132=\"\"),\"\",'PJ - PAll'!V132)","v":""},{"$f":"IF(AND('PJ - PAll'!$C132=\"\",'PJ - PAll'!$D132=\"\"),\"\",'PJ - PAll'!B132)","v":""},{"$f":"IF('PJ - PAll'!C132=\"\",\"\",'PJ - PAll'!C132)","v":""},{"$f":"IF('PJ - PAll'!D132=\"\",\"\",'PJ - PAll'!D132)","v":""},{"$f":"IF('PJ - PAll'!H132=\"\",\"\",'PJ - PAll'!H132)","v":""},{"$f":"IF('PJ - PAll'!M132=\"\",\"\",'PJ - PAll'!M132)","v":""},null,{"$f":"IF('PJ - PAll'!O132=\"\",\"\",'PJ - PAll'!O132)","v":""}]
[null,{"$f":"IF(AND('PJ - PAll'!$C133=\"\",'PJ - PAll'!$D133=\"\"),\"\",'PJ - PAll'!V133)","v":""},{"$f":"IF(AND('PJ - PAll'!$C133=\"\",'PJ - PAll'!$D133=\"\"),\"\",'PJ - PAll'!B133)","v":""},{"$f":"IF('PJ - PAll'!C133=\"\",\"\",'PJ - PAll'!C133)","v":""},{"$f":"IF('PJ - PAll'!D133=\"\",\"\",'PJ - PAll'!D133)","v":""},{"$f":"IF('PJ - PAll'!H133=\"\",\"\",'PJ - PAll'!H133)","v":""},{"$f":"IF('PJ - PAll'!M133=\"\",\"\",'PJ - PAll'!M133)","v":""},null,{"$f":"IF('PJ - PAll'!O133=\"\",\"\",'PJ - PAll'!O133)","v":""}]
[null,{"$f":"IF(AND('PJ - PAll'!$C134=\"\",'PJ - PAll'!$D134=\"\"),\"\",'PJ - PAll'!V134)","v":""},{"$f":"IF(AND('PJ - PAll'!$C134=\"\",'PJ - PAll'!$D134=\"\"),\"\",'PJ - PAll'!B134)","v":""},{"$f":"IF('PJ - PAll'!C134=\"\",\"\",'PJ - PAll'!C134)","v":""},{"$f":"IF('PJ - PAll'!D134=\"\",\"\",'PJ - PAll'!D134)","v":""},{"$f":"IF('PJ - PAll'!H134=\"\",\"\",'PJ - PAll'!H134)","v":""},{"$f":"IF('PJ - PAll'!M134=\"\",\"\",'PJ - PAll'!M134)","v":""},null,{"$f":"IF('PJ - PAll'!O134=\"\",\"\",'PJ - PAll'!O134)","v":""}]
[null,{"$f":"IF(AND('PJ - PAll'!$C135=\"\",'PJ - PAll'!$D135=\"\"),\"\",'PJ - PAll'!V135)","v":""},{"$f":"IF(AND('PJ - PAll'!$C135=\"\",'PJ - PAll'!$D135=\"\"),\"\",'PJ - PAll'!B135)","v":""},{"$f":"IF('PJ - PAll'!C135=\"\",\"\",'PJ - PAll'!C135)","v":""},{"$f":"IF('PJ - PAll'!D135=\"\",\"\",'PJ - PAll'!D135)","v":""},{"$f":"IF('PJ - PAll'!H135=\"\",\"\",'PJ - PAll'!H135)","v":""},{"$f":"IF('PJ - PAll'!M135=\"\",\"\",'PJ - PAll'!M135)","v":""},null,{"$f":"IF('PJ - PAll'!O135=\"\",\"\",'PJ - PAll'!O135)","v":""}]
[null,{"$f":"IF(AND('PJ - PAll'!$C136=\"\",'PJ - PAll'!$D136=\"\"),\"\",'PJ - PAll'!V136)","v":""},{"$f":"IF(AND('PJ - PAll'!$C136=\"\",'PJ - PAll'!$D136=\"\"),\"\",'PJ - PAll'!B136)","v":""},{"$f":"IF('PJ - PAll'!C136=\"\",\"\",'PJ - PAll'!C136)","v":""},{"$f":"IF('PJ - PAll'!D136=\"\",\"\",'PJ - PAll'!D136)","v":""},{"$f":"IF('PJ - PAll'!H136=\"\",\"\",'PJ - PAll'!H136)","v":""},{"$f":"IF('PJ - PAll'!M136=\"\",\"\",'PJ - PAll'!M136)","v":""},null,{"$f":"IF('PJ - PAll'!O136=\"\",\"\",'PJ - PAll'!O136)","v":""}]
[null,{"$f":"IF(AND('PJ - PAll'!$C137=\"\",'PJ - PAll'!$D137=\"\"),\"\",'PJ - PAll'!V137)","v":""},{"$f":"IF(AND('PJ - PAll'!$C137=\"\",'PJ - PAll'!$D137=\"\"),\"\",'PJ - PAll'!B137)","v":""},{"$f":"IF('PJ - PAll'!C137=\"\",\"\",'PJ - PAll'!C137)","v":""},{"$f":"IF('PJ - PAll'!D137=\"\",\"\",'PJ - PAll'!D137)","v":""},{"$f":"IF('PJ - PAll'!H137=\"\",\"\",'PJ - PAll'!H137)","v":""},{"$f":"IF('PJ - PAll'!M137=\"\",\"\",'PJ - PAll'!M137)","v":""},null,{"$f":"IF('PJ - PAll'!O137=\"\",\"\",'PJ - PAll'!O137)","v":""}]
[null,{"$f":"IF(AND('PJ - PAll'!$C138=\"\",'PJ - PAll'!$D138=\"\"),\"\",'PJ - PAll'!V138)","v":""},{"$f":"IF(AND('PJ - PAll'!$C138=\"\",'PJ - PAll'!$D138=\"\"),\"\",'PJ - PAll'!B138)","v":""},{"$f":"IF('PJ - PAll'!C138=\"\",\"\",'PJ - PAll'!C138)","v":""},{"$f":"IF('PJ - PAll'!D138=\"\",\"\",'PJ - PAll'!D138)","v":""},{"$f":"IF('PJ - PAll'!H138=\"\",\"\",'PJ - PAll'!H138)","v":""},{"$f":"IF('PJ - PAll'!M138=\"\",\"\",'PJ - PAll'!M138)","v":""},null,{"$f":"IF('PJ - PAll'!O138=\"\",\"\",'PJ - PAll'!O138)","v":""}]
[null,{"$f":"IF(AND('PJ - PAll'!$C139=\"\",'PJ - PAll'!$D139=\"\"),\"\",'PJ - PAll'!V139)","v":""},{"$f":"IF(AND('PJ - PAll'!$C139=\"\",'PJ - PAll'!$D139=\"\"),\"\",'PJ - PAll'!B139)","v":""},{"$f":"IF('PJ - PAll'!C139=\"\",\"\",'PJ - PAll'!C139)","v":""},{"$f":"IF('PJ - PAll'!D139=\"\",\"\",'PJ - PAll'!D139)","v":""},{"$f":"IF('PJ - PAll'!H139=\"\",\"\",'PJ - PAll'!H139)","v":""},{"$f":"IF('PJ - PAll'!M139=\"\",\"\",'PJ - PAll'!M139)","v":""},null,{"$f":"IF('PJ - PAll'!O139=\"\",\"\",'PJ - PAll'!O139)","v":""}]
[null,{"$f":"IF(AND('PJ - PAll'!$C140=\"\",'PJ - PAll'!$D140=\"\"),\"\",'PJ - PAll'!V140)","v":""},{"$f":"IF(AND('PJ - PAll'!$C140=\"\",'PJ - PAll'!$D140=\"\"),\"\",'PJ - PAll'!B140)","v":""},{"$f":"IF('PJ - PAll'!C140=\"\",\"\",'PJ - PAll'!C140)","v":""},{"$f":"IF('PJ - PAll'!D140=\"\",\"\",'PJ - PAll'!D140)","v":""},{"$f":"IF('PJ - PAll'!H140=\"\",\"\",'PJ - PAll'!H140)","v":""},{"$f":"IF('PJ - PAll'!M140=\"\",\"\",'PJ - PAll'!M140)","v":""},null,{"$f":"IF('PJ - PAll'!O140=\"\",\"\",'PJ - PAll'!O140)","v":""}]
[null,{"$f":"IF(AND('PJ - PAll'!$C141=\"\",'PJ - PAll'!$D141=\"\"),\"\",'PJ - PAll'!V141)","v":""},{"$f":"IF(AND('PJ - PAll'!$C141=\"\",'PJ - PAll'!$D141=\"\"),\"\",'PJ - PAll'!B141)","v":""},{"$f":"IF('PJ - PAll'!C141=\"\",\"\",'PJ - PAll'!C141)","v":""},{"$f":"IF('PJ - PAll'!D141=\"\",\"\",'PJ - PAll'!D141)","v":""},{"$f":"IF('PJ - PAll'!H141=\"\",\"\",'PJ - PAll'!H141)","v":""},{"$f":"IF('PJ - PAll'!M141=\"\",\"\",'PJ - PAll'!M141)","v":""},null,{"$f":"IF('PJ - PAll'!O141=\"\",\"\",'PJ - PAll'!O141)","v":""}]
[null,{"$f":"IF(AND('PJ - PAll'!$C142=\"\",'PJ - PAll'!$D142=\"\"),\"\",'PJ - PAll'!V142)","v":""},{"$f":"IF(AND('PJ - PAll'!$C142=\"\",'PJ - PAll'!$D142=\"\"),\"\",'PJ - PAll'!B142)","v":""},{"$f":"IF('PJ - PAll'!C142=\"\",\"\",'PJ - PAll'!C142)","v":""},{"$f":"IF('PJ - PAll'!D142=\"\",\"\",'PJ - PAll'!D142)","v":""},{"$f":"IF('PJ - PAll'!H142=\"\",\"\",'PJ - PAll'!H142)","v":""},{"$f":"IF('PJ - PAll'!M142=\"\",\"\",'PJ - PAll'!M142)","v":""},null,{"$f":"IF('PJ - PAll'!O142=\"\",\"\",'PJ - PAll'!O142)","v":""}]
[null,{"$f":"IF(AND('PJ - PAll'!$C143=\"\",'PJ - PAll'!$D143=\"\"),\"\",'PJ - PAll'!V143)","v":""},{"$f":"IF(AND('PJ - PAll'!$C143=\"\",'PJ - PAll'!$D143=\"\"),\"\",'PJ - PAll'!B143)","v":""},{"$f":"IF('PJ - PAll'!C143=\"\",\"\",'PJ - PAll'!C143)","v":""},{"$f":"IF('PJ - PAll'!D143=\"\",\"\",'PJ - PAll'!D143)","v":""},{"$f":"IF('PJ - PAll'!H143=\"\",\"\",'PJ - PAll'!H143)","v":""},{"$f":"IF('PJ - PAll'!M143=\"\",\"\",'PJ - PAll'!M143)","v":""},null,{"$f":"IF('PJ - PAll'!O143=\"\",\"\",'PJ - PAll'!O143)","v":""}]
[null,{"$f":"IF(AND('PJ - PAll'!$C144=\"\",'PJ - PAll'!$D144=\"\"),\"\",'PJ - PAll'!V144)","v":""},{"$f":"IF(AND('PJ - PAll'!$C144=\"\",'PJ - PAll'!$D144=\"\"),\"\",'PJ - PAll'!B144)","v":""},{"$f":"IF('PJ - PAll'!C144=\"\",\"\",'PJ - PAll'!C144)","v":""},{"$f":"IF('PJ - PAll'!D144=\"\",\"\",'PJ - PAll'!D144)","v":""},{"$f":"IF('PJ - PAll'!H144=\"\",\"\",'PJ - PAll'!H144)","v":""},{"$f":"IF('PJ - PAll'!M144=\"\",\"\",'PJ - PAll'!M144)","v":""},null,{"$f":"IF('PJ - PAll'!O144=\"\",\"\",'PJ - PAll'!O144)","v":""}]
[null,{"$f":"B130","v":"Běh na 100m s přek. - Pořadí jednotlivců - All"}]
[]
[null,{"$f":"$B$3","v":"Krajské kolo dorostu"},null,null,{"$f":"$E$3","v":"18.06.2022 Pardubice"}]
[]
[null,{"$f":"Start!$D$5","v":"dorostenky"}]
[null,"Pořadí","Start. číslo","Jméno","kolektiv","čas             I. pokusu","čas            II. pokusu",null,"Výsledný čas"]
[]
[null,{"$f":"IF(AND('PJ - PAll'!$C145=\"\",'PJ - PAll'!$D145=\"\"),\"\",'PJ - PAll'!V145)","v":""},{"$f":"IF(AND('PJ - PAll'!$C145=\"\",'PJ - PAll'!$D145=\"\"),\"\",'PJ - PAll'!B145)","v":""},{"$f":"IF('PJ - PAll'!C145=\"\",\"\",'PJ - PAll'!C145)","v":""},{"$f":"IF('PJ - PAll'!D145=\"\",\"\",'PJ - PAll'!D145)","v":""},{"$f":"IF('PJ - PAll'!H145=\"\",\"\",'PJ - PAll'!H145)","v":""},{"$f":"IF('PJ - PAll'!M145=\"\",\"\",'PJ - PAll'!M145)","v":""},null,{"$f":"IF('PJ - PAll'!O145=\"\",\"\",'PJ - PAll'!O145)","v":""}]
[null,{"$f":"IF(AND('PJ - PAll'!$C146=\"\",'PJ - PAll'!$D146=\"\"),\"\",'PJ - PAll'!V146)","v":""},{"$f":"IF(AND('PJ - PAll'!$C146=\"\",'PJ - PAll'!$D146=\"\"),\"\",'PJ - PAll'!B146)","v":""},{"$f":"IF('PJ - PAll'!C146=\"\",\"\",'PJ - PAll'!C146)","v":""},{"$f":"IF('PJ - PAll'!D146=\"\",\"\",'PJ - PAll'!D146)","v":""},{"$f":"IF('PJ - PAll'!H146=\"\",\"\",'PJ - PAll'!H146)","v":""},{"$f":"IF('PJ - PAll'!M146=\"\",\"\",'PJ - PAll'!M146)","v":""},null,{"$f":"IF('PJ - PAll'!O146=\"\",\"\",'PJ - PAll'!O146)","v":""}]
[null,{"$f":"IF(AND('PJ - PAll'!$C147=\"\",'PJ - PAll'!$D147=\"\"),\"\",'PJ - PAll'!V147)","v":""},{"$f":"IF(AND('PJ - PAll'!$C147=\"\",'PJ - PAll'!$D147=\"\"),\"\",'PJ - PAll'!B147)","v":""},{"$f":"IF('PJ - PAll'!C147=\"\",\"\",'PJ - PAll'!C147)","v":""},{"$f":"IF('PJ - PAll'!D147=\"\",\"\",'PJ - PAll'!D147)","v":""},{"$f":"IF('PJ - PAll'!H147=\"\",\"\",'PJ - PAll'!H147)","v":""},{"$f":"IF('PJ - PAll'!M147=\"\",\"\",'PJ - PAll'!M147)","v":""},null,{"$f":"IF('PJ - PAll'!O147=\"\",\"\",'PJ - PAll'!O147)","v":""}]
[null,{"$f":"IF(AND('PJ - PAll'!$C148=\"\",'PJ - PAll'!$D148=\"\"),\"\",'PJ - PAll'!V148)","v":""},{"$f":"IF(AND('PJ - PAll'!$C148=\"\",'PJ - PAll'!$D148=\"\"),\"\",'PJ - PAll'!B148)","v":""},{"$f":"IF('PJ - PAll'!C148=\"\",\"\",'PJ - PAll'!C148)","v":""},{"$f":"IF('PJ - PAll'!D148=\"\",\"\",'PJ - PAll'!D148)","v":""},{"$f":"IF('PJ - PAll'!H148=\"\",\"\",'PJ - PAll'!H148)","v":""},{"$f":"IF('PJ - PAll'!M148=\"\",\"\",'PJ - PAll'!M148)","v":""},null,{"$f":"IF('PJ - PAll'!O148=\"\",\"\",'PJ - PAll'!O148)","v":""}]
[null,{"$f":"IF(AND('PJ - PAll'!$C149=\"\",'PJ - PAll'!$D149=\"\"),\"\",'PJ - PAll'!V149)","v":""},{"$f":"IF(AND('PJ - PAll'!$C149=\"\",'PJ - PAll'!$D149=\"\"),\"\",'PJ - PAll'!B149)","v":""},{"$f":"IF('PJ - PAll'!C149=\"\",\"\",'PJ - PAll'!C149)","v":""},{"$f":"IF('PJ - PAll'!D149=\"\",\"\",'PJ - PAll'!D149)","v":""},{"$f":"IF('PJ - PAll'!H149=\"\",\"\",'PJ - PAll'!H149)","v":""},{"$f":"IF('PJ - PAll'!M149=\"\",\"\",'PJ - PAll'!M149)","v":""},null,{"$f":"IF('PJ - PAll'!O149=\"\",\"\",'PJ - PAll'!O149)","v":""}]
[null,{"$f":"IF(AND('PJ - PAll'!$C150=\"\",'PJ - PAll'!$D150=\"\"),\"\",'PJ - PAll'!V150)","v":""},{"$f":"IF(AND('PJ - PAll'!$C150=\"\",'PJ - PAll'!$D150=\"\"),\"\",'PJ - PAll'!B150)","v":""},{"$f":"IF('PJ - PAll'!C150=\"\",\"\",'PJ - PAll'!C150)","v":""},{"$f":"IF('PJ - PAll'!D150=\"\",\"\",'PJ - PAll'!D150)","v":""},{"$f":"IF('PJ - PAll'!H150=\"\",\"\",'PJ - PAll'!H150)","v":""},{"$f":"IF('PJ - PAll'!M150=\"\",\"\",'PJ - PAll'!M150)","v":""},null,{"$f":"IF('PJ - PAll'!O150=\"\",\"\",'PJ - PAll'!O150)","v":""}]
[null,{"$f":"IF(AND('PJ - PAll'!$C151=\"\",'PJ - PAll'!$D151=\"\"),\"\",'PJ - PAll'!V151)","v":""},{"$f":"IF(AND('PJ - PAll'!$C151=\"\",'PJ - PAll'!$D151=\"\"),\"\",'PJ - PAll'!B151)","v":""},{"$f":"IF('PJ - PAll'!C151=\"\",\"\",'PJ - PAll'!C151)","v":""},{"$f":"IF('PJ - PAll'!D151=\"\",\"\",'PJ - PAll'!D151)","v":""},{"$f":"IF('PJ - PAll'!H151=\"\",\"\",'PJ - PAll'!H151)","v":""},{"$f":"IF('PJ - PAll'!M151=\"\",\"\",'PJ - PAll'!M151)","v":""},null,{"$f":"IF('PJ - PAll'!O151=\"\",\"\",'PJ - PAll'!O151)","v":""}]
[null,{"$f":"IF(AND('PJ - PAll'!$C152=\"\",'PJ - PAll'!$D152=\"\"),\"\",'PJ - PAll'!V152)","v":""},{"$f":"IF(AND('PJ - PAll'!$C152=\"\",'PJ - PAll'!$D152=\"\"),\"\",'PJ - PAll'!B152)","v":""},{"$f":"IF('PJ - PAll'!C152=\"\",\"\",'PJ - PAll'!C152)","v":""},{"$f":"IF('PJ - PAll'!D152=\"\",\"\",'PJ - PAll'!D152)","v":""},{"$f":"IF('PJ - PAll'!H152=\"\",\"\",'PJ - PAll'!H152)","v":""},{"$f":"IF('PJ - PAll'!M152=\"\",\"\",'PJ - PAll'!M152)","v":""},null,{"$f":"IF('PJ - PAll'!O152=\"\",\"\",'PJ - PAll'!O152)","v":""}]
[null,{"$f":"IF(AND('PJ - PAll'!$C153=\"\",'PJ - PAll'!$D153=\"\"),\"\",'PJ - PAll'!V153)","v":""},{"$f":"IF(AND('PJ - PAll'!$C153=\"\",'PJ - PAll'!$D153=\"\"),\"\",'PJ - PAll'!B153)","v":""},{"$f":"IF('PJ - PAll'!C153=\"\",\"\",'PJ - PAll'!C153)","v":""},{"$f":"IF('PJ - PAll'!D153=\"\",\"\",'PJ - PAll'!D153)","v":""},{"$f":"IF('PJ - PAll'!H153=\"\",\"\",'PJ - PAll'!H153)","v":""},{"$f":"IF('PJ - PAll'!M153=\"\",\"\",'PJ - PAll'!M153)","v":""},null,{"$f":"IF('PJ - PAll'!O153=\"\",\"\",'PJ - PAll'!O153)","v":""}]
[null,{"$f":"IF(AND('PJ - PAll'!$C154=\"\",'PJ - PAll'!$D154=\"\"),\"\",'PJ - PAll'!V154)","v":""},{"$f":"IF(AND('PJ - PAll'!$C154=\"\",'PJ - PAll'!$D154=\"\"),\"\",'PJ - PAll'!B154)","v":""},{"$f":"IF('PJ - PAll'!C154=\"\",\"\",'PJ - PAll'!C154)","v":""},{"$f":"IF('PJ - PAll'!D154=\"\",\"\",'PJ - PAll'!D154)","v":""},{"$f":"IF('PJ - PAll'!H154=\"\",\"\",'PJ - PAll'!H154)","v":""},{"$f":"IF('PJ - PAll'!M154=\"\",\"\",'PJ - PAll'!M154)","v":""},null,{"$f":"IF('PJ - PAll'!O154=\"\",\"\",'PJ - PAll'!O154)","v":""}]
[null,{"$f":"IF(AND('PJ - PAll'!$C155=\"\",'PJ - PAll'!$D155=\"\"),\"\",'PJ - PAll'!V155)","v":""},{"$f":"IF(AND('PJ - PAll'!$C155=\"\",'PJ - PAll'!$D155=\"\"),\"\",'PJ - PAll'!B155)","v":""},{"$f":"IF('PJ - PAll'!C155=\"\",\"\",'PJ - PAll'!C155)","v":""},{"$f":"IF('PJ - PAll'!D155=\"\",\"\",'PJ - PAll'!D155)","v":""},{"$f":"IF('PJ - PAll'!H155=\"\",\"\",'PJ - PAll'!H155)","v":""},{"$f":"IF('PJ - PAll'!M155=\"\",\"\",'PJ - PAll'!M155)","v":""},null,{"$f":"IF('PJ - PAll'!O155=\"\",\"\",'PJ - PAll'!O155)","v":""}]
[null,{"$f":"IF(AND('PJ - PAll'!$C156=\"\",'PJ - PAll'!$D156=\"\"),\"\",'PJ - PAll'!V156)","v":""},{"$f":"IF(AND('PJ - PAll'!$C156=\"\",'PJ - PAll'!$D156=\"\"),\"\",'PJ - PAll'!B156)","v":""},{"$f":"IF('PJ - PAll'!C156=\"\",\"\",'PJ - PAll'!C156)","v":""},{"$f":"IF('PJ - PAll'!D156=\"\",\"\",'PJ - PAll'!D156)","v":""},{"$f":"IF('PJ - PAll'!H156=\"\",\"\",'PJ - PAll'!H156)","v":""},{"$f":"IF('PJ - PAll'!M156=\"\",\"\",'PJ - PAll'!M156)","v":""},null,{"$f":"IF('PJ - PAll'!O156=\"\",\"\",'PJ - PAll'!O156)","v":""}]
[null,{"$f":"IF(AND('PJ - PAll'!$C157=\"\",'PJ - PAll'!$D157=\"\"),\"\",'PJ - PAll'!V157)","v":""},{"$f":"IF(AND('PJ - PAll'!$C157=\"\",'PJ - PAll'!$D157=\"\"),\"\",'PJ - PAll'!B157)","v":""},{"$f":"IF('PJ - PAll'!C157=\"\",\"\",'PJ - PAll'!C157)","v":""},{"$f":"IF('PJ - PAll'!D157=\"\",\"\",'PJ - PAll'!D157)","v":""},{"$f":"IF('PJ - PAll'!H157=\"\",\"\",'PJ - PAll'!H157)","v":""},{"$f":"IF('PJ - PAll'!M157=\"\",\"\",'PJ - PAll'!M157)","v":""},null,{"$f":"IF('PJ - PAll'!O157=\"\",\"\",'PJ - PAll'!O157)","v":""}]
[null,{"$f":"IF(AND('PJ - PAll'!$C158=\"\",'PJ - PAll'!$D158=\"\"),\"\",'PJ - PAll'!V158)","v":""},{"$f":"IF(AND('PJ - PAll'!$C158=\"\",'PJ - PAll'!$D158=\"\"),\"\",'PJ - PAll'!B158)","v":""},{"$f":"IF('PJ - PAll'!C158=\"\",\"\",'PJ - PAll'!C158)","v":""},{"$f":"IF('PJ - PAll'!D158=\"\",\"\",'PJ - PAll'!D158)","v":""},{"$f":"IF('PJ - PAll'!H158=\"\",\"\",'PJ - PAll'!H158)","v":""},{"$f":"IF('PJ - PAll'!M158=\"\",\"\",'PJ - PAll'!M158)","v":""},null,{"$f":"IF('PJ - PAll'!O158=\"\",\"\",'PJ - PAll'!O158)","v":""}]
[null,{"$f":"IF(AND('PJ - PAll'!$C159=\"\",'PJ - PAll'!$D159=\"\"),\"\",'PJ - PAll'!V159)","v":""},{"$f":"IF(AND('PJ - PAll'!$C159=\"\",'PJ - PAll'!$D159=\"\"),\"\",'PJ - PAll'!B159)","v":""},{"$f":"IF('PJ - PAll'!C159=\"\",\"\",'PJ - PAll'!C159)","v":""},{"$f":"IF('PJ - PAll'!D159=\"\",\"\",'PJ - PAll'!D159)","v":""},{"$f":"IF('PJ - PAll'!H159=\"\",\"\",'PJ - PAll'!H159)","v":""},{"$f":"IF('PJ - PAll'!M159=\"\",\"\",'PJ - PAll'!M159)","v":""},null,{"$f":"IF('PJ - PAll'!O159=\"\",\"\",'PJ - PAll'!O159)","v":""}]
[null,{"$f":"IF(AND('PJ - PAll'!$C160=\"\",'PJ - PAll'!$D160=\"\"),\"\",'PJ - PAll'!V160)","v":""},{"$f":"IF(AND('PJ - PAll'!$C160=\"\",'PJ - PAll'!$D160=\"\"),\"\",'PJ - PAll'!B160)","v":""},{"$f":"IF('PJ - PAll'!C160=\"\",\"\",'PJ - PAll'!C160)","v":""},{"$f":"IF('PJ - PAll'!D160=\"\",\"\",'PJ - PAll'!D160)","v":""},{"$f":"IF('PJ - PAll'!H160=\"\",\"\",'PJ - PAll'!H160)","v":""},{"$f":"IF('PJ - PAll'!M160=\"\",\"\",'PJ - PAll'!M160)","v":""},null,{"$f":"IF('PJ - PAll'!O160=\"\",\"\",'PJ - PAll'!O160)","v":""}]
[null,{"$f":"IF(AND('PJ - PAll'!$C161=\"\",'PJ - PAll'!$D161=\"\"),\"\",'PJ - PAll'!V161)","v":""},{"$f":"IF(AND('PJ - PAll'!$C161=\"\",'PJ - PAll'!$D161=\"\"),\"\",'PJ - PAll'!B161)","v":""},{"$f":"IF('PJ - PAll'!C161=\"\",\"\",'PJ - PAll'!C161)","v":""},{"$f":"IF('PJ - PAll'!D161=\"\",\"\",'PJ - PAll'!D161)","v":""},{"$f":"IF('PJ - PAll'!H161=\"\",\"\",'PJ - PAll'!H161)","v":""},{"$f":"IF('PJ - PAll'!M161=\"\",\"\",'PJ - PAll'!M161)","v":""},null,{"$f":"IF('PJ - PAll'!O161=\"\",\"\",'PJ - PAll'!O161)","v":""}]
[null,{"$f":"IF(AND('PJ - PAll'!$C162=\"\",'PJ - PAll'!$D162=\"\"),\"\",'PJ - PAll'!V162)","v":""},{"$f":"IF(AND('PJ - PAll'!$C162=\"\",'PJ - PAll'!$D162=\"\"),\"\",'PJ - PAll'!B162)","v":""},{"$f":"IF('PJ - PAll'!C162=\"\",\"\",'PJ - PAll'!C162)","v":""},{"$f":"IF('PJ - PAll'!D162=\"\",\"\",'PJ - PAll'!D162)","v":""},{"$f":"IF('PJ - PAll'!H162=\"\",\"\",'PJ - PAll'!H162)","v":""},{"$f":"IF('PJ - PAll'!M162=\"\",\"\",'PJ - PAll'!M162)","v":""},null,{"$f":"IF('PJ - PAll'!O162=\"\",\"\",'PJ - PAll'!O162)","v":""}]
[null,{"$f":"IF(AND('PJ - PAll'!$C163=\"\",'PJ - PAll'!$D163=\"\"),\"\",'PJ - PAll'!V163)","v":""},{"$f":"IF(AND('PJ - PAll'!$C163=\"\",'PJ - PAll'!$D163=\"\"),\"\",'PJ - PAll'!B163)","v":""},{"$f":"IF('PJ - PAll'!C163=\"\",\"\",'PJ - PAll'!C163)","v":""},{"$f":"IF('PJ - PAll'!D163=\"\",\"\",'PJ - PAll'!D163)","v":""},{"$f":"IF('PJ - PAll'!H163=\"\",\"\",'PJ - PAll'!H163)","v":""},{"$f":"IF('PJ - PAll'!M163=\"\",\"\",'PJ - PAll'!M163)","v":""},null,{"$f":"IF('PJ - PAll'!O163=\"\",\"\",'PJ - PAll'!O163)","v":""}]
[null,{"$f":"IF(AND('PJ - PAll'!$C164=\"\",'PJ - PAll'!$D164=\"\"),\"\",'PJ - PAll'!V164)","v":""},{"$f":"IF(AND('PJ - PAll'!$C164=\"\",'PJ - PAll'!$D164=\"\"),\"\",'PJ - PAll'!B164)","v":""},{"$f":"IF('PJ - PAll'!C164=\"\",\"\",'PJ - PAll'!C164)","v":""},{"$f":"IF('PJ - PAll'!D164=\"\",\"\",'PJ - PAll'!D164)","v":""},{"$f":"IF('PJ - PAll'!H164=\"\",\"\",'PJ - PAll'!H164)","v":""},{"$f":"IF('PJ - PAll'!M164=\"\",\"\",'PJ - PAll'!M164)","v":""},null,{"$f":"IF('PJ - PAll'!O164=\"\",\"\",'PJ - PAll'!O164)","v":""}]
[null,{"$f":"IF(AND('PJ - PAll'!$C165=\"\",'PJ - PAll'!$D165=\"\"),\"\",'PJ - PAll'!V165)","v":""},{"$f":"IF(AND('PJ - PAll'!$C165=\"\",'PJ - PAll'!$D165=\"\"),\"\",'PJ - PAll'!B165)","v":""},{"$f":"IF('PJ - PAll'!C165=\"\",\"\",'PJ - PAll'!C165)","v":""},{"$f":"IF('PJ - PAll'!D165=\"\",\"\",'PJ - PAll'!D165)","v":""},{"$f":"IF('PJ - PAll'!H165=\"\",\"\",'PJ - PAll'!H165)","v":""},{"$f":"IF('PJ - PAll'!M165=\"\",\"\",'PJ - PAll'!M165)","v":""},null,{"$f":"IF('PJ - PAll'!O165=\"\",\"\",'PJ - PAll'!O165)","v":""}]
[null,{"$f":"IF(AND('PJ - PAll'!$C166=\"\",'PJ - PAll'!$D166=\"\"),\"\",'PJ - PAll'!V166)","v":""},{"$f":"IF(AND('PJ - PAll'!$C166=\"\",'PJ - PAll'!$D166=\"\"),\"\",'PJ - PAll'!B166)","v":""},{"$f":"IF('PJ - PAll'!C166=\"\",\"\",'PJ - PAll'!C166)","v":""},{"$f":"IF('PJ - PAll'!D166=\"\",\"\",'PJ - PAll'!D166)","v":""},{"$f":"IF('PJ - PAll'!H166=\"\",\"\",'PJ - PAll'!H166)","v":""},{"$f":"IF('PJ - PAll'!M166=\"\",\"\",'PJ - PAll'!M166)","v":""},null,{"$f":"IF('PJ - PAll'!O166=\"\",\"\",'PJ - PAll'!O166)","v":""}]
[null,{"$f":"IF(AND('PJ - PAll'!$C167=\"\",'PJ - PAll'!$D167=\"\"),\"\",'PJ - PAll'!V167)","v":""},{"$f":"IF(AND('PJ - PAll'!$C167=\"\",'PJ - PAll'!$D167=\"\"),\"\",'PJ - PAll'!B167)","v":""},{"$f":"IF('PJ - PAll'!C167=\"\",\"\",'PJ - PAll'!C167)","v":""},{"$f":"IF('PJ - PAll'!D167=\"\",\"\",'PJ - PAll'!D167)","v":""},{"$f":"IF('PJ - PAll'!H167=\"\",\"\",'PJ - PAll'!H167)","v":""},{"$f":"IF('PJ - PAll'!M167=\"\",\"\",'PJ - PAll'!M167)","v":""},null,{"$f":"IF('PJ - PAll'!O167=\"\",\"\",'PJ - PAll'!O167)","v":""}]
[null,{"$f":"IF(AND('PJ - PAll'!$C168=\"\",'PJ - PAll'!$D168=\"\"),\"\",'PJ - PAll'!V168)","v":""},{"$f":"IF(AND('PJ - PAll'!$C168=\"\",'PJ - PAll'!$D168=\"\"),\"\",'PJ - PAll'!B168)","v":""},{"$f":"IF('PJ - PAll'!C168=\"\",\"\",'PJ - PAll'!C168)","v":""},{"$f":"IF('PJ - PAll'!D168=\"\",\"\",'PJ - PAll'!D168)","v":""},{"$f":"IF('PJ - PAll'!H168=\"\",\"\",'PJ - PAll'!H168)","v":""},{"$f":"IF('PJ - PAll'!M168=\"\",\"\",'PJ - PAll'!M168)","v":""},null,{"$f":"IF('PJ - PAll'!O168=\"\",\"\",'PJ - PAll'!O168)","v":""}]
[null,{"$f":"IF(AND('PJ - PAll'!$C169=\"\",'PJ - PAll'!$D169=\"\"),\"\",'PJ - PAll'!V169)","v":""},{"$f":"IF(AND('PJ - PAll'!$C169=\"\",'PJ - PAll'!$D169=\"\"),\"\",'PJ - PAll'!B169)","v":""},{"$f":"IF('PJ - PAll'!C169=\"\",\"\",'PJ - PAll'!C169)","v":""},{"$f":"IF('PJ - PAll'!D169=\"\",\"\",'PJ - PAll'!D169)","v":""},{"$f":"IF('PJ - PAll'!H169=\"\",\"\",'PJ - PAll'!H169)","v":""},{"$f":"IF('PJ - PAll'!M169=\"\",\"\",'PJ - PAll'!M169)","v":""},null,{"$f":"IF('PJ - PAll'!O169=\"\",\"\",'PJ - PAll'!O169)","v":""}]
[null,{"$f":"IF(AND('PJ - PAll'!$C170=\"\",'PJ - PAll'!$D170=\"\"),\"\",'PJ - PAll'!V170)","v":""},{"$f":"IF(AND('PJ - PAll'!$C170=\"\",'PJ - PAll'!$D170=\"\"),\"\",'PJ - PAll'!B170)","v":""},{"$f":"IF('PJ - PAll'!C170=\"\",\"\",'PJ - PAll'!C170)","v":""},{"$f":"IF('PJ - PAll'!D170=\"\",\"\",'PJ - PAll'!D170)","v":""},{"$f":"IF('PJ - PAll'!H170=\"\",\"\",'PJ - PAll'!H170)","v":""},{"$f":"IF('PJ - PAll'!M170=\"\",\"\",'PJ - PAll'!M170)","v":""},null,{"$f":"IF('PJ - PAll'!O170=\"\",\"\",'PJ - PAll'!O170)","v":""}]
[null,{"$f":"IF(AND('PJ - PAll'!$C171=\"\",'PJ - PAll'!$D171=\"\"),\"\",'PJ - PAll'!V171)","v":""},{"$f":"IF(AND('PJ - PAll'!$C171=\"\",'PJ - PAll'!$D171=\"\"),\"\",'PJ - PAll'!B171)","v":""},{"$f":"IF('PJ - PAll'!C171=\"\",\"\",'PJ - PAll'!C171)","v":""},{"$f":"IF('PJ - PAll'!D171=\"\",\"\",'PJ - PAll'!D171)","v":""},{"$f":"IF('PJ - PAll'!H171=\"\",\"\",'PJ - PAll'!H171)","v":""},{"$f":"IF('PJ - PAll'!M171=\"\",\"\",'PJ - PAll'!M171)","v":""},null,{"$f":"IF('PJ - PAll'!O171=\"\",\"\",'PJ - PAll'!O171)","v":""}]
[null,{"$f":"IF(AND('PJ - PAll'!$C172=\"\",'PJ - PAll'!$D172=\"\"),\"\",'PJ - PAll'!V172)","v":""},{"$f":"IF(AND('PJ - PAll'!$C172=\"\",'PJ - PAll'!$D172=\"\"),\"\",'PJ - PAll'!B172)","v":""},{"$f":"IF('PJ - PAll'!C172=\"\",\"\",'PJ - PAll'!C172)","v":""},{"$f":"IF('PJ - PAll'!D172=\"\",\"\",'PJ - PAll'!D172)","v":""},{"$f":"IF('PJ - PAll'!H172=\"\",\"\",'PJ - PAll'!H172)","v":""},{"$f":"IF('PJ - PAll'!M172=\"\",\"\",'PJ - PAll'!M172)","v":""},null,{"$f":"IF('PJ - PAll'!O172=\"\",\"\",'PJ - PAll'!O172)","v":""}]
[null,{"$f":"IF(AND('PJ - PAll'!$C173=\"\",'PJ - PAll'!$D173=\"\"),\"\",'PJ - PAll'!V173)","v":""},{"$f":"IF(AND('PJ - PAll'!$C173=\"\",'PJ - PAll'!$D173=\"\"),\"\",'PJ - PAll'!B173)","v":""},{"$f":"IF('PJ - PAll'!C173=\"\",\"\",'PJ - PAll'!C173)","v":""},{"$f":"IF('PJ - PAll'!D173=\"\",\"\",'PJ - PAll'!D173)","v":""},{"$f":"IF('PJ - PAll'!H173=\"\",\"\",'PJ - PAll'!H173)","v":""},{"$f":"IF('PJ - PAll'!M173=\"\",\"\",'PJ - PAll'!M173)","v":""},null,{"$f":"IF('PJ - PAll'!O173=\"\",\"\",'PJ - PAll'!O173)","v":""}]
[null,{"$f":"IF(AND('PJ - PAll'!$C174=\"\",'PJ - PAll'!$D174=\"\"),\"\",'PJ - PAll'!V174)","v":""},{"$f":"IF(AND('PJ - PAll'!$C174=\"\",'PJ - PAll'!$D174=\"\"),\"\",'PJ - PAll'!B174)","v":""},{"$f":"IF('PJ - PAll'!C174=\"\",\"\",'PJ - PAll'!C174)","v":""},{"$f":"IF('PJ - PAll'!D174=\"\",\"\",'PJ - PAll'!D174)","v":""},{"$f":"IF('PJ - PAll'!H174=\"\",\"\",'PJ - PAll'!H174)","v":""},{"$f":"IF('PJ - PAll'!M174=\"\",\"\",'PJ - PAll'!M174)","v":""},null,{"$f":"IF('PJ - PAll'!O174=\"\",\"\",'PJ - PAll'!O174)","v":""}]
[null,{"$f":"IF(AND('PJ - PAll'!$C175=\"\",'PJ - PAll'!$D175=\"\"),\"\",'PJ - PAll'!V175)","v":""},{"$f":"IF(AND('PJ - PAll'!$C175=\"\",'PJ - PAll'!$D175=\"\"),\"\",'PJ - PAll'!B175)","v":""},{"$f":"IF('PJ - PAll'!C175=\"\",\"\",'PJ - PAll'!C175)","v":""},{"$f":"IF('PJ - PAll'!D175=\"\",\"\",'PJ - PAll'!D175)","v":""},{"$f":"IF('PJ - PAll'!H175=\"\",\"\",'PJ - PAll'!H175)","v":""},{"$f":"IF('PJ - PAll'!M175=\"\",\"\",'PJ - PAll'!M175)","v":""},null,{"$f":"IF('PJ - PAll'!O175=\"\",\"\",'PJ - PAll'!O175)","v":""}]
[null,{"$f":"IF(AND('PJ - PAll'!$C176=\"\",'PJ - PAll'!$D176=\"\"),\"\",'PJ - PAll'!V176)","v":""},{"$f":"IF(AND('PJ - PAll'!$C176=\"\",'PJ - PAll'!$D176=\"\"),\"\",'PJ - PAll'!B176)","v":""},{"$f":"IF('PJ - PAll'!C176=\"\",\"\",'PJ - PAll'!C176)","v":""},{"$f":"IF('PJ - PAll'!D176=\"\",\"\",'PJ - PAll'!D176)","v":""},{"$f":"IF('PJ - PAll'!H176=\"\",\"\",'PJ - PAll'!H176)","v":""},{"$f":"IF('PJ - PAll'!M176=\"\",\"\",'PJ - PAll'!M176)","v":""},null,{"$f":"IF('PJ - PAll'!O176=\"\",\"\",'PJ - PAll'!O176)","v":""}]
[null,{"$f":"IF(AND('PJ - PAll'!$C177=\"\",'PJ - PAll'!$D177=\"\"),\"\",'PJ - PAll'!V177)","v":""},{"$f":"IF(AND('PJ - PAll'!$C177=\"\",'PJ - PAll'!$D177=\"\"),\"\",'PJ - PAll'!B177)","v":""},{"$f":"IF('PJ - PAll'!C177=\"\",\"\",'PJ - PAll'!C177)","v":""},{"$f":"IF('PJ - PAll'!D177=\"\",\"\",'PJ - PAll'!D177)","v":""},{"$f":"IF('PJ - PAll'!H177=\"\",\"\",'PJ - PAll'!H177)","v":""},{"$f":"IF('PJ - PAll'!M177=\"\",\"\",'PJ - PAll'!M177)","v":""},null,{"$f":"IF('PJ - PAll'!O177=\"\",\"\",'PJ - PAll'!O177)","v":""}]
[null,{"$f":"IF(AND('PJ - PAll'!$C178=\"\",'PJ - PAll'!$D178=\"\"),\"\",'PJ - PAll'!V178)","v":""},{"$f":"IF(AND('PJ - PAll'!$C178=\"\",'PJ - PAll'!$D178=\"\"),\"\",'PJ - PAll'!B178)","v":""},{"$f":"IF('PJ - PAll'!C178=\"\",\"\",'PJ - PAll'!C178)","v":""},{"$f":"IF('PJ - PAll'!D178=\"\",\"\",'PJ - PAll'!D178)","v":""},{"$f":"IF('PJ - PAll'!H178=\"\",\"\",'PJ - PAll'!H178)","v":""},{"$f":"IF('PJ - PAll'!M178=\"\",\"\",'PJ - PAll'!M178)","v":""},null,{"$f":"IF('PJ - PAll'!O178=\"\",\"\",'PJ - PAll'!O178)","v":""}]
[null,{"$f":"IF(AND('PJ - PAll'!$C179=\"\",'PJ - PAll'!$D179=\"\"),\"\",'PJ - PAll'!V179)","v":""},{"$f":"IF(AND('PJ - PAll'!$C179=\"\",'PJ - PAll'!$D179=\"\"),\"\",'PJ - PAll'!B179)","v":""},{"$f":"IF('PJ - PAll'!C179=\"\",\"\",'PJ - PAll'!C179)","v":""},{"$f":"IF('PJ - PAll'!D179=\"\",\"\",'PJ - PAll'!D179)","v":""},{"$f":"IF('PJ - PAll'!H179=\"\",\"\",'PJ - PAll'!H179)","v":""},{"$f":"IF('PJ - PAll'!M179=\"\",\"\",'PJ - PAll'!M179)","v":""},null,{"$f":"IF('PJ - PAll'!O179=\"\",\"\",'PJ - PAll'!O179)","v":""}]
[null,{"$f":"IF(AND('PJ - PAll'!$C180=\"\",'PJ - PAll'!$D180=\"\"),\"\",'PJ - PAll'!V180)","v":""},{"$f":"IF(AND('PJ - PAll'!$C180=\"\",'PJ - PAll'!$D180=\"\"),\"\",'PJ - PAll'!B180)","v":""},{"$f":"IF('PJ - PAll'!C180=\"\",\"\",'PJ - PAll'!C180)","v":""},{"$f":"IF('PJ - PAll'!D180=\"\",\"\",'PJ - PAll'!D180)","v":""},{"$f":"IF('PJ - PAll'!H180=\"\",\"\",'PJ - PAll'!H180)","v":""},{"$f":"IF('PJ - PAll'!M180=\"\",\"\",'PJ - PAll'!M180)","v":""},null,{"$f":"IF('PJ - PAll'!O180=\"\",\"\",'PJ - PAll'!O180)","v":""}]
[null,{"$f":"B173","v":"Běh na 100m s přek. - Pořadí jednotlivců - All"}]
[]
[null,{"$f":"$B$3","v":"Krajské kolo dorostu"},null,null,{"$f":"$E$3","v":"18.06.2022 Pardubice"}]
[]
[null,{"$f":"Start!$D$5","v":"dorostenky"}]
[null,"Pořadí","Start. číslo","Jméno","kolektiv","čas             I. pokusu","čas            II. pokusu",null,"Výsledný čas"]
[]
[null,{"$f":"IF(AND('PJ - PAll'!$C181=\"\",'PJ - PAll'!$D181=\"\"),\"\",'PJ - PAll'!V181)","v":""},{"$f":"IF(AND('PJ - PAll'!$C181=\"\",'PJ - PAll'!$D181=\"\"),\"\",'PJ - PAll'!B181)","v":""},{"$f":"IF('PJ - PAll'!C181=\"\",\"\",'PJ - PAll'!C181)","v":""},{"$f":"IF('PJ - PAll'!D181=\"\",\"\",'PJ - PAll'!D181)","v":""},{"$f":"IF('PJ - PAll'!H181=\"\",\"\",'PJ - PAll'!H181)","v":""},{"$f":"IF('PJ - PAll'!M181=\"\",\"\",'PJ - PAll'!M181)","v":""},null,{"$f":"IF('PJ - PAll'!O181=\"\",\"\",'PJ - PAll'!O181)","v":""}]
[null,{"$f":"IF(AND('PJ - PAll'!$C182=\"\",'PJ - PAll'!$D182=\"\"),\"\",'PJ - PAll'!V182)","v":""},{"$f":"IF(AND('PJ - PAll'!$C182=\"\",'PJ - PAll'!$D182=\"\"),\"\",'PJ - PAll'!B182)","v":""},{"$f":"IF('PJ - PAll'!C182=\"\",\"\",'PJ - PAll'!C182)","v":""},{"$f":"IF('PJ - PAll'!D182=\"\",\"\",'PJ - PAll'!D182)","v":""},{"$f":"IF('PJ - PAll'!H182=\"\",\"\",'PJ - PAll'!H182)","v":""},{"$f":"IF('PJ - PAll'!M182=\"\",\"\",'PJ - PAll'!M182)","v":""},null,{"$f":"IF('PJ - PAll'!O182=\"\",\"\",'PJ - PAll'!O182)","v":""}]
[null,{"$f":"IF(AND('PJ - PAll'!$C183=\"\",'PJ - PAll'!$D183=\"\"),\"\",'PJ - PAll'!V183)","v":""},{"$f":"IF(AND('PJ - PAll'!$C183=\"\",'PJ - PAll'!$D183=\"\"),\"\",'PJ - PAll'!B183)","v":""},{"$f":"IF('PJ - PAll'!C183=\"\",\"\",'PJ - PAll'!C183)","v":""},{"$f":"IF('PJ - PAll'!D183=\"\",\"\",'PJ - PAll'!D183)","v":""},{"$f":"IF('PJ - PAll'!H183=\"\",\"\",'PJ - PAll'!H183)","v":""},{"$f":"IF('PJ - PAll'!M183=\"\",\"\",'PJ - PAll'!M183)","v":""},null,{"$f":"IF('PJ - PAll'!O183=\"\",\"\",'PJ - PAll'!O183)","v":""}]
[null,{"$f":"IF(AND('PJ - PAll'!$C184=\"\",'PJ - PAll'!$D184=\"\"),\"\",'PJ - PAll'!V184)","v":""},{"$f":"IF(AND('PJ - PAll'!$C184=\"\",'PJ - PAll'!$D184=\"\"),\"\",'PJ - PAll'!B184)","v":""},{"$f":"IF('PJ - PAll'!C184=\"\",\"\",'PJ - PAll'!C184)","v":""},{"$f":"IF('PJ - PAll'!D184=\"\",\"\",'PJ - PAll'!D184)","v":""},{"$f":"IF('PJ - PAll'!H184=\"\",\"\",'PJ - PAll'!H184)","v":""},{"$f":"IF('PJ - PAll'!M184=\"\",\"\",'PJ - PAll'!M184)","v":""},null,{"$f":"IF('PJ - PAll'!O184=\"\",\"\",'PJ - PAll'!O184)","v":""}]
[null,{"$f":"IF(AND('PJ - PAll'!$C185=\"\",'PJ - PAll'!$D185=\"\"),\"\",'PJ - PAll'!V185)","v":""},{"$f":"IF(AND('PJ - PAll'!$C185=\"\",'PJ - PAll'!$D185=\"\"),\"\",'PJ - PAll'!B185)","v":""},{"$f":"IF('PJ - PAll'!C185=\"\",\"\",'PJ - PAll'!C185)","v":""},{"$f":"IF('PJ - PAll'!D185=\"\",\"\",'PJ - PAll'!D185)","v":""},{"$f":"IF('PJ - PAll'!H185=\"\",\"\",'PJ - PAll'!H185)","v":""},{"$f":"IF('PJ - PAll'!M185=\"\",\"\",'PJ - PAll'!M185)","v":""},null,{"$f":"IF('PJ - PAll'!O185=\"\",\"\",'PJ - PAll'!O185)","v":""}]
[null,{"$f":"IF(AND('PJ - PAll'!$C186=\"\",'PJ - PAll'!$D186=\"\"),\"\",'PJ - PAll'!V186)","v":""},{"$f":"IF(AND('PJ - PAll'!$C186=\"\",'PJ - PAll'!$D186=\"\"),\"\",'PJ - PAll'!B186)","v":""},{"$f":"IF('PJ - PAll'!C186=\"\",\"\",'PJ - PAll'!C186)","v":""},{"$f":"IF('PJ - PAll'!D186=\"\",\"\",'PJ - PAll'!D186)","v":""},{"$f":"IF('PJ - PAll'!H186=\"\",\"\",'PJ - PAll'!H186)","v":""},{"$f":"IF('PJ - PAll'!M186=\"\",\"\",'PJ - PAll'!M186)","v":""},null,{"$f":"IF('PJ - PAll'!O186=\"\",\"\",'PJ - PAll'!O186)","v":""}]
[null,{"$f":"IF(AND('PJ - PAll'!$C187=\"\",'PJ - PAll'!$D187=\"\"),\"\",'PJ - PAll'!V187)","v":""},{"$f":"IF(AND('PJ - PAll'!$C187=\"\",'PJ - PAll'!$D187=\"\"),\"\",'PJ - PAll'!B187)","v":""},{"$f":"IF('PJ - PAll'!C187=\"\",\"\",'PJ - PAll'!C187)","v":""},{"$f":"IF('PJ - PAll'!D187=\"\",\"\",'PJ - PAll'!D187)","v":""},{"$f":"IF('PJ - PAll'!H187=\"\",\"\",'PJ - PAll'!H187)","v":""},{"$f":"IF('PJ - PAll'!M187=\"\",\"\",'PJ - PAll'!M187)","v":""},null,{"$f":"IF('PJ - PAll'!O187=\"\",\"\",'PJ - PAll'!O187)","v":""}]
[null,{"$f":"IF(AND('PJ - PAll'!$C188=\"\",'PJ - PAll'!$D188=\"\"),\"\",'PJ - PAll'!V188)","v":""},{"$f":"IF(AND('PJ - PAll'!$C188=\"\",'PJ - PAll'!$D188=\"\"),\"\",'PJ - PAll'!B188)","v":""},{"$f":"IF('PJ - PAll'!C188=\"\",\"\",'PJ - PAll'!C188)","v":""},{"$f":"IF('PJ - PAll'!D188=\"\",\"\",'PJ - PAll'!D188)","v":""},{"$f":"IF('PJ - PAll'!H188=\"\",\"\",'PJ - PAll'!H188)","v":""},{"$f":"IF('PJ - PAll'!M188=\"\",\"\",'PJ - PAll'!M188)","v":""},null,{"$f":"IF('PJ - PAll'!O188=\"\",\"\",'PJ - PAll'!O188)","v":""}]
[null,{"$f":"IF(AND('PJ - PAll'!$C189=\"\",'PJ - PAll'!$D189=\"\"),\"\",'PJ - PAll'!V189)","v":""},{"$f":"IF(AND('PJ - PAll'!$C189=\"\",'PJ - PAll'!$D189=\"\"),\"\",'PJ - PAll'!B189)","v":""},{"$f":"IF('PJ - PAll'!C189=\"\",\"\",'PJ - PAll'!C189)","v":""},{"$f":"IF('PJ - PAll'!D189=\"\",\"\",'PJ - PAll'!D189)","v":""},{"$f":"IF('PJ - PAll'!H189=\"\",\"\",'PJ - PAll'!H189)","v":""},{"$f":"IF('PJ - PAll'!M189=\"\",\"\",'PJ - PAll'!M189)","v":""},null,{"$f":"IF('PJ - PAll'!O189=\"\",\"\",'PJ - PAll'!O189)","v":""}]
[null,{"$f":"IF(AND('PJ - PAll'!$C190=\"\",'PJ - PAll'!$D190=\"\"),\"\",'PJ - PAll'!V190)","v":""},{"$f":"IF(AND('PJ - PAll'!$C190=\"\",'PJ - PAll'!$D190=\"\"),\"\",'PJ - PAll'!B190)","v":""},{"$f":"IF('PJ - PAll'!C190=\"\",\"\",'PJ - PAll'!C190)","v":""},{"$f":"IF('PJ - PAll'!D190=\"\",\"\",'PJ - PAll'!D190)","v":""},{"$f":"IF('PJ - PAll'!H190=\"\",\"\",'PJ - PAll'!H190)","v":""},{"$f":"IF('PJ - PAll'!M190=\"\",\"\",'PJ - PAll'!M190)","v":""},null,{"$f":"IF('PJ - PAll'!O190=\"\",\"\",'PJ - PAll'!O190)","v":""}]
[null,{"$f":"IF(AND('PJ - PAll'!$C191=\"\",'PJ - PAll'!$D191=\"\"),\"\",'PJ - PAll'!V191)","v":""},{"$f":"IF(AND('PJ - PAll'!$C191=\"\",'PJ - PAll'!$D191=\"\"),\"\",'PJ - PAll'!B191)","v":""},{"$f":"IF('PJ - PAll'!C191=\"\",\"\",'PJ - PAll'!C191)","v":""},{"$f":"IF('PJ - PAll'!D191=\"\",\"\",'PJ - PAll'!D191)","v":""},{"$f":"IF('PJ - PAll'!H191=\"\",\"\",'PJ - PAll'!H191)","v":""},{"$f":"IF('PJ - PAll'!M191=\"\",\"\",'PJ - PAll'!M191)","v":""},null,{"$f":"IF('PJ - PAll'!O191=\"\",\"\",'PJ - PAll'!O191)","v":""}]
[null,{"$f":"IF(AND('PJ - PAll'!$C192=\"\",'PJ - PAll'!$D192=\"\"),\"\",'PJ - PAll'!V192)","v":""},{"$f":"IF(AND('PJ - PAll'!$C192=\"\",'PJ - PAll'!$D192=\"\"),\"\",'PJ - PAll'!B192)","v":""},{"$f":"IF('PJ - PAll'!C192=\"\",\"\",'PJ - PAll'!C192)","v":""},{"$f":"IF('PJ - PAll'!D192=\"\",\"\",'PJ - PAll'!D192)","v":""},{"$f":"IF('PJ - PAll'!H192=\"\",\"\",'PJ - PAll'!H192)","v":""},{"$f":"IF('PJ - PAll'!M192=\"\",\"\",'PJ - PAll'!M192)","v":""},null,{"$f":"IF('PJ - PAll'!O192=\"\",\"\",'PJ - PAll'!O192)","v":""}]
[null,{"$f":"IF(AND('PJ - PAll'!$C193=\"\",'PJ - PAll'!$D193=\"\"),\"\",'PJ - PAll'!V193)","v":""},{"$f":"IF(AND('PJ - PAll'!$C193=\"\",'PJ - PAll'!$D193=\"\"),\"\",'PJ - PAll'!B193)","v":""},{"$f":"IF('PJ - PAll'!C193=\"\",\"\",'PJ - PAll'!C193)","v":""},{"$f":"IF('PJ - PAll'!D193=\"\",\"\",'PJ - PAll'!D193)","v":""},{"$f":"IF('PJ - PAll'!H193=\"\",\"\",'PJ - PAll'!H193)","v":""},{"$f":"IF('PJ - PAll'!M193=\"\",\"\",'PJ - PAll'!M193)","v":""},null,{"$f":"IF('PJ - PAll'!O193=\"\",\"\",'PJ - PAll'!O193)","v":""}]
[null,{"$f":"IF(AND('PJ - PAll'!$C194=\"\",'PJ - PAll'!$D194=\"\"),\"\",'PJ - PAll'!V194)","v":""},{"$f":"IF(AND('PJ - PAll'!$C194=\"\",'PJ - PAll'!$D194=\"\"),\"\",'PJ - PAll'!B194)","v":""},{"$f":"IF('PJ - PAll'!C194=\"\",\"\",'PJ - PAll'!C194)","v":""},{"$f":"IF('PJ - PAll'!D194=\"\",\"\",'PJ - PAll'!D194)","v":""},{"$f":"IF('PJ - PAll'!H194=\"\",\"\",'PJ - PAll'!H194)","v":""},{"$f":"IF('PJ - PAll'!M194=\"\",\"\",'PJ - PAll'!M194)","v":""},null,{"$f":"IF('PJ - PAll'!O194=\"\",\"\",'PJ - PAll'!O194)","v":""}]
[null,{"$f":"IF(AND('PJ - PAll'!$C195=\"\",'PJ - PAll'!$D195=\"\"),\"\",'PJ - PAll'!V195)","v":""},{"$f":"IF(AND('PJ - PAll'!$C195=\"\",'PJ - PAll'!$D195=\"\"),\"\",'PJ - PAll'!B195)","v":""},{"$f":"IF('PJ - PAll'!C195=\"\",\"\",'PJ - PAll'!C195)","v":""},{"$f":"IF('PJ - PAll'!D195=\"\",\"\",'PJ - PAll'!D195)","v":""},{"$f":"IF('PJ - PAll'!H195=\"\",\"\",'PJ - PAll'!H195)","v":""},{"$f":"IF('PJ - PAll'!M195=\"\",\"\",'PJ - PAll'!M195)","v":""},null,{"$f":"IF('PJ - PAll'!O195=\"\",\"\",'PJ - PAll'!O195)","v":""}]
[null,{"$f":"IF(AND('PJ - PAll'!$C196=\"\",'PJ - PAll'!$D196=\"\"),\"\",'PJ - PAll'!V196)","v":""},{"$f":"IF(AND('PJ - PAll'!$C196=\"\",'PJ - PAll'!$D196=\"\"),\"\",'PJ - PAll'!B196)","v":""},{"$f":"IF('PJ - PAll'!C196=\"\",\"\",'PJ - PAll'!C196)","v":""},{"$f":"IF('PJ - PAll'!D196=\"\",\"\",'PJ - PAll'!D196)","v":""},{"$f":"IF('PJ - PAll'!H196=\"\",\"\",'PJ - PAll'!H196)","v":""},{"$f":"IF('PJ - PAll'!M196=\"\",\"\",'PJ - PAll'!M196)","v":""},null,{"$f":"IF('PJ - PAll'!O196=\"\",\"\",'PJ - PAll'!O196)","v":""}]
[null,{"$f":"IF(AND('PJ - PAll'!$C197=\"\",'PJ - PAll'!$D197=\"\"),\"\",'PJ - PAll'!V197)","v":""},{"$f":"IF(AND('PJ - PAll'!$C197=\"\",'PJ - PAll'!$D197=\"\"),\"\",'PJ - PAll'!B197)","v":""},{"$f":"IF('PJ - PAll'!C197=\"\",\"\",'PJ - PAll'!C197)","v":""},{"$f":"IF('PJ - PAll'!D197=\"\",\"\",'PJ - PAll'!D197)","v":""},{"$f":"IF('PJ - PAll'!H197=\"\",\"\",'PJ - PAll'!H197)","v":""},{"$f":"IF('PJ - PAll'!M197=\"\",\"\",'PJ - PAll'!M197)","v":""},null,{"$f":"IF('PJ - PAll'!O197=\"\",\"\",'PJ - PAll'!O197)","v":""}]
[null,{"$f":"IF(AND('PJ - PAll'!$C198=\"\",'PJ - PAll'!$D198=\"\"),\"\",'PJ - PAll'!V198)","v":""},{"$f":"IF(AND('PJ - PAll'!$C198=\"\",'PJ - PAll'!$D198=\"\"),\"\",'PJ - PAll'!B198)","v":""},{"$f":"IF('PJ - PAll'!C198=\"\",\"\",'PJ - PAll'!C198)","v":""},{"$f":"IF('PJ - PAll'!D198=\"\",\"\",'PJ - PAll'!D198)","v":""},{"$f":"IF('PJ - PAll'!H198=\"\",\"\",'PJ - PAll'!H198)","v":""},{"$f":"IF('PJ - PAll'!M198=\"\",\"\",'PJ - PAll'!M198)","v":""},null,{"$f":"IF('PJ - PAll'!O198=\"\",\"\",'PJ - PAll'!O198)","v":""}]
[null,{"$f":"IF(AND('PJ - PAll'!$C199=\"\",'PJ - PAll'!$D199=\"\"),\"\",'PJ - PAll'!V199)","v":""},{"$f":"IF(AND('PJ - PAll'!$C199=\"\",'PJ - PAll'!$D199=\"\"),\"\",'PJ - PAll'!B199)","v":""},{"$f":"IF('PJ - PAll'!C199=\"\",\"\",'PJ - PAll'!C199)","v":""},{"$f":"IF('PJ - PAll'!D199=\"\",\"\",'PJ - PAll'!D199)","v":""},{"$f":"IF('PJ - PAll'!H199=\"\",\"\",'PJ - PAll'!H199)","v":""},{"$f":"IF('PJ - PAll'!M199=\"\",\"\",'PJ - PAll'!M199)","v":""},null,{"$f":"IF('PJ - PAll'!O199=\"\",\"\",'PJ - PAll'!O199)","v":""}]
[null,{"$f":"IF(AND('PJ - PAll'!$C200=\"\",'PJ - PAll'!$D200=\"\"),\"\",'PJ - PAll'!V200)","v":""},{"$f":"IF(AND('PJ - PAll'!$C200=\"\",'PJ - PAll'!$D200=\"\"),\"\",'PJ - PAll'!B200)","v":""},{"$f":"IF('PJ - PAll'!C200=\"\",\"\",'PJ - PAll'!C200)","v":""},{"$f":"IF('PJ - PAll'!D200=\"\",\"\",'PJ - PAll'!D200)","v":""},{"$f":"IF('PJ - PAll'!H200=\"\",\"\",'PJ - PAll'!H200)","v":""},{"$f":"IF('PJ - PAll'!M200=\"\",\"\",'PJ - PAll'!M200)","v":""},null,{"$f":"IF('PJ - PAll'!O200=\"\",\"\",'PJ - PAll'!O200)","v":""}]
[null,{"$f":"IF(AND('PJ - PAll'!$C201=\"\",'PJ - PAll'!$D201=\"\"),\"\",'PJ - PAll'!V201)","v":""},{"$f":"IF(AND('PJ - PAll'!$C201=\"\",'PJ - PAll'!$D201=\"\"),\"\",'PJ - PAll'!B201)","v":""},{"$f":"IF('PJ - PAll'!C201=\"\",\"\",'PJ - PAll'!C201)","v":""},{"$f":"IF('PJ - PAll'!D201=\"\",\"\",'PJ - PAll'!D201)","v":""},{"$f":"IF('PJ - PAll'!H201=\"\",\"\",'PJ - PAll'!H201)","v":""},{"$f":"IF('PJ - PAll'!M201=\"\",\"\",'PJ - PAll'!M201)","v":""},null,{"$f":"IF('PJ - PAll'!O201=\"\",\"\",'PJ - PAll'!O201)","v":""}]
[null,{"$f":"IF(AND('PJ - PAll'!$C202=\"\",'PJ - PAll'!$D202=\"\"),\"\",'PJ - PAll'!V202)","v":""},{"$f":"IF(AND('PJ - PAll'!$C202=\"\",'PJ - PAll'!$D202=\"\"),\"\",'PJ - PAll'!B202)","v":""},{"$f":"IF('PJ - PAll'!C202=\"\",\"\",'PJ - PAll'!C202)","v":""},{"$f":"IF('PJ - PAll'!D202=\"\",\"\",'PJ - PAll'!D202)","v":""},{"$f":"IF('PJ - PAll'!H202=\"\",\"\",'PJ - PAll'!H202)","v":""},{"$f":"IF('PJ - PAll'!M202=\"\",\"\",'PJ - PAll'!M202)","v":""},null,{"$f":"IF('PJ - PAll'!O202=\"\",\"\",'PJ - PAll'!O202)","v":""}]
[null,{"$f":"IF(AND('PJ - PAll'!$C203=\"\",'PJ - PAll'!$D203=\"\"),\"\",'PJ - PAll'!V203)","v":""},{"$f":"IF(AND('PJ - PAll'!$C203=\"\",'PJ - PAll'!$D203=\"\"),\"\",'PJ - PAll'!B203)","v":""},{"$f":"IF('PJ - PAll'!C203=\"\",\"\",'PJ - PAll'!C203)","v":""},{"$f":"IF('PJ - PAll'!D203=\"\",\"\",'PJ - PAll'!D203)","v":""},{"$f":"IF('PJ - PAll'!H203=\"\",\"\",'PJ - PAll'!H203)","v":""},{"$f":"IF('PJ - PAll'!M203=\"\",\"\",'PJ - PAll'!M203)","v":""},null,{"$f":"IF('PJ - PAll'!O203=\"\",\"\",'PJ - PAll'!O203)","v":""}]
[null,{"$f":"IF(AND('PJ - PAll'!$C204=\"\",'PJ - PAll'!$D204=\"\"),\"\",'PJ - PAll'!V204)","v":""},{"$f":"IF(AND('PJ - PAll'!$C204=\"\",'PJ - PAll'!$D204=\"\"),\"\",'PJ - PAll'!B204)","v":""},{"$f":"IF('PJ - PAll'!C204=\"\",\"\",'PJ - PAll'!C204)","v":""},{"$f":"IF('PJ - PAll'!D204=\"\",\"\",'PJ - PAll'!D204)","v":""},{"$f":"IF('PJ - PAll'!H204=\"\",\"\",'PJ - PAll'!H204)","v":""},{"$f":"IF('PJ - PAll'!M204=\"\",\"\",'PJ - PAll'!M204)","v":""},null,{"$f":"IF('PJ - PAll'!O204=\"\",\"\",'PJ - PAll'!O204)","v":""}]
[null,{"$f":"IF(AND('PJ - PAll'!$C205=\"\",'PJ - PAll'!$D205=\"\"),\"\",'PJ - PAll'!V205)","v":""},{"$f":"IF(AND('PJ - PAll'!$C205=\"\",'PJ - PAll'!$D205=\"\"),\"\",'PJ - PAll'!B205)","v":""},{"$f":"IF('PJ - PAll'!C205=\"\",\"\",'PJ - PAll'!C205)","v":""},{"$f":"IF('PJ - PAll'!D205=\"\",\"\",'PJ - PAll'!D205)","v":""},{"$f":"IF('PJ - PAll'!H205=\"\",\"\",'PJ - PAll'!H205)","v":""},{"$f":"IF('PJ - PAll'!M205=\"\",\"\",'PJ - PAll'!M205)","v":""},null,{"$f":"IF('PJ - PAll'!O205=\"\",\"\",'PJ - PAll'!O205)","v":""}]
[null,{"$f":"IF(AND('PJ - PAll'!$C206=\"\",'PJ - PAll'!$D206=\"\"),\"\",'PJ - PAll'!V206)","v":""},{"$f":"IF(AND('PJ - PAll'!$C206=\"\",'PJ - PAll'!$D206=\"\"),\"\",'PJ - PAll'!B206)","v":""},{"$f":"IF('PJ - PAll'!C206=\"\",\"\",'PJ - PAll'!C206)","v":""},{"$f":"IF('PJ - PAll'!D206=\"\",\"\",'PJ - PAll'!D206)","v":""},{"$f":"IF('PJ - PAll'!H206=\"\",\"\",'PJ - PAll'!H206)","v":""},{"$f":"IF('PJ - PAll'!M206=\"\",\"\",'PJ - PAll'!M206)","v":""},null,{"$f":"IF('PJ - PAll'!O206=\"\",\"\",'PJ - PAll'!O206)","v":""}]
[null,{"$f":"IF(AND('PJ - PAll'!$C207=\"\",'PJ - PAll'!$D207=\"\"),\"\",'PJ - PAll'!V207)","v":""},{"$f":"IF(AND('PJ - PAll'!$C207=\"\",'PJ - PAll'!$D207=\"\"),\"\",'PJ - PAll'!B207)","v":""},{"$f":"IF('PJ - PAll'!C207=\"\",\"\",'PJ - PAll'!C207)","v":""},{"$f":"IF('PJ - PAll'!D207=\"\",\"\",'PJ - PAll'!D207)","v":""},{"$f":"IF('PJ - PAll'!H207=\"\",\"\",'PJ - PAll'!H207)","v":""},{"$f":"IF('PJ - PAll'!M207=\"\",\"\",'PJ - PAll'!M207)","v":""},null,{"$f":"IF('PJ - PAll'!O207=\"\",\"\",'PJ - PAll'!O207)","v":""}]
[null,{"$f":"IF(AND('PJ - PAll'!$C208=\"\",'PJ - PAll'!$D208=\"\"),\"\",'PJ - PAll'!V208)","v":""},{"$f":"IF(AND('PJ - PAll'!$C208=\"\",'PJ - PAll'!$D208=\"\"),\"\",'PJ - PAll'!B208)","v":""},{"$f":"IF('PJ - PAll'!C208=\"\",\"\",'PJ - PAll'!C208)","v":""},{"$f":"IF('PJ - PAll'!D208=\"\",\"\",'PJ - PAll'!D208)","v":""},{"$f":"IF('PJ - PAll'!H208=\"\",\"\",'PJ - PAll'!H208)","v":""},{"$f":"IF('PJ - PAll'!M208=\"\",\"\",'PJ - PAll'!M208)","v":""},null,{"$f":"IF('PJ - PAll'!O208=\"\",\"\",'PJ - PAll'!O208)","v":""}]
[null,{"$f":"IF(AND('PJ - PAll'!$C209=\"\",'PJ - PAll'!$D209=\"\"),\"\",'PJ - PAll'!V209)","v":""},{"$f":"IF(AND('PJ - PAll'!$C209=\"\",'PJ - PAll'!$D209=\"\"),\"\",'PJ - PAll'!B209)","v":""},{"$f":"IF('PJ - PAll'!C209=\"\",\"\",'PJ - PAll'!C209)","v":""},{"$f":"IF('PJ - PAll'!D209=\"\",\"\",'PJ - PAll'!D209)","v":""},{"$f":"IF('PJ - PAll'!H209=\"\",\"\",'PJ - PAll'!H209)","v":""},{"$f":"IF('PJ - PAll'!M209=\"\",\"\",'PJ - PAll'!M209)","v":""},null,{"$f":"IF('PJ - PAll'!O209=\"\",\"\",'PJ - PAll'!O209)","v":""}]
[null,{"$f":"IF(AND('PJ - PAll'!$C210=\"\",'PJ - PAll'!$D210=\"\"),\"\",'PJ - PAll'!V210)","v":""},{"$f":"IF(AND('PJ - PAll'!$C210=\"\",'PJ - PAll'!$D210=\"\"),\"\",'PJ - PAll'!B210)","v":""},{"$f":"IF('PJ - PAll'!C210=\"\",\"\",'PJ - PAll'!C210)","v":""},{"$f":"IF('PJ - PAll'!D210=\"\",\"\",'PJ - PAll'!D210)","v":""},{"$f":"IF('PJ - PAll'!H210=\"\",\"\",'PJ - PAll'!H210)","v":""},{"$f":"IF('PJ - PAll'!M210=\"\",\"\",'PJ - PAll'!M210)","v":""},null,{"$f":"IF('PJ - PAll'!O210=\"\",\"\",'PJ - PAll'!O210)","v":""}]
[null,{"$f":"IF(AND('PJ - PAll'!$C211=\"\",'PJ - PAll'!$D211=\"\"),\"\",'PJ - PAll'!V211)","v":""},{"$f":"IF(AND('PJ - PAll'!$C211=\"\",'PJ - PAll'!$D211=\"\"),\"\",'PJ - PAll'!B211)","v":""},{"$f":"IF('PJ - PAll'!C211=\"\",\"\",'PJ - PAll'!C211)","v":""},{"$f":"IF('PJ - PAll'!D211=\"\",\"\",'PJ - PAll'!D211)","v":""},{"$f":"IF('PJ - PAll'!H211=\"\",\"\",'PJ - PAll'!H211)","v":""},{"$f":"IF('PJ - PAll'!M211=\"\",\"\",'PJ - PAll'!M211)","v":""},null,{"$f":"IF('PJ - PAll'!O211=\"\",\"\",'PJ - PAll'!O211)","v":""}]
[null,{"$f":"IF(AND('PJ - PAll'!$C212=\"\",'PJ - PAll'!$D212=\"\"),\"\",'PJ - PAll'!V212)","v":""},{"$f":"IF(AND('PJ - PAll'!$C212=\"\",'PJ - PAll'!$D212=\"\"),\"\",'PJ - PAll'!B212)","v":""},{"$f":"IF('PJ - PAll'!C212=\"\",\"\",'PJ - PAll'!C212)","v":""},{"$f":"IF('PJ - PAll'!D212=\"\",\"\",'PJ - PAll'!D212)","v":""},{"$f":"IF('PJ - PAll'!H212=\"\",\"\",'PJ - PAll'!H212)","v":""},{"$f":"IF('PJ - PAll'!M212=\"\",\"\",'PJ - PAll'!M212)","v":""},null,{"$f":"IF('PJ - PAll'!O212=\"\",\"\",'PJ - PAll'!O212)","v":""}]
[null,{"$f":"IF(AND('PJ - PAll'!$C213=\"\",'PJ - PAll'!$D213=\"\"),\"\",'PJ - PAll'!V213)","v":""},{"$f":"IF(AND('PJ - PAll'!$C213=\"\",'PJ - PAll'!$D213=\"\"),\"\",'PJ - PAll'!B213)","v":""},{"$f":"IF('PJ - PAll'!C213=\"\",\"\",'PJ - PAll'!C213)","v":""},{"$f":"IF('PJ - PAll'!D213=\"\",\"\",'PJ - PAll'!D213)","v":""},{"$f":"IF('PJ - PAll'!H213=\"\",\"\",'PJ - PAll'!H213)","v":""},{"$f":"IF('PJ - PAll'!M213=\"\",\"\",'PJ - PAll'!M213)","v":""},null,{"$f":"IF('PJ - PAll'!O213=\"\",\"\",'PJ - PAll'!O213)","v":""}]
[null,{"$f":"IF(AND('PJ - PAll'!$C214=\"\",'PJ - PAll'!$D214=\"\"),\"\",'PJ - PAll'!V214)","v":""},{"$f":"IF(AND('PJ - PAll'!$C214=\"\",'PJ - PAll'!$D214=\"\"),\"\",'PJ - PAll'!B214)","v":""},{"$f":"IF('PJ - PAll'!C214=\"\",\"\",'PJ - PAll'!C214)","v":""},{"$f":"IF('PJ - PAll'!D214=\"\",\"\",'PJ - PAll'!D214)","v":""},{"$f":"IF('PJ - PAll'!H214=\"\",\"\",'PJ - PAll'!H214)","v":""},{"$f":"IF('PJ - PAll'!M214=\"\",\"\",'PJ - PAll'!M214)","v":""},null,{"$f":"IF('PJ - PAll'!O214=\"\",\"\",'PJ - PAll'!O214)","v":""}]
[null,{"$f":"IF(AND('PJ - PAll'!$C215=\"\",'PJ - PAll'!$D215=\"\"),\"\",'PJ - PAll'!V215)","v":""},{"$f":"IF(AND('PJ - PAll'!$C215=\"\",'PJ - PAll'!$D215=\"\"),\"\",'PJ - PAll'!B215)","v":""},{"$f":"IF('PJ - PAll'!C215=\"\",\"\",'PJ - PAll'!C215)","v":""},{"$f":"IF('PJ - PAll'!D215=\"\",\"\",'PJ - PAll'!D215)","v":""},{"$f":"IF('PJ - PAll'!H215=\"\",\"\",'PJ - PAll'!H215)","v":""},{"$f":"IF('PJ - PAll'!M215=\"\",\"\",'PJ - PAll'!M215)","v":""},null,{"$f":"IF('PJ - PAll'!O215=\"\",\"\",'PJ - PAll'!O215)","v":""}]
[null,{"$f":"IF(AND('PJ - PAll'!$C216=\"\",'PJ - PAll'!$D216=\"\"),\"\",'PJ - PAll'!V216)","v":""},{"$f":"IF(AND('PJ - PAll'!$C216=\"\",'PJ - PAll'!$D216=\"\"),\"\",'PJ - PAll'!B216)","v":""},{"$f":"IF('PJ - PAll'!C216=\"\",\"\",'PJ - PAll'!C216)","v":""},{"$f":"IF('PJ - PAll'!D216=\"\",\"\",'PJ - PAll'!D216)","v":""},{"$f":"IF('PJ - PAll'!H216=\"\",\"\",'PJ - PAll'!H216)","v":""},{"$f":"IF('PJ - PAll'!M216=\"\",\"\",'PJ - PAll'!M216)","v":""},null,{"$f":"IF('PJ - PAll'!O216=\"\",\"\",'PJ - PAll'!O216)","v":""}]
[null,{"$f":"B216","v":"Běh na 100m s přek. - Pořadí jednotlivců - All"}]
[]
[null,{"$f":"$B$3","v":"Krajské kolo dorostu"},null,null,{"$f":"$E$3","v":"18.06.2022 Pardubice"}]
[]
[null,{"$f":"Start!$D$5","v":"dorostenky"}]
[null,"Pořadí","Start. číslo","Jméno","kolektiv","čas             I. pokusu","čas            II. pokusu",null,"Výsledný čas"]
[]
[null,{"$f":"IF(AND('PJ - PAll'!$C217=\"\",'PJ - PAll'!$D217=\"\"),\"\",'PJ - PAll'!V217)","v":""},{"$f":"IF(AND('PJ - PAll'!$C217=\"\",'PJ - PAll'!$D217=\"\"),\"\",'PJ - PAll'!B217)","v":""},{"$f":"IF('PJ - PAll'!C217=\"\",\"\",'PJ - PAll'!C217)","v":""},{"$f":"IF('PJ - PAll'!D217=\"\",\"\",'PJ - PAll'!D217)","v":""},{"$f":"IF('PJ - PAll'!H217=\"\",\"\",'PJ - PAll'!H217)","v":""},{"$f":"IF('PJ - PAll'!M217=\"\",\"\",'PJ - PAll'!M217)","v":""},null,{"$f":"IF('PJ - PAll'!O217=\"\",\"\",'PJ - PAll'!O217)","v":""}]
[null,{"$f":"IF(AND('PJ - PAll'!$C218=\"\",'PJ - PAll'!$D218=\"\"),\"\",'PJ - PAll'!V218)","v":""},{"$f":"IF(AND('PJ - PAll'!$C218=\"\",'PJ - PAll'!$D218=\"\"),\"\",'PJ - PAll'!B218)","v":""},{"$f":"IF('PJ - PAll'!C218=\"\",\"\",'PJ - PAll'!C218)","v":""},{"$f":"IF('PJ - PAll'!D218=\"\",\"\",'PJ - PAll'!D218)","v":""},{"$f":"IF('PJ - PAll'!H218=\"\",\"\",'PJ - PAll'!H218)","v":""},{"$f":"IF('PJ - PAll'!M218=\"\",\"\",'PJ - PAll'!M218)","v":""},null,{"$f":"IF('PJ - PAll'!O218=\"\",\"\",'PJ - PAll'!O218)","v":""}]
[null,{"$f":"IF(AND('PJ - PAll'!$C219=\"\",'PJ - PAll'!$D219=\"\"),\"\",'PJ - PAll'!V219)","v":""},{"$f":"IF(AND('PJ - PAll'!$C219=\"\",'PJ - PAll'!$D219=\"\"),\"\",'PJ - PAll'!B219)","v":""},{"$f":"IF('PJ - PAll'!C219=\"\",\"\",'PJ - PAll'!C219)","v":""},{"$f":"IF('PJ - PAll'!D219=\"\",\"\",'PJ - PAll'!D219)","v":""},{"$f":"IF('PJ - PAll'!H219=\"\",\"\",'PJ - PAll'!H219)","v":""},{"$f":"IF('PJ - PAll'!M219=\"\",\"\",'PJ - PAll'!M219)","v":""},null,{"$f":"IF('PJ - PAll'!O219=\"\",\"\",'PJ - PAll'!O219)","v":""}]
[null,{"$f":"IF(AND('PJ - PAll'!$C220=\"\",'PJ - PAll'!$D220=\"\"),\"\",'PJ - PAll'!V220)","v":""},{"$f":"IF(AND('PJ - PAll'!$C220=\"\",'PJ - PAll'!$D220=\"\"),\"\",'PJ - PAll'!B220)","v":""},{"$f":"IF('PJ - PAll'!C220=\"\",\"\",'PJ - PAll'!C220)","v":""},{"$f":"IF('PJ - PAll'!D220=\"\",\"\",'PJ - PAll'!D220)","v":""},{"$f":"IF('PJ - PAll'!H220=\"\",\"\",'PJ - PAll'!H220)","v":""},{"$f":"IF('PJ - PAll'!M220=\"\",\"\",'PJ - PAll'!M220)","v":""},null,{"$f":"IF('PJ - PAll'!O220=\"\",\"\",'PJ - PAll'!O220)","v":""}]
[null,{"$f":"IF(AND('PJ - PAll'!$C221=\"\",'PJ - PAll'!$D221=\"\"),\"\",'PJ - PAll'!V221)","v":""},{"$f":"IF(AND('PJ - PAll'!$C221=\"\",'PJ - PAll'!$D221=\"\"),\"\",'PJ - PAll'!B221)","v":""},{"$f":"IF('PJ - PAll'!C221=\"\",\"\",'PJ - PAll'!C221)","v":""},{"$f":"IF('PJ - PAll'!D221=\"\",\"\",'PJ - PAll'!D221)","v":""},{"$f":"IF('PJ - PAll'!H221=\"\",\"\",'PJ - PAll'!H221)","v":""},{"$f":"IF('PJ - PAll'!M221=\"\",\"\",'PJ - PAll'!M221)","v":""},null,{"$f":"IF('PJ - PAll'!O221=\"\",\"\",'PJ - PAll'!O221)","v":""}]
[null,{"$f":"IF(AND('PJ - PAll'!$C222=\"\",'PJ - PAll'!$D222=\"\"),\"\",'PJ - PAll'!V222)","v":""},{"$f":"IF(AND('PJ - PAll'!$C222=\"\",'PJ - PAll'!$D222=\"\"),\"\",'PJ - PAll'!B222)","v":""},{"$f":"IF('PJ - PAll'!C222=\"\",\"\",'PJ - PAll'!C222)","v":""},{"$f":"IF('PJ - PAll'!D222=\"\",\"\",'PJ - PAll'!D222)","v":""},{"$f":"IF('PJ - PAll'!H222=\"\",\"\",'PJ - PAll'!H222)","v":""},{"$f":"IF('PJ - PAll'!M222=\"\",\"\",'PJ - PAll'!M222)","v":""},null,{"$f":"IF('PJ - PAll'!O222=\"\",\"\",'PJ - PAll'!O222)","v":""}]
[null,{"$f":"IF(AND('PJ - PAll'!$C223=\"\",'PJ - PAll'!$D223=\"\"),\"\",'PJ - PAll'!V223)","v":""},{"$f":"IF(AND('PJ - PAll'!$C223=\"\",'PJ - PAll'!$D223=\"\"),\"\",'PJ - PAll'!B223)","v":""},{"$f":"IF('PJ - PAll'!C223=\"\",\"\",'PJ - PAll'!C223)","v":""},{"$f":"IF('PJ - PAll'!D223=\"\",\"\",'PJ - PAll'!D223)","v":""},{"$f":"IF('PJ - PAll'!H223=\"\",\"\",'PJ - PAll'!H223)","v":""},{"$f":"IF('PJ - PAll'!M223=\"\",\"\",'PJ - PAll'!M223)","v":""},null,{"$f":"IF('PJ - PAll'!O223=\"\",\"\",'PJ - PAll'!O223)","v":""}]
[null,{"$f":"IF(AND('PJ - PAll'!$C224=\"\",'PJ - PAll'!$D224=\"\"),\"\",'PJ - PAll'!V224)","v":""},{"$f":"IF(AND('PJ - PAll'!$C224=\"\",'PJ - PAll'!$D224=\"\"),\"\",'PJ - PAll'!B224)","v":""},{"$f":"IF('PJ - PAll'!C224=\"\",\"\",'PJ - PAll'!C224)","v":""},{"$f":"IF('PJ - PAll'!D224=\"\",\"\",'PJ - PAll'!D224)","v":""},{"$f":"IF('PJ - PAll'!H224=\"\",\"\",'PJ - PAll'!H224)","v":""},{"$f":"IF('PJ - PAll'!M224=\"\",\"\",'PJ - PAll'!M224)","v":""},null,{"$f":"IF('PJ - PAll'!O224=\"\",\"\",'PJ - PAll'!O224)","v":""}]
[null,{"$f":"IF(AND('PJ - PAll'!$C225=\"\",'PJ - PAll'!$D225=\"\"),\"\",'PJ - PAll'!V225)","v":""},{"$f":"IF(AND('PJ - PAll'!$C225=\"\",'PJ - PAll'!$D225=\"\"),\"\",'PJ - PAll'!B225)","v":""},{"$f":"IF('PJ - PAll'!C225=\"\",\"\",'PJ - PAll'!C225)","v":""},{"$f":"IF('PJ - PAll'!D225=\"\",\"\",'PJ - PAll'!D225)","v":""},{"$f":"IF('PJ - PAll'!H225=\"\",\"\",'PJ - PAll'!H225)","v":""},{"$f":"IF('PJ - PAll'!M225=\"\",\"\",'PJ - PAll'!M225)","v":""},null,{"$f":"IF('PJ - PAll'!O225=\"\",\"\",'PJ - PAll'!O225)","v":""}]

{"sheet":"PJ-C","index":16,"n_rows":87,"n_cols":25,"rows_kept":87,"cut":false,"hidden":false,"merged":[[84,22,86,22],[84,23,86,23],[84,24,86,24],[84,18,86,18],[84,19,86,19],[84,20,86,20],[84,21,86,21],[81,24,83,24],[78,22,80,22],[78,23,80,23],[78,24,80,24],[78,18,80,18],[78,19,80,19],[78,20,80,20],[78,21,80,21],[81,18,83,18],[81,19,83,19],[81,20,83,20],[81,21,83,21],[81,22,83,22],[81,23,83,23],[75,24,77,24],[72,22,74,22],[72,23,74,23],[72,24,74,24],[72,18,74,18],[72,19,74,19],[72,20,74,20],[72,21,74,21],[75,18,77,18],[75,19,77,19],[75,20,77,20],[75,21,77,21],[75,22,77,22],[75,23,77,23],[65,24,67,24],[62,22,64,22],[62,23,64,23],[62,24,64,24],[62,18,64,18],[62,19,64,19],[62,20,64,20],[62,21,64,21],[65,18,67,18],[65,19,67,19],[65,20,67,20],[65,21,67,21],[65,22,67,22],[65,23,67,23],[59,24,61,24],[56,22,58,22],[56,23,58,23],[56,24,58,24],[56,18,58,18],[56,19,58,19],[56,20,58,20],[56,21,58,21],[59,18,61,18],[59,19,61,19],[59,20,61,20],[59,21,61,21],[59,22,61,22],[59,23,61,23],[53,24,55,24],[50,22,52,22],[50,23,52,23],[50,24,52,24],[50,18,52,18],[50,19,52,19],[50,20,52,20],[50,21,52,21],[53,18,55,18],[53,19,55,19],[53,20,55,20],[53,21,55,21],[53,22,55,22],[53,23,55,23],[47,24,49,24],[44,22,46,22],[44,23,46,23],[44,24,46,24],[44,18,46,18],[44,19,46,19],[44,20,46,20],[44,21,46,21],[47,18,49,18],[47,19,49,19],[47,20,49,20],[47,21,49,21],[47,22,49,22],[47,23,49,23],[41,24,43,24],[38,22,40,22],[38,23,40,23],[38,24,40,24],[38,18,40,18],[38,19,40,19],[38,20,40,20],[38,21,40,21],[41,18,43,18],[41,19,43,19],[41,20,43,20],[41,21,43,21],[41,22,43,22],[41,23,43,23],[31,24,33,24],[28,22,30,22],[28,23,30,23],[28,24,30,24],[28,18,30,18],[28,19,30,19],[28,20,30,20],[28,21,30,21],[31,18,33,18],[31,19,33,19],[31,20,33,20],[31,21,33,21],[31,22,33,22],[31,23,33,23],[25,24,27,24],[22,22,24,22],[22,23,24,23],[22,24,24,24],[22,18,24,18],[22,19,24,19],[22,20,24,20],[22,21,24,21],[25,18,27,18],[25,19,27,19],[25,20,27,20],[25,21,27,21],[25,22,27,22],[25,23,27,23],[10,20,12,20],[10,21,12,21],[13,18,15,18],[13,19,15,19],[13,20,15,20],[13,21,15,21],[13,22,15,22],[13,23,15,23],[19,24,21,24],[16,22,18,22],[16,23,18,23],[16,24,18,24],[16,18,18,18],[16,19,18,19],[16,20,18,20],[16,21,18,21],[19,18,21,18],[19,19,21,19],[19,20,21,20],[19,21,21,21],[19,22,21,22],[19,23,21,23],[7,16,9,16],[10,16,12,16],[13,16,15,16],[16,16,18,16],[7,24,9,24],[4,22,6,22],[4,23,6,23],[4,24,6,24],[4,18,6,18],[4,19,6,19],[4,20,6,20],[4,21,6,21],[7,18,9,18],[7,19,9,19],[7,20,9,20],[7,21,9,21],[7,22,9,22],[7,23,9,23],[13,24,15,24],[10,22,12,22],[10,23,12,23],[10,24,12,24],[10,18,12,18],[10,19,12,19],[19,14,21,14],[10,1,12,1],[31,11,33,11],[10,11,12,11],[84,16,86,16],[4,2,6,2],[7,2,9,2],[4,11,6,11],[4,12,6,12],[10,14,12,14],[10,12,12,12],[75,12,77,12],[78,14,80,14],[4,14,6,14],[7,14,9,14],[75,11,77,11],[22,2,24,2],[25,2,27,2],[28,2,30,2],[19,2,21,2],[13,2,15,2],[16,2,18,2],[84,12,86,12],[4,16,6,16],[4,1,6,1],[7,1,9,1],[22,1,24,1],[25,1,27,1],[16,1,18,1],[10,2,12,2],[65,14,67,14],[0,1,0,16],[19,1,21,1],[44,1,46,1],[44,2,46,2],[53,1,55,1],[53,2,55,2],[53,11,55,11],[56,14,58,14],[59,14,61,14],[56,1,58,1],[56,2,58,2],[56,11,58,11],[56,12,58,12],[59,1,61,1],[53,12,55,12],[59,12,61,12],[2,4,2,10],[13,14,15,14],[16,14,18,14],[22,12,24,12],[50,1,52,1],[50,2,52,2],[50,11,52,11],[50,12,52,12],[84,14,86,14],[81,1,83,1],[81,2,83,2],[81,11,83,11],[81,12,83,12],[84,1,86,1],[50,14,52,14],[53,14,55,14],[59,2,61,2],[59,11,61,11],[65,1,67,1],[65,2,67,2],[65,11,67,11],[65,12,67,12],[62,1,64,1],[62,2,64,2],[28,1,30,1],[19,16,21,16],[22,16,24,16],[44,11,46,11],[44,12,46,12],[47,14,49,14],[22,14,24,14],[28,12,30,12],[31,12,33,12],[25,12,27,12],[19,11,21,11],[22,11,24,11],[47,11,49,11],[47,12,49,12],[38,12,40,12],[41,11,43,11],[41,12,43,12],[38,11,40,11],[34,1,34,16],[28,14,30,14],[31,14,33,14],[38,14,40,14],[41,14,43,14],[44,14,46,14],[25,14,27,14],[25,16,27,16],[28,16,30,16],[31,16,33,16],[53,16,55,16],[38,16,40,16],[41,16,43,16],[44,16,46,16],[47,16,49,16],[50,16,52,16],[72,1,74,1],[62,11,64,11],[62,12,64,12],[84,2,86,2],[36,4,36,10],[31,2,33,2],[7,12,9,12],[7,11,9,11],[84,11,86,11],[47,1,49,1],[47,2,49,2],[13,1,15,1],[41,1,43,1],[41,2,43,2],[38,1,40,1],[38,2,40,2],[13,11,15,11],[16,11,18,11],[25,11,27,11],[28,11,30,11],[31,1,33,1],[72,2,74,2],[72,11,74,11],[62,14,64,14],[13,12,15,12],[16,12,18,12],[19,12,21,12],[81,16,83,16],[56,16,58,16],[59,16,61,16],[62,16,64,16],[65,16,67,16],[68,1,68,16],[70,4,70,10],[72,16,74,16],[75,16,77,16],[81,14,83,14],[72,12,74,12],[75,1,77,1],[75,2,77,2],[78,16,80,16],[72,14,74,14],[75,14,77,14],[78,1,80,1],[78,2,80,2],[78,11,80,11],[78,12,80,12]]}
[null,"Běh na 100m s překážkami - Pořadí družstev"]
[null,null,null,null,null,null,null,null,null,null,null,5]
[null,null,{"$f":"Start!$D$5","v":"dorostenky"},null,"Soutěžící"]
[null,"st.č.","SDH","Pokus",1,2,3,4,5,6,7,"P","Suma časů",null,"Poř.",null,"Poř.",null,1,2,3,4,5,6,7]
[null,{"$f":"Start!C7","v":1},{"$f":"IF(Start!D7=\"\",\"\",Start!D7)","v":"Kamenec"},"1. pokus",21.33,25.1,21.85,22.31,20.72,23.02,"NP",{"$f":"IF(C5=\"\",\"\",COUNT(E7:K7))","v":6},{"$f":"IF(C5=\"\",\"\",IF(AND(L5=0,COUNTIF(E7:K7,\"NP\")=0),\"DNF\",IF(L5<L$2,\"NP\",SUM(S5:Y7))))","v":107.2},null,{"$f":"IF(C5=\"\",\"\",IF(OR(M5=\"NP\",M5=\"DNF\"),M5,RANK(M5,M$5:M$85,1)))","v":4},null,{"$f":"IF(D5=\"\",\"\",IF(OR(O5=\"NP\",O5=\"DNF\"),IF(O5=\"NP\",MAX(O$5:O$85)+COUNTIF((O$5:O$85),MAX(O$5:O$85)),MAX(O$5:O$85)+COUNTIF((O$5:O$85),MAX(O$5:O$85))+COUNTIF((O$5:O$85),\"NP\")),O5))","v":4},null,{"$f":"IF($C5=\"\",\"\",IF(S$4>$L$2,0,IF(ISNA(SMALL($E7:$K7,1)),0,SMALL($E7:$K7,1))))","v":20.72},{"$f":"IF($C5=\"\",\"\",IF(T$4>$L$2,0,IF(ISNA(SMALL($E7:$K7,2)),0,SMALL($E7:$K7,2))))","v":20.77},{"$f":"IF($C5=\"\",\"\",IF(U$4>$L$2,0,IF(ISNA(SMALL($E7:$K7,3)),0,SMALL($E7:$K7,3))))","v":20.92},{"$f":"IF($C5=\"\",\"\",IF(V$4>$L$2,0,IF(ISNA(SMALL($E7:$K7,4)),0,SMALL($E7:$K7,4))))","v":22.31},{"$f":"IF($C5=\"\",\"\",IF(W$4>$L$2,0,IF(ISNA(SMALL($E7:$K7,5)),0,SMALL($E7:$K7,5))))","v":22.48},{"$f":"IF($C5=\"\",\"\",IF(X$4>$L$2,0,IF(ISNA(SMALL($E7:$K7,6)),0,SMALL($E7:$K7,6))))","v":0},{"$f":"IF($C5=\"\",\"\",IF(Y$4>$L$2,0,IF(ISNA(SMALL($E7:$K7,7)),0,SMALL($E7:$K7,7))))","v":0}]
[null,null,null,"2. pokus",20.77,22.48,20.92,25.49,"NP",22.73,"DNF"]
[null,null,null,"čas",{"$f":"IF(OR($C5=\"\",E5=\"\",E6=\"\"),\"\",IF(OR(AND(E5=\"NP\",E6=\"NP\"),AND(E5=\"DNF\",E6=\"DNF\")),E5,IF(AND(E5=\"NP\",E6=\"DNF\"),E5,IF(AND(E5=\"DNF\",E6=\"NP\"),E6,MIN(E5,E6)))))","v":20.77},22.48,20.92,22.31,20.72,22.73,"NP"]
[null,{"$f":"Start!C8","v":2},{"$f":"IF(Start!D8=\"\",\"\",Start!D8)","v":"Lukavice"},"1. pokus",23.16,25.14,24.39,23.23,26.76,"NP",21.35,{"$f":"IF(C8=\"\",\"\",COUNT(E10:K10))","v":7},{"$f":"IF(C8=\"\",\"\",IF(AND(L8=0,COUNTIF(E10:K10,\"NP\")=0),\"DNF\",IF(L8<L$2,\"NP\",SUM(S8:Y10))))","v":115.31},null,{"$f":"IF(C8=\"\",\"\",IF(OR(M8=\"NP\",M8=\"DNF\"),M8,RANK(M8,M$5:M$85,1)))","v":5},null,{"$f":"IF(D8=\"\",\"\",IF(OR(O8=\"NP\",O8=\"DNF\"),IF(O8=\"NP\",MAX(O$5:O$85)+COUNTIF((O$5:O$85),MAX(O$5:O$85)),MAX(O$5:O$85)+COUNTIF((O$5:O$85),MAX(O$5:O$85))+COUNTIF((O$5:O$85),\"NP\")),O8))","v":5},null,{"$f":"IF($C8=\"\",\"\",IF(S$4>$L$2,0,IF(ISNA(SMALL($E10:$K10,1)),0,SMALL($E10:$K10,1))))","v":21.35},{"$f":"IF($C8=\"\",\"\",IF(T$4>$L$2,0,IF(ISNA(SMALL($E10:$K10,2)),0,SMALL($E10:$K10,2))))","v":22.96},{"$f":"IF($C8=\"\",\"\",IF(U$4>$L$2,0,IF(ISNA(SMALL($E10:$K10,3)),0,SMALL($E10:$K10,3))))","v":23.16},{"$f":"IF($C8=\"\",\"\",IF(V$4>$L$2,0,IF(ISNA(SMALL($E10:$K10,4)),0,SMALL($E10:$K10,4))))","v":23.45},{"$f":"IF($C8=\"\",\"\",IF(W$4>$L$2,0,IF(ISNA(SMALL($E10:$K10,5)),0,SMALL($E10:$K10,5))))","v":24.39},{"$f":"IF($C8=\"\",\"\",IF(X$4>$L$2,0,IF(ISNA(SMALL($E10:$K10,6)),0,SMALL($E10:$K10,6))))","v":0},{"$f":"IF($C8=\"\",\"\",IF(Y$4>$L$2,0,IF(ISNA(SMALL($E10:$K10,7)),0,SMALL($E10:$K10,7))))","v":0}]
[null,null,null,"2. pokus",24.21,24.92,34.31,22.96,26.2,23.45,34.270000000000003]
[null,null,null,"čas",{"$f":"IF(OR($C8=\"\",E8=\"\",E9=\"\"),\"\",IF(OR(AND(E8=\"NP\",E9=\"NP\"),AND(E8=\"DNF\",E9=\"DNF\")),E8,IF(AND(E8=\"NP\",E9=\"DNF\"),E8,IF(AND(E8=\"DNF\",E9=\"NP\"),E9,MIN(E8,E9)))))","v":23.16},24.92,24.39,22.96,26.2,23.45,21.35]
[null,{"$f":"Start!C9","v":3},{"$f":"IF(Start!D9=\"\",\"\",Start!D9)","v":"Lubná"},"1. pokus",24.87,"NP",22.55,21.28,19.739999999999998,"NP",20.8,{"$f":"IF(C11=\"\",\"\",COUNT(E13:K13))","v":7},{"$f":"IF(C11=\"\",\"\",IF(AND(L11=0,COUNTIF(E13:K13,\"NP\")=0),\"DNF\",IF(L11<L$2,\"NP\",SUM(S11:Y13))))","v":105.67},null,{"$f":"IF(C11=\"\",\"\",IF(OR(M11=\"NP\",M11=\"DNF\"),M11,RANK(M11,M$5:M$85,1)))","v":3},null,{"$f":"IF(D11=\"\",\"\",IF(OR(O11=\"NP\",O11=\"DNF\"),IF(O11=\"NP\",MAX(O$5:O$85)+COUNTIF((O$5:O$85),MAX(O$5:O$85)),MAX(O$5:O$85)+COUNTIF((O$5:O$85),MAX(O$5:O$85))+COUNTIF((O$5:O$85),\"NP\")),O11))","v":3},null,{"$f":"IF($C11=\"\",\"\",IF(S$4>$L$2,0,IF(ISNA(SMALL($E13:$K13,1)),0,SMALL($E13:$K13,1))))","v":19.68},{"$f":"IF($C11=\"\",\"\",IF(T$4>$L$2,0,IF(ISNA(SMALL($E13:$K13,2)),0,SMALL($E13:$K13,2))))","v":19.739999999999998},{"$f":"IF($C11=\"\",\"\",IF(U$4>$L$2,0,IF(ISNA(SMALL($E13:$K13,3)),0,SMALL($E13:$K13,3))))","v":20.89},{"$f":"IF($C11=\"\",\"\",IF(V$4>$L$2,0,IF(ISNA(SMALL($E13:$K13,4)),0,SMALL($E13:$K13,4))))","v":22.38},{"$f":"IF($C11=\"\",\"\",IF(W$4>$L$2,0,IF(ISNA(SMALL($E13:$K13,5)),0,SMALL($E13:$K13,5))))","v":22.98},{"$f":"IF($C11=\"\",\"\",IF(X$4>$L$2,0,IF(ISNA(SMALL($E13:$K13,6)),0,SMALL($E13:$K13,6))))","v":0},{"$f":"IF($C11=\"\",\"\",IF(Y$4>$L$2,0,IF(ISNA(SMALL($E13:$K13,7)),0,SMALL($E13:$K13,7))))","v":0}]
[null,null,null,"2. pokus",22.98,24.73,22.38,20.89,"NP",23.58,19.68]
[null,null,null,"čas",{"$f":"IF(OR($C11=\"\",E11=\"\",E12=\"\"),\"\",IF(OR(AND(E11=\"NP\",E12=\"NP\"),AND(E11=\"DNF\",E12=\"DNF\")),E11,IF(AND(E11=\"NP\",E12=\"DNF\"),E11,IF(AND(E11=\"DNF\",E12=\"NP\"),E12,MIN(E11,E12)))))","v":22.98},24.73,22.38,20.89,19.739999999999998,23.58,19.68]
[null,{"$f":"Start!C10","v":4},{"$f":"IF(Start!D10=\"\",\"\",Start!D10)","v":"Skuteč"},"1. pokus",19.68,"NP",19.68,22.21,21.3,19.690000000000001,18.05,{"$f":"IF(C14=\"\",\"\",COUNT(E16:K16))","v":7},{"$f":"IF(C14=\"\",\"\",IF(AND(L14=0,COUNTIF(E16:K16,\"NP\")=0),\"DNF\",IF(L14<L$2,\"NP\",SUM(S14:Y16))))","v":96.289999999999992},null,{"$f":"IF(C14=\"\",\"\",IF(OR(M14=\"NP\",M14=\"DNF\"),M14,RANK(M14,M$5:M$85,1)))","v":1},null,{"$f":"IF(D14=\"\",\"\",IF(OR(O14=\"NP\",O14=\"DNF\"),IF(O14=\"NP\",MAX(O$5:O$85)+COUNTIF((O$5:O$85),MAX(O$5:O$85)),MAX(O$5:O$85)+COUNTIF((O$5:O$85),MAX(O$5:O$85))+COUNTIF((O$5:O$85),\"NP\")),O14))","v":1},null,{"$f":"IF($C14=\"\",\"\",IF(S$4>$L$2,0,IF(ISNA(SMALL($E16:$K16,1)),0,SMALL($E16:$K16,1))))","v":18.05},{"$f":"IF($C14=\"\",\"\",IF(T$4>$L$2,0,IF(ISNA(SMALL($E16:$K16,2)),0,SMALL($E16:$K16,2))))","v":19.309999999999999},{"$f":"IF($C14=\"\",\"\",IF(U$4>$L$2,0,IF(ISNA(SMALL($E16:$K16,3)),0,SMALL($E16:$K16,3))))","v":19.57},{"$f":"IF($C14=\"\",\"\",IF(V$4>$L$2,0,IF(ISNA(SMALL($E16:$K16,4)),0,SMALL($E16:$K16,4))))","v":19.68},{"$f":"IF($C14=\"\",\"\",IF(W$4>$L$2,0,IF(ISNA(SMALL($E16:$K16,5)),0,SMALL($E16:$K16,5))))","v":19.68},{"$f":"IF($C14=\"\",\"\",IF(X$4>$L$2,0,IF(ISNA(SMALL($E16:$K16,6)),0,SMALL($E16:$K16,6))))","v":0},{"$f":"IF($C14=\"\",\"\",IF(Y$4>$L$2,0,IF(ISNA(SMALL($E16:$K16,7)),0,SMALL($E16:$K16,7))))","v":0}]
[null,null,null,"2. pokus",19.68,21.57,20.39,19.309999999999999,22.01,19.57,"NP"]
[null,null,null,"čas",{"$f":"IF(OR($C14=\"\",E14=\"\",E15=\"\"),\"\",IF(OR(AND(E14=\"NP\",E15=\"NP\"),AND(E14=\"DNF\",E15=\"DNF\")),E14,IF(AND(E14=\"NP\",E15=\"DNF\"),E14,IF(AND(E14=\"DNF\",E15=\"NP\"),E15,MIN(E14,E15)))))","v":19.68},21.57,19.68,19.309999999999999,21.3,19.57,18.05]
[null,{"$f":"Start!C11","v":5},{"$f":"IF(Start!D11=\"\",\"\",Start!D11)","v":"Bystřec"},"1. pokus","NP",24.27,22.15,23.3,24.03,"NP",22.25,{"$f":"IF(C17=\"\",\"\",COUNT(E19:K19))","v":7},{"$f":"IF(C17=\"\",\"\",IF(AND(L17=0,COUNTIF(E19:K19,\"NP\")=0),\"DNF\",IF(L17<L$2,\"NP\",SUM(S17:Y19))))","v":115.66},null,{"$f":"IF(C17=\"\",\"\",IF(OR(M17=\"NP\",M17=\"DNF\"),M17,RANK(M17,M$5:M$85,1)))","v":6},null,{"$f":"IF(D17=\"\",\"\",IF(OR(O17=\"NP\",O17=\"DNF\"),IF(O17=\"NP\",MAX(O$5:O$85)+COUNTIF((O$5:O$85),MAX(O$5:O$85)),MAX(O$5:O$85)+COUNTIF((O$5:O$85),MAX(O$5:O$85))+COUNTIF((O$5:O$85),\"NP\")),O17))","v":6},null,{"$f":"IF($C17=\"\",\"\",IF(S$4>$L$2,0,IF(ISNA(SMALL($E19:$K19,1)),0,SMALL($E19:$K19,1))))","v":22.15},{"$f":"IF($C17=\"\",\"\",IF(T$4>$L$2,0,IF(ISNA(SMALL($E19:$K19,2)),0,SMALL($E19:$K19,2))))","v":22.25},{"$f":"IF($C17=\"\",\"\",IF(U$4>$L$2,0,IF(ISNA(SMALL($E19:$K19,3)),0,SMALL($E19:$K19,3))))","v":23.3},{"$f":"IF($C17=\"\",\"\",IF(V$4>$L$2,0,IF(ISNA(SMALL($E19:$K19,4)),0,SMALL($E19:$K19,4))))","v":23.93},{"$f":"IF($C17=\"\",\"\",IF(W$4>$L$2,0,IF(ISNA(SMALL($E19:$K19,5)),0,SMALL($E19:$K19,5))))","v":24.03},{"$f":"IF($C17=\"\",\"\",IF(X$4>$L$2,0,IF(ISNA(SMALL($E19:$K19,6)),0,SMALL($E19:$K19,6))))","v":0},{"$f":"IF($C17=\"\",\"\",IF(Y$4>$L$2,0,IF(ISNA(SMALL($E19:$K19,7)),0,SMALL($E19:$K19,7))))","v":0}]
[null,null,null,"2. pokus",28.66,23.93,28.73,23.84,24.53,34.83,22.72]
[null,null,null,"čas",{"$f":"IF(OR($C17=\"\",E17=\"\",E18=\"\"),\"\",IF(OR(AND(E17=\"NP\",E18=\"NP\"),AND(E17=\"DNF\",E18=\"DNF\")),E17,IF(AND(E17=\"NP\",E18=\"DNF\"),E17,IF(AND(E17=\"DNF\",E18=\"NP\"),E18,MIN(E17,E18)))))","v":28.66},23.93,22.15,23.3,24.03,34.83,22.25]
[null,{"$f":"Start!C12","v":6},{"$f":"IF(Start!D12=\"\",\"\",Start!D12)","v":"Letohrad Kunčice"},"1. pokus",22.79,19.510000000000002,24.47,23.57,23.86,24.06,19.809999999999999,{"$f":"IF(C20=\"\",\"\",COUNT(E22:K22))","v":7},{"$f":"IF(C20=\"\",\"\",IF(AND(L20=0,COUNTIF(E22:K22,\"NP\")=0),\"DNF\",IF(L20<L$2,\"NP\",SUM(S20:Y22))))","v":104.83},null,{"$f":"IF(C20=\"\",\"\",IF(OR(M20=\"NP\",M20=\"DNF\"),M20,RANK(M20,M$5:M$85,1)))","v":2},null,{"$f":"IF(D20=\"\",\"\",IF(OR(O20=\"NP\",O20=\"DNF\"),IF(O20=\"NP\",MAX(O$5:O$85)+COUNTIF((O$5:O$85),MAX(O$5:O$85)),MAX(O$5:O$85)+COUNTIF((O$5:O$85),MAX(O$5:O$85))+COUNTIF((O$5:O$85),\"NP\")),O20))","v":2},null,{"$f":"IF($C20=\"\",\"\",IF(S$4>$L$2,0,IF(ISNA(SMALL($E22:$K22,1)),0,SMALL($E22:$K22,1))))","v":19.3},{"$f":"IF($C20=\"\",\"\",IF(T$4>$L$2,0,IF(ISNA(SMALL($E22:$K22,2)),0,SMALL($E22:$K22,2))))","v":19.809999999999999},{"$f":"IF($C20=\"\",\"\",IF(U$4>$L$2,0,IF(ISNA(SMALL($E22:$K22,3)),0,SMALL($E22:$K22,3))))","v":21.13},{"$f":"IF($C20=\"\",\"\",IF(V$4>$L$2,0,IF(ISNA(SMALL($E22:$K22,4)),0,SMALL($E22:$K22,4))))","v":21.57},{"$f":"IF($C20=\"\",\"\",IF(W$4>$L$2,0,IF(ISNA(SMALL($E22:$K22,5)),0,SMALL($E22:$K22,5))))","v":23.02},{"$f":"IF($C20=\"\",\"\",IF(X$4>$L$2,0,IF(ISNA(SMALL($E22:$K22,6)),0,SMALL($E22:$K22,6))))","v":0},{"$f":"IF($C20=\"\",\"\",IF(Y$4>$L$2,0,IF(ISNA(SMALL($E22:$K22,7)),0,SMALL($E22:$K22,7))))","v":0}]
[null,null,null,"2. pokus",21.57,19.3,21.13,24.32,23.02,25.68,25.95]
[null,null,null,"čas",{"$f":"IF(OR($C20=\"\",E20=\"\",E21=\"\"),\"\",IF(OR(AND(E20=\"NP\",E21=\"NP\"),AND(E20=\"DNF\",E21=\"DNF\")),E20,IF(AND(E20=\"NP\",E21=\"DNF\"),E20,IF(AND(E20=\"DNF\",E21=\"NP\"),E21,MIN(E20,E21)))))","v":21.57},19.3,21.13,23.57,23.02,24.06,19.809999999999999]
[null,{"$f":"Start!C13","v":7},{"$f":"IF(Start!D13=\"\",\"\",Start!D13)","v":""},"1. pokus",null,null,null,null,null,null,null,{"$f":"IF(C23=\"\",\"\",COUNT(E25:K25))","v":""},{"$f":"IF(C23=\"\",\"\",IF(AND(L23=0,COUNTIF(E25:K25,\"NP\")=0),\"DNF\",IF(L23<L$2,\"NP\",SUM(S23:Y25))))","v":""},null,{"$f":"IF(C23=\"\",\"\",IF(OR(M23=\"NP\",M23=\"DNF\"),M23,RANK(M23,M$5:M$85,1)))","v":""},null,{"$f":"IF(D23=\"\",\"\",IF(OR(O23=\"NP\",O23=\"DNF\"),IF(O23=\"NP\",MAX(O$5:O$85)+COUNTIF((O$5:O$85),MAX(O$5:O$85)),MAX(O$5:O$85)+COUNTIF((O$5:O$85),MAX(O$5:O$85))+COUNTIF((O$5:O$85),\"NP\")),O23))","v":""},null,{"$f":"IF($C23=\"\",\"\",IF(S$4>$L$2,0,IF(ISNA(SMALL($E25:$K25,1)),0,SMALL($E25:$K25,1))))","v":""},{"$f":"IF($C23=\"\",\"\",IF(T$4>$L$2,0,IF(ISNA(SMALL($E25:$K25,2)),0,SMALL($E25:$K25,2))))","v":""},{"$f":"IF($C23=\"\",\"\",IF(U$4>$L$2,0,IF(ISNA(SMALL($E25:$K25,3)),0,SMALL($E25:$K25,3))))","v":""},{"$f":"IF($C23=\"\",\"\",IF(V$4>$L$2,0,IF(ISNA(SMALL($E25:$K25,4)),0,SMALL($E25:$K25,4))))","v":""},{"$f":"IF($C23=\"\",\"\",IF(W$4>$L$2,0,IF(ISNA(SMALL($E25:$K25,5)),0,SMALL($E25:$K25,5))))","v":""},{"$f":"IF($C23=\"\",\"\",IF(X$4>$L$2,0,IF(ISNA(SMALL($E25:$K25,6)),0,SMALL($E25:$K25,6))))","v":""},{"$f":"IF($C23=\"\",\"\",IF(Y$4>$L$2,0,IF(ISNA(SMALL($E25:$K25,7)),0,SMALL($E25:$K25,7))))","v":""}]
[null,null,null,"2. pokus"]
[null,null,null,"čas",{"$f":"IF(OR($C23=\"\",E23=\"\",E24=\"\"),\"\",IF(OR(AND(E23=\"NP\",E24=\"NP\"),AND(E23=\"DNF\",E24=\"DNF\")),E23,IF(AND(E23=\"NP\",E24=\"DNF\"),E23,IF(AND(E23=\"DNF\",E24=\"NP\"),E24,MIN(E23,E24)))))","v":""},"","","","","",""]
[null,{"$f":"Start!C14","v":8},{"$f":"IF(Start!D14=\"\",\"\",Start!D14)","v":""},"1. pokus",null,null,null,null,null,null,null,{"$f":"IF(C26=\"\",\"\",COUNT(E28:K28))","v":""},{"$f":"IF(C26=\"\",\"\",IF(AND(L26=0,COUNTIF(E28:K28,\"NP\")=0),\"DNF\",IF(L26<L$2,\"NP\",SUM(S26:Y28))))","v":""},null,{"$f":"IF(C26=\"\",\"\",IF(OR(M26=\"NP\",M26=\"DNF\"),M26,RANK(M26,M$5:M$85,1)))","v":""},null,{"$f":"IF(D26=\"\",\"\",IF(OR(O26=\"NP\",O26=\"DNF\"),IF(O26=\"NP\",MAX(O$5:O$85)+COUNTIF((O$5:O$85),MAX(O$5:O$85)),MAX(O$5:O$85)+COUNTIF((O$5:O$85),MAX(O$5:O$85))+COUNTIF((O$5:O$85),\"NP\")),O26))","v":""},null,{"$f":"IF($C26=\"\",\"\",IF(S$4>$L$2,0,IF(ISNA(SMALL($E28:$K28,1)),0,SMALL($E28:$K28,1))))","v":""},{"$f":"IF($C26=\"\",\"\",IF(T$4>$L$2,0,IF(ISNA(SMALL($E28:$K28,2)),0,SMALL($E28:$K28,2))))","v":""},{"$f":"IF($C26=\"\",\"\",IF(U$4>$L$2,0,IF(ISNA(SMALL($E28:$K28,3)),0,SMALL($E28:$K28,3))))","v":""},{"$f":"IF($C26=\"\",\"\",IF(V$4>$L$2,0,IF(ISNA(SMALL($E28:$K28,4)),0,SMALL($E28:$K28,4))))","v":""},{"$f":"IF($C26=\"\",\"\",IF(W$4>$L$2,0,IF(ISNA(SMALL($E28:$K28,5)),0,SMALL($E28:$K28,5))))","v":""},{"$f":"IF($C26=\"\",\"\",IF(X$4>$L$2,0,IF(ISNA(SMALL($E28:$K28,6)),0,SMALL($E28:$K28,6))))","v":""},{"$f":"IF($C26=\"\",\"\",IF(Y$4>$L$2,0,IF(ISNA(SMALL($E28:$K28,7)),0,SMALL($E28:$K28,7))))","v":""}]
[null,null,null,"2. pokus"]
[null,null,null,"čas",{"$f":"IF(OR($C26=\"\",E26=\"\",E27=\"\"),\"\",IF(OR(AND(E26=\"NP\",E27=\"NP\"),AND(E26=\"DNF\",E27=\"DNF\")),E26,IF(AND(E26=\"NP\",E27=\"DNF\"),E26,IF(AND(E26=\"DNF\",E27=\"NP\"),E27,MIN(E26,E27)))))","v":""},"","","","","",""]
[null,{"$f":"Start!C15","v":9},{"$f":"IF(Start!D15=\"\",\"\",Start!D15)","v":""},"1. pokus",null,null,null,null,null,null,null,{"$f":"IF(C29=\"\",\"\",COUNT(E31:K31))","v":""},{"$f":"IF(C29=\"\",\"\",IF(AND(L29=0,COUNTIF(E31:K31,\"NP\")=0),\"DNF\",IF(L29<L$2,\"NP\",SUM(S29:Y31))))","v":""},null,{"$f":"IF(C29=\"\",\"\",IF(OR(M29=\"NP\",M29=\"DNF\"),M29,RANK(M29,M$5:M$85,1)))","v":""},null,{"$f":"IF(D29=\"\",\"\",IF(OR(O29=\"NP\",O29=\"DNF\"),IF(O29=\"NP\",MAX(O$5:O$85)+COUNTIF((O$5:O$85),MAX(O$5:O$85)),MAX(O$5:O$85)+COUNTIF((O$5:O$85),MAX(O$5:O$85))+COUNTIF((O$5:O$85),\"NP\")),O29))","v":""},null,{"$f":"IF($C29=\"\",\"\",IF(S$4>$L$2,0,IF(ISNA(SMALL($E31:$K31,1)),0,SMALL($E31:$K31,1))))","v":""},{"$f":"IF($C29=\"\",\"\",IF(T$4>$L$2,0,IF(ISNA(SMALL($E31:$K31,2)),0,SMALL($E31:$K31,2))))","v":""},{"$f":"IF($C29=\"\",\"\",IF(U$4>$L$2,0,IF(ISNA(SMALL($E31:$K31,3)),0,SMALL($E31:$K31,3))))","v":""},{"$f":"IF($C29=\"\",\"\",IF(V$4>$L$2,0,IF(ISNA(SMALL($E31:$K31,4)),0,SMALL($E31:$K31,4))))","v":""},{"$f":"IF($C29=\"\",\"\",IF(W$4>$L$2,0,IF(ISNA(SMALL($E31:$K31,5)),0,SMALL($E31:$K31,5))))","v":""},{"$f":"IF($C29=\"\",\"\",IF(X$4>$L$2,0,IF(ISNA(SMALL($E31:$K31,6)),0,SMALL($E31:$K31,6))))","v":""},{"$f":"IF($C29=\"\",\"\",IF(Y$4>$L$2,0,IF(ISNA(SMALL($E31:$K31,7)),0,SMALL($E31:$K31,7))))","v":""}]
[null,null,null,"2. pokus"]
[null,null,null,"čas",{"$f":"IF(OR($C29=\"\",E29=\"\",E30=\"\"),\"\",IF(OR(AND(E29=\"NP\",E30=\"NP\"),AND(E29=\"DNF\",E30=\"DNF\")),E29,IF(AND(E29=\"NP\",E30=\"DNF\"),E29,IF(AND(E29=\"DNF\",E30=\"NP\"),E30,MIN(E29,E30)))))","v":""},"","","","","",""]
[null,{"$f":"Start!C16","v":10},{"$f":"IF(Start!D16=\"\",\"\",Start!D16)","v":""},"1. pokus",null,null,null,null,null,null,null,{"$f":"IF(C32=\"\",\"\",COUNT(E34:K34))","v":""},{"$f":"IF(C32=\"\",\"\",IF(AND(L32=0,COUNTIF(E34:K34,\"NP\")=0),\"DNF\",IF(L32<L$2,\"NP\",SUM(S32:Y34))))","v":""},null,{"$f":"IF(C32=\"\",\"\",IF(OR(M32=\"NP\",M32=\"DNF\"),M32,RANK(M32,M$5:M$85,1)))","v":""},null,{"$f":"IF(D32=\"\",\"\",IF(OR(O32=\"NP\",O32=\"DNF\"),IF(O32=\"NP\",MAX(O$5:O$85)+COUNTIF((O$5:O$85),MAX(O$5:O$85)),MAX(O$5:O$85)+COUNTIF((O$5:O$85),MAX(O$5:O$85))+COUNTIF((O$5:O$85),\"NP\")),O32))","v":""},null,{"$f":"IF($C32=\"\",\"\",IF(S$4>$L$2,0,IF(ISNA(SMALL($E34:$K34,1)),0,SMALL($E34:$K34,1))))","v":""},{"$f":"IF($C32=\"\",\"\",IF(T$4>$L$2,0,IF(ISNA(SMALL($E34:$K34,2)),0,SMALL($E34:$K34,2))))","v":""},{"$f":"IF($C32=\"\",\"\",IF(U$4>$L$2,0,IF(ISNA(SMALL($E34:$K34,3)),0,SMALL($E34:$K34,3))))","v":""},{"$f":"IF($C32=\"\",\"\",IF(V$4>$L$2,0,IF(ISNA(SMALL($E34:$K34,4)),0,SMALL($E34:$K34,4))))","v":""},{"$f":"IF($C32=\"\",\"\",IF(W$4>$L$2,0,IF(ISNA(SMALL($E34:$K34,5)),0,SMALL($E34:$K34,5))))","v":""},{"$f":"IF($C32=\"\",\"\",IF(X$4>$L$2,0,IF(ISNA(SMALL($E34:$K34,6)),0,SMALL($E34:$K34,6))))","v":""},{"$f":"IF($C32=\"\",\"\",IF(Y$4>$L$2,0,IF(ISNA(SMALL($E34:$K34,7)),0,SMALL($E34:$K34,7))))","v":""}]
[null,null,null,"2. pokus"]
[null,null,null,"čas",{"$f":"IF(OR($C32=\"\",E32=\"\",E33=\"\"),\"\",IF(OR(AND(E32=\"NP\",E33=\"NP\"),AND(E32=\"DNF\",E33=\"DNF\")),E32,IF(AND(E32=\"NP\",E33=\"DNF\"),E32,IF(AND(E32=\"DNF\",E33=\"NP\"),E33,MIN(E32,E33)))))","v":""},"","","","","",""]
[null,{"$f":"B1","v":"Běh na 100m s překážkami - Pořadí družstev"}]
[]
[null,null,{"$f":"Start!$D$5","v":"dorostenky"},null,"Soutěžící"]
[null,"st.č.","SDH","Pokus",1,"DNF","DNF","DNF","DNF","DNF","DNF","P","C.čas",null,"Poř.",null,"Body"]
[null,{"$f":"Start!C17","v":11},{"$f":"IF(Start!D17=\"\",\"\",Start!D17)","v":""},"1. pokus",null,null,null,null,null,null,null,{"$f":"IF(C39=\"\",\"\",COUNT(E41:K41))","v":""},{"$f":"IF(C39=\"\",\"\",IF(AND(L39=0,COUNTIF(E41:K41,\"NP\")=0),\"DNF\",IF(L39<L$2,\"NP\",SUM(S39:Y41))))","v":""},null,{"$f":"IF(C39=\"\",\"\",IF(OR(M39=\"NP\",M39=\"DNF\"),M39,RANK(M39,M$5:M$85,1)))","v":""},null,{"$f":"IF(D39=\"\",\"\",IF(OR(O39=\"NP\",O39=\"DNF\"),IF(O39=\"NP\",MAX(O$5:O$85)+COUNTIF((O$5:O$85),MAX(O$5:O$85)),MAX(O$5:O$85)+COUNTIF((O$5:O$85),MAX(O$5:O$85))+COUNTIF((O$5:O$85),\"NP\")),O39))","v":""},null,{"$f":"IF($C39=\"\",\"\",IF(S$4>$L$2,0,IF(ISNA(SMALL($E41:$K41,1)),0,SMALL($E41:$K41,1))))","v":""},{"$f":"IF($C39=\"\",\"\",IF(T$4>$L$2,0,IF(ISNA(SMALL($E41:$K41,2)),0,SMALL($E41:$K41,2))))","v":""},{"$f":"IF($C39=\"\",\"\",IF(U$4>$L$2,0,IF(ISNA(SMALL($E41:$K41,3)),0,SMALL($E41:$K41,3))))","v":""},{"$f":"IF($C39=\"\",\"\",IF(V$4>$L$2,0,IF(ISNA(SMALL($E41:$K41,4)),0,SMALL($E41:$K41,4))))","v":""},{"$f":"IF($C39=\"\",\"\",IF(W$4>$L$2,0,IF(ISNA(SMALL($E41:$K41,5)),0,SMALL($E41:$K41,5))))","v":""},{"$f":"IF($C39=\"\",\"\",IF(X$4>$L$2,0,IF(ISNA(SMALL($E41:$K41,6)),0,SMALL($E41:$K41,6))))","v":""},{"$f":"IF($C39=\"\",\"\",IF(Y$4>$L$2,0,IF(ISNA(SMALL($E41:$K41,7)),0,SMALL($E41:$K41,7))))","v":""}]
[null,null,null,"2. pokus"]
[null,null,null,"čas",{"$f":"IF(OR($C39=\"\",E39=\"\",E40=\"\"),\"\",IF(OR(AND(E39=\"NP\",E40=\"NP\"),AND(E39=\"DNF\",E40=\"DNF\")),E39,IF(AND(E39=\"NP\",E40=\"DNF\"),E39,IF(AND(E39=\"DNF\",E40=\"NP\"),E40,MIN(E39,E40)))))","v":""},"","","","","",""]
[null,{"$f":"Start!C18","v":12},{"$f":"IF(Start!D18=\"\",\"\",Start!D18)","v":""},"1. pokus",null,null,null,null,null,null,null,{"$f":"IF(C42=\"\",\"\",COUNT(E44:K44))","v":""},{"$f":"IF(C42=\"\",\"\",IF(AND(L42=0,COUNTIF(E44:K44,\"NP\")=0),\"DNF\",IF(L42<L$2,\"NP\",SUM(S42:Y44))))","v":""},null,{"$f":"IF(C42=\"\",\"\",IF(OR(M42=\"NP\",M42=\"DNF\"),M42,RANK(M42,M$5:M$85,1)))","v":""},null,{"$f":"IF(D42=\"\",\"\",IF(OR(O42=\"NP\",O42=\"DNF\"),IF(O42=\"NP\",MAX(O$5:O$85)+COUNTIF((O$5:O$85),MAX(O$5:O$85)),MAX(O$5:O$85)+COUNTIF((O$5:O$85),MAX(O$5:O$85))+COUNTIF((O$5:O$85),\"NP\")),O42))","v":""},null,{"$f":"IF($C42=\"\",\"\",IF(S$4>$L$2,0,IF(ISNA(SMALL($E44:$K44,1)),0,SMALL($E44:$K44,1))))","v":""},{"$f":"IF($C42=\"\",\"\",IF(T$4>$L$2,0,IF(ISNA(SMALL($E44:$K44,2)),0,SMALL($E44:$K44,2))))","v":""},{"$f":"IF($C42=\"\",\"\",IF(U$4>$L$2,0,IF(ISNA(SMALL($E44:$K44,3)),0,SMALL($E44:$K44,3))))","v":""},{"$f":"IF($C42=\"\",\"\",IF(V$4>$L$2,0,IF(ISNA(SMALL($E44:$K44,4)),0,SMALL($E44:$K44,4))))","v":""},{"$f":"IF($C42=\"\",\"\",IF(W$4>$L$2,0,IF(ISNA(SMALL($E44:$K44,5)),0,SMALL($E44:$K44,5))))","v":""},{"$f":"IF($C42=\"\",\"\",IF(X$4>$L$2,0,IF(ISNA(SMALL($E44:$K44,6)),0,SMALL($E44:$K44,6))))","v":""},{"$f":"IF($C42=\"\",\"\",IF(Y$4>$L$2,0,IF(ISNA(SMALL($E44:$K44,7)),0,SMALL($E44:$K44,7))))","v":""}]
[null,null,null,"2. pokus"]
[null,null,null,"čas",{"$f":"IF(OR($C42=\"\",E42=\"\",E43=\"\"),\"\",IF(OR(AND(E42=\"NP\",E43=\"NP\"),AND(E42=\"DNF\",E43=\"DNF\")),E42,IF(AND(E42=\"NP\",E43=\"DNF\"),E42,IF(AND(E42=\"DNF\",E43=\"NP\"),E43,MIN(E42,E43)))))","v":""},"","","","","",""]
[null,{"$f":"Start!C19","v":13},{"$f":"IF(Start!D19=\"\",\"\",Start!D19)","v":""},"1. pokus",null,null,null,null,null,null,null,{"$f":"IF(C45=\"\",\"\",COUNT(E47:K47))","v":""},{"$f":"IF(C45=\"\",\"\",IF(AND(L45=0,COUNTIF(E47:K47,\"NP\")=0),\"DNF\",IF(L45<L$2,\"NP\",SUM(S45:Y47))))","v":""},null,{"$f":"IF(C45=\"\",\"\",IF(OR(M45=\"NP\",M45=\"DNF\"),M45,RANK(M45,M$5:M$85,1)))","v":""},null,{"$f":"IF(D45=\"\",\"\",IF(OR(O45=\"NP\",O45=\"DNF\"),IF(O45=\"NP\",MAX(O$5:O$85)+COUNTIF((O$5:O$85),MAX(O$5:O$85)),MAX(O$5:O$85)+COUNTIF((O$5:O$85),MAX(O$5:O$85))+COUNTIF((O$5:O$85),\"NP\")),O45))","v":""},null,{"$f":"IF($C45=\"\",\"\",IF(S$4>$L$2,0,IF(ISNA(SMALL($E47:$K47,1)),0,SMALL($E47:$K47,1))))","v":""},{"$f":"IF($C45=\"\",\"\",IF(T$4>$L$2,0,IF(ISNA(SMALL($E47:$K47,2)),0,SMALL($E47:$K47,2))))","v":""},{"$f":"IF($C45=\"\",\"\",IF(U$4>$L$2,0,IF(ISNA(SMALL($E47:$K47,3)),0,SMALL($E47:$K47,3))))","v":""},{"$f":"IF($C45=\"\",\"\",IF(V$4>$L$2,0,IF(ISNA(SMALL($E47:$K47,4)),0,SMALL($E47:$K47,4))))","v":""},{"$f":"IF($C45=\"\",\"\",IF(W$4>$L$2,0,IF(ISNA(SMALL($E47:$K47,5)),0,SMALL($E47:$K47,5))))","v":""},{"$f":"IF($C45=\"\",\"\",IF(X$4>$L$2,0,IF(ISNA(SMALL($E47:$K47,6)),0,SMALL($E47:$K47,6))))","v":""},{"$f":"IF($C45=\"\",\"\",IF(Y$4>$L$2,0,IF(ISNA(SMALL($E47:$K47,7)),0,SMALL($E47:$K47,7))))","v":""}]
[null,null,null,"2. pokus"]
[null,null,null,"čas",{"$f":"IF(OR($C45=\"\",E45=\"\",E46=\"\"),\"\",IF(OR(AND(E45=\"NP\",E46=\"NP\"),AND(E45=\"DNF\",E46=\"DNF\")),E45,IF(AND(E45=\"NP\",E46=\"DNF\"),E45,IF(AND(E45=\"DNF\",E46=\"NP\"),E46,MIN(E45,E46)))))","v":""},"","","","","",""]
[null,{"$f":"Start!C20","v":14},{"$f":"IF(Start!D20=\"\",\"\",Start!D20)","v":""},"1. pokus",null,null,null,null,null,null,null,{"$f":"IF(C48=\"\",\"\",COUNT(E50:K50))","v":""},{"$f":"IF(C48=\"\",\"\",IF(AND(L48=0,COUNTIF(E50:K50,\"NP\")=0),\"DNF\",IF(L48<L$2,\"NP\",SUM(S48:Y50))))","v":""},null,{"$f":"IF(C48=\"\",\"\",IF(OR(M48=\"NP\",M48=\"DNF\"),M48,RANK(M48,M$5:M$85,1)))","v":""},null,{"$f":"IF(D48=\"\",\"\",IF(OR(O48=\"NP\",O48=\"DNF\"),IF(O48=\"NP\",MAX(O$5:O$85)+COUNTIF((O$5:O$85),MAX(O$5:O$85)),MAX(O$5:O$85)+COUNTIF((O$5:O$85),MAX(O$5:O$85))+COUNTIF((O$5:O$85),\"NP\")),O48))","v":""},null,{"$f":"IF($C48=\"\",\"\",IF(S$4>$L$2,0,IF(ISNA(SMALL($E50:$K50,1)),0,SMALL($E50:$K50,1))))","v":""},{"$f":"IF($C48=\"\",\"\",IF(T$4>$L$2,0,IF(ISNA(SMALL($E50:$K50,2)),0,SMALL($E50:$K50,2))))","v":""},{"$f":"IF($C48=\"\",\"\",IF(U$4>$L$2,0,IF(ISNA(SMALL($E50:$K50,3)),0,SMALL($E50:$K50,3))))","v":""},{"$f":"IF($C48=\"\",\"\",IF(V$4>$L$2,0,IF(ISNA(SMALL($E50:$K50,4)),0,SMALL($E50:$K50,4))))","v":""},{"$f":"IF($C48=\"\",\"\",IF(W$4>$L$2,0,IF(ISNA(SMALL($E50:$K50,5)),0,SMALL($E50:$K50,5))))","v":""},{"$f":"IF($C48=\"\",\"\",IF(X$4>$L$2,0,IF(ISNA(SMALL($E50:$K50,6)),0,SMALL($E50:$K50,6))))","v":""},{"$f":"IF($C48=\"\",\"\",IF(Y$4>$L$2,0,IF(ISNA(SMALL($E50:$K50,7)),0,SMALL($E50:$K50,7))))","v":""}]
[null,null,null,"2. pokus"]
[null,null,null,"čas",{"$f":"IF(OR($C48=\"\",E48=\"\",E49=\"\"),\"\",IF(OR(AND(E48=\"NP\",E49=\"NP\"),AND(E48=\"DNF\",E49=\"DNF\")),E48,IF(AND(E48=\"NP\",E49=\"DNF\"),E48,IF(AND(E48=\"DNF\",E49=\"NP\"),E49,MIN(E48,E49)))))","v":""},"","","","","",""]
[null,{"$f":"Start!C21","v":15},{"$f":"IF(Start!D21=\"\",\"\",Start!D21)","v":""},"1. pokus",null,null,null,null,null,null,null,{"$f":"IF(C51=\"\",\"\",COUNT(E53:K53))","v":""},{"$f":"IF(C51=\"\",\"\",IF(AND(L51=0,COUNTIF(E53:K53,\"NP\")=0),\"DNF\",IF(L51<L$2,\"NP\",SUM(S51:Y53))))","v":""},null,{"$f":"IF(C51=\"\",\"\",IF(OR(M51=\"NP\",M51=\"DNF\"),M51,RANK(M51,M$5:M$85,1)))","v":""},null,{"$f":"IF(D51=\"\",\"\",IF(OR(O51=\"NP\",O51=\"DNF\"),IF(O51=\"NP\",MAX(O$5:O$85)+COUNTIF((O$5:O$85),MAX(O$5:O$85)),MAX(O$5:O$85)+COUNTIF((O$5:O$85),MAX(O$5:O$85))+COUNTIF((O$5:O$85),\"NP\")),O51))","v":""},null,{"$f":"IF($C51=\"\",\"\",IF(S$4>$L$2,0,IF(ISNA(SMALL($E53:$K53,1)),0,SMALL($E53:$K53,1))))","v":""},{"$f":"IF($C51=\"\",\"\",IF(T$4>$L$2,0,IF(ISNA(SMALL($E53:$K53,2)),0,SMALL($E53:$K53,2))))","v":""},{"$f":"IF($C51=\"\",\"\",IF(U$4>$L$2,0,IF(ISNA(SMALL($E53:$K53,3)),0,SMALL($E53:$K53,3))))","v":""},{"$f":"IF($C51=\"\",\"\",IF(V$4>$L$2,0,IF(ISNA(SMALL($E53:$K53,4)),0,SMALL($E53:$K53,4))))","v":""},{"$f":"IF($C51=\"\",\"\",IF(W$4>$L$2,0,IF(ISNA(SMALL($E53:$K53,5)),0,SMALL($E53:$K53,5))))","v":""},{"$f":"IF($C51=\"\",\"\",IF(X$4>$L$2,0,IF(ISNA(SMALL($E53:$K53,6)),0,SMALL($E53:$K53,6))))","v":""},{"$f":"IF($C51=\"\",\"\",IF(Y$4>$L$2,0,IF(ISNA(SMALL($E53:$K53,7)),0,SMALL($E53:$K53,7))))","v":""}]
[null,null,null,"2. pokus"]
[null,null,null,"čas",{"$f":"IF(OR($C51=\"\",E51=\"\",E52=\"\"),\"\",IF(OR(AND(E51=\"NP\",E52=\"NP\"),AND(E51=\"DNF\",E52=\"DNF\")),E51,IF(AND(E51=\"NP\",E52=\"DNF\"),E51,IF(AND(E51=\"DNF\",E52=\"NP\"),E52,MIN(E51,E52)))))","v":""},"","","","","",""]
[null,{"$f":"Start!C22","v":16},{"$f":"IF(Start!D22=\"\",\"\",Start!D22)","v":""},"1. pokus",null,null,null,null,null,null,null,{"$f":"IF(C54=\"\",\"\",COUNT(E56:K56))","v":""},{"$f":"IF(C54=\"\",\"\",IF(AND(L54=0,COUNTIF(E56:K56,\"NP\")=0),\"DNF\",IF(L54<L$2,\"NP\",SUM(S54:Y56))))","v":""},null,{"$f":"IF(C54=\"\",\"\",IF(OR(M54=\"NP\",M54=\"DNF\"),M54,RANK(M54,M$5:M$85,1)))","v":""},null,{"$f":"IF(D54=\"\",\"\",IF(OR(O54=\"NP\",O54=\"DNF\"),IF(O54=\"NP\",MAX(O$5:O$85)+COUNTIF((O$5:O$85),MAX(O$5:O$85)),MAX(O$5:O$85)+COUNTIF((O$5:O$85),MAX(O$5:O$85))+COUNTIF((O$5:O$85),\"NP\")),O54))","v":""},null,{"$f":"IF($C54=\"\",\"\",IF(S$4>$L$2,0,IF(ISNA(SMALL($E56:$K56,1)),0,SMALL($E56:$K56,1))))","v":""},{"$f":"IF($C54=\"\",\"\",IF(T$4>$L$2,0,IF(ISNA(SMALL($E56:$K56,2)),0,SMALL($E56:$K56,2))))","v":""},{"$f":"IF($C54=\"\",\"\",IF(U$4>$L$2,0,IF(ISNA(SMALL($E56:$K56,3)),0,SMALL($E56:$K56,3))))","v":""},{"$f":"IF($C54=\"\",\"\",IF(V$4>$L$2,0,IF(ISNA(SMALL($E56:$K56,4)),0,SMALL($E56:$K56,4))))","v":""},{"$f":"IF($C54=\"\",\"\",IF(W$4>$L$2,0,IF(ISNA(SMALL($E56:$K56,5)),0,SMALL($E56:$K56,5))))","v":""},{"$f":"IF($C54=\"\",\"\",IF(X$4>$L$2,0,IF(ISNA(SMALL($E56:$K56,6)),0,SMALL($E56:$K56,6))))","v":""},{"$f":"IF($C54=\"\",\"\",IF(Y$4>$L$2,0,IF(ISNA(SMALL($E56:$K56,7)),0,SMALL($E56:$K56,7))))","v":""}]
[null,null,null,"2. pokus"]
[null,null,null,"čas",{"$f":"IF(OR($C54=\"\",E54=\"\",E55=\"\"),\"\",IF(OR(AND(E54=\"NP\",E55=\"NP\"),AND(E54=\"DNF\",E55=\"DNF\")),E54,IF(AND(E54=\"NP\",E55=\"DNF\"),E54,IF(AND(E54=\"DNF\",E55=\"NP\"),E55,MIN(E54,E55)))))","v":""},"","","","","",""]
[null,{"$f":"Start!C23","v":17},{"$f":"IF(Start!D23=\"\",\"\",Start!D23)","v":""},"1. pokus",null,null,null,null,null,null,null,{"$f":"IF(C57=\"\",\"\",COUNT(E59:K59))","v":""},{"$f":"IF(C57=\"\",\"\",IF(AND(L57=0,COUNTIF(E59:K59,\"NP\")=0),\"DNF\",IF(L57<L$2,\"NP\",SUM(S57:Y59))))","v":""},null,{"$f":"IF(C57=\"\",\"\",IF(OR(M57=\"NP\",M57=\"DNF\"),M57,RANK(M57,M$5:M$85,1)))","v":""},null,{"$f":"IF(D57=\"\",\"\",IF(OR(O57=\"NP\",O57=\"DNF\"),IF(O57=\"NP\",MAX(O$5:O$85)+COUNTIF((O$5:O$85),MAX(O$5:O$85)),MAX(O$5:O$85)+COUNTIF((O$5:O$85),MAX(O$5:O$85))+COUNTIF((O$5:O$85),\"NP\")),O57))","v":""},null,{"$f":"IF($C57=\"\",\"\",IF(S$4>$L$2,0,IF(ISNA(SMALL($E59:$K59,1)),0,SMALL($E59:$K59,1))))","v":""},{"$f":"IF($C57=\"\",\"\",IF(T$4>$L$2,0,IF(ISNA(SMALL($E59:$K59,2)),0,SMALL($E59:$K59,2))))","v":""},{"$f":"IF($C57=\"\",\"\",IF(U$4>$L$2,0,IF(ISNA(SMALL($E59:$K59,3)),0,SMALL($E59:$K59,3))))","v":""},{"$f":"IF($C57=\"\",\"\",IF(V$4>$L$2,0,IF(ISNA(SMALL($E59:$K59,4)),0,SMALL($E59:$K59,4))))","v":""},{"$f":"IF($C57=\"\",\"\",IF(W$4>$L$2,0,IF(ISNA(SMALL($E59:$K59,5)),0,SMALL($E59:$K59,5))))","v":""},{"$f":"IF($C57=\"\",\"\",IF(X$4>$L$2,0,IF(ISNA(SMALL($E59:$K59,6)),0,SMALL($E59:$K59,6))))","v":""},{"$f":"IF($C57=\"\",\"\",IF(Y$4>$L$2,0,IF(ISNA(SMALL($E59:$K59,7)),0,SMALL($E59:$K59,7))))","v":""}]
[null,null,null,"2. pokus"]
[null,null,null,"čas",{"$f":"IF(OR($C57=\"\",E57=\"\",E58=\"\"),\"\",IF(OR(AND(E57=\"NP\",E58=\"NP\"),AND(E57=\"DNF\",E58=\"DNF\")),E57,IF(AND(E57=\"NP\",E58=\"DNF\"),E57,IF(AND(E57=\"DNF\",E58=\"NP\"),E58,MIN(E57,E58)))))","v":""},"","","","","",""]
[null,{"$f":"Start!C24","v":18},{"$f":"IF(Start!D24=\"\",\"\",Start!D24)","v":""},"1. pokus",null,null,null,null,null,null,null,{"$f":"IF(C60=\"\",\"\",COUNT(E62:K62))","v":""},{"$f":"IF(C60=\"\",\"\",IF(AND(L60=0,COUNTIF(E62:K62,\"NP\")=0),\"DNF\",IF(L60<L$2,\"NP\",SUM(S60:Y62))))","v":""},null,{"$f":"IF(C60=\"\",\"\",IF(OR(M60=\"NP\",M60=\"DNF\"),M60,RANK(M60,M$5:M$85,1)))","v":""},null,{"$f":"IF(D60=\"\",\"\",IF(OR(O60=\"NP\",O60=\"DNF\"),IF(O60=\"NP\",MAX(O$5:O$85)+COUNTIF((O$5:O$85),MAX(O$5:O$85)),MAX(O$5:O$85)+COUNTIF((O$5:O$85),MAX(O$5:O$85))+COUNTIF((O$5:O$85),\"NP\")),O60))","v":""},null,{"$f":"IF($C60=\"\",\"\",IF(S$4>$L$2,0,IF(ISNA(SMALL($E62:$K62,1)),0,SMALL($E62:$K62,1))))","v":""},{"$f":"IF($C60=\"\",\"\",IF(T$4>$L$2,0,IF(ISNA(SMALL($E62:$K62,2)),0,SMALL($E62:$K62,2))))","v":""},{"$f":"IF($C60=\"\",\"\",IF(U$4>$L$2,0,IF(ISNA(SMALL($E62:$K62,3)),0,SMALL($E62:$K62,3))))","v":""},{"$f":"IF($C60=\"\",\"\",IF(V$4>$L$2,0,IF(ISNA(SMALL($E62:$K62,4)),0,SMALL($E62:$K62,4))))","v":""},{"$f":"IF($C60=\"\",\"\",IF(W$4>$L$2,0,IF(ISNA(SMALL($E62:$K62,5)),0,SMALL($E62:$K62,5))))","v":""},{"$f":"IF($C60=\"\",\"\",IF(X$4>$L$2,0,IF(ISNA(SMALL($E62:$K62,6)),0,SMALL($E62:$K62,6))))","v":""},{"$f":"IF($C60=\"\",\"\",IF(Y$4>$L$2,0,IF(ISNA(SMALL($E62:$K62,7)),0,SMALL($E62:$K62,7))))","v":""}]
[null,null,null,"2. pokus"]
[null,null,null,"čas",{"$f":"IF(OR($C60=\"\",E60=\"\",E61=\"\"),\"\",IF(OR(AND(E60=\"NP\",E61=\"NP\"),AND(E60=\"DNF\",E61=\"DNF\")),E60,IF(AND(E60=\"NP\",E61=\"DNF\"),E60,IF(AND(E60=\"DNF\",E61=\"NP\"),E61,MIN(E60,E61)))))","v":""},"","","","","",""]
[null,{"$f":"Start!C25","v":19},{"$f":"IF(Start!D25=\"\",\"\",Start!D25)","v":""},"1. pokus",null,null,null,null,null,null,null,{"$f":"IF(C63=\"\",\"\",COUNT(E65:K65))","v":""},{"$f":"IF(C63=\"\",\"\",IF(AND(L63=0,COUNTIF(E65:K65,\"NP\")=0),\"DNF\",IF(L63<L$2,\"NP\",SUM(S63:Y65))))","v":""},null,{"$f":"IF(C63=\"\",\"\",IF(OR(M63=\"NP\",M63=\"DNF\"),M63,RANK(M63,M$5:M$85,1)))","v":""},null,{"$f":"IF(D63=\"\",\"\",IF(OR(O63=\"NP\",O63=\"DNF\"),IF(O63=\"NP\",MAX(O$5:O$85)+COUNTIF((O$5:O$85),MAX(O$5:O$85)),MAX(O$5:O$85)+COUNTIF((O$5:O$85),MAX(O$5:O$85))+COUNTIF((O$5:O$85),\"NP\")),O63))","v":""},null,{"$f":"IF($C63=\"\",\"\",IF(S$4>$L$2,0,IF(ISNA(SMALL($E65:$K65,1)),0,SMALL($E65:$K65,1))))","v":""},{"$f":"IF($C63=\"\",\"\",IF(T$4>$L$2,0,IF(ISNA(SMALL($E65:$K65,2)),0,SMALL($E65:$K65,2))))","v":""},{"$f":"IF($C63=\"\",\"\",IF(U$4>$L$2,0,IF(ISNA(SMALL($E65:$K65,3)),0,SMALL($E65:$K65,3))))","v":""},{"$f":"IF($C63=\"\",\"\",IF(V$4>$L$2,0,IF(ISNA(SMALL($E65:$K65,4)),0,SMALL($E65:$K65,4))))","v":""},{"$f":"IF($C63=\"\",\"\",IF(W$4>$L$2,0,IF(ISNA(SMALL($E65:$K65,5)),0,SMALL($E65:$K65,5))))","v":""},{"$f":"IF($C63=\"\",\"\",IF(X$4>$L$2,0,IF(ISNA(SMALL($E65:$K65,6)),0,SMALL($E65:$K65,6))))","v":""},{"$f":"IF($C63=\"\",\"\",IF(Y$4>$L$2,0,IF(ISNA(SMALL($E65:$K65,7)),0,SMALL($E65:$K65,7))))","v":""}]
[null,null,null,"2. pokus"]
[null,null,null,"čas",{"$f":"IF(OR($C63=\"\",E63=\"\",E64=\"\"),\"\",IF(OR(AND(E63=\"NP\",E64=\"NP\"),AND(E63=\"DNF\",E64=\"DNF\")),E63,IF(AND(E63=\"NP\",E64=\"DNF\"),E63,IF(AND(E63=\"DNF\",E64=\"NP\"),E64,MIN(E63,E64)))))","v":""},"","","","","",""]
[null,{"$f":"Start!C26","v":20},{"$f":"IF(Start!D26=\"\",\"\",Start!D26)","v":""},"1. pokus",null,null,null,null,null,null,null,{"$f":"IF(C66=\"\",\"\",COUNT(E68:K68))","v":""},{"$f":"IF(C66=\"\",\"\",IF(AND(L66=0,COUNTIF(E68:K68,\"NP\")=0),\"DNF\",IF(L66<L$2,\"NP\",SUM(S66:Y68))))","v":""},null,{"$f":"IF(C66=\"\",\"\",IF(OR(M66=\"NP\",M66=\"DNF\"),M66,RANK(M66,M$5:M$85,1)))","v":""},null,{"$f":"IF(D66=\"\",\"\",IF(OR(O66=\"NP\",O66=\"DNF\"),IF(O66=\"NP\",MAX(O$5:O$85)+COUNTIF((O$5:O$85),MAX(O$5:O$85)),MAX(O$5:O$85)+COUNTIF((O$5:O$85),MAX(O$5:O$85))+COUNTIF((O$5:O$85),\"NP\")),O66))","v":""},null,{"$f":"IF($C66=\"\",\"\",IF(S$4>$L$2,0,IF(ISNA(SMALL($E68:$K68,1)),0,SMALL($E68:$K68,1))))","v":""},{"$f":"IF($C66=\"\",\"\",IF(T$4>$L$2,0,IF(ISNA(SMALL($E68:$K68,2)),0,SMALL($E68:$K68,2))))","v":""},{"$f":"IF($C66=\"\",\"\",IF(U$4>$L$2,0,IF(ISNA(SMALL($E68:$K68,3)),0,SMALL($E68:$K68,3))))","v":""},{"$f":"IF($C66=\"\",\"\",IF(V$4>$L$2,0,IF(ISNA(SMALL($E68:$K68,4)),0,SMALL($E68:$K68,4))))","v":""},{"$f":"IF($C66=\"\",\"\",IF(W$4>$L$2,0,IF(ISNA(SMALL($E68:$K68,5)),0,SMALL($E68:$K68,5))))","v":""},{"$f":"IF($C66=\"\",\"\",IF(X$4>$L$2,0,IF(ISNA(SMALL($E68:$K68,6)),0,SMALL($E68:$K68,6))))","v":""},{"$f":"IF($C66=\"\",\"\",IF(Y$4>$L$2,0,IF(ISNA(SMALL($E68:$K68,7)),0,SMALL($E68:$K68,7))))","v":""}]
[null,null,null,"2. pokus"]
[null,null,null,"čas",{"$f":"IF(OR($C66=\"\",E66=\"\",E67=\"\"),\"\",IF(OR(AND(E66=\"NP\",E67=\"NP\"),AND(E66=\"DNF\",E67=\"DNF\")),E66,IF(AND(E66=\"NP\",E67=\"DNF\"),E66,IF(AND(E66=\"DNF\",E67=\"NP\"),E67,MIN(E66,E67)))))","v":""},"","","","","",""]
[null,{"$f":"B35","v":"Běh na 100m s překážkami - Pořadí družstev"}]
[]
[null,null,{"$f":"Start!$D$5","v":"dorostenky"},null,"Soutěžící"]
[null,"st.č.","SDH","Pokus",1,2,3,4,5,6,7,"P","C.čas",null,"Poř.",null,"Body"]
[null,{"$f":"Start!C27","v":21},{"$f":"IF(Start!D27=\"\",\"\",Start!D27)","v":""},"1. pokus",null,null,null,null,null,null,null,{"$f":"IF(C73=\"\",\"\",COUNT(E75:K75))","v":""},{"$f":"IF(C73=\"\",\"\",IF(AND(L73=0,COUNTIF(E75:K75,\"NP\")=0),\"DNF\",IF(L73<L$2,\"NP\",SUM(S73:Y75))))","v":""},null,{"$f":"IF(C73=\"\",\"\",IF(OR(M73=\"NP\",M73=\"DNF\"),M73,RANK(M73,M$5:M$85,1)))","v":""},null,{"$f":"IF(D73=\"\",\"\",IF(OR(O73=\"NP\",O73=\"DNF\"),IF(O73=\"NP\",MAX(O$5:O$85)+COUNTIF((O$5:O$85),MAX(O$5:O$85)),MAX(O$5:O$85)+COUNTIF((O$5:O$85),MAX(O$5:O$85))+COUNTIF((O$5:O$85),\"NP\")),O73))","v":""},null,{"$f":"IF($C73=\"\",\"\",IF(S$4>$L$2,0,IF(ISNA(SMALL($E75:$K75,1)),0,SMALL($E75:$K75,1))))","v":""},{"$f":"IF($C73=\"\",\"\",IF(T$4>$L$2,0,IF(ISNA(SMALL($E75:$K75,2)),0,SMALL($E75:$K75,2))))","v":""},{"$f":"IF($C73=\"\",\"\",IF(U$4>$L$2,0,IF(ISNA(SMALL($E75:$K75,3)),0,SMALL($E75:$K75,3))))","v":""},{"$f":"IF($C73=\"\",\"\",IF(V$4>$L$2,0,IF(ISNA(SMALL($E75:$K75,4)),0,SMALL($E75:$K75,4))))","v":""},{"$f":"IF($C73=\"\",\"\",IF(W$4>$L$2,0,IF(ISNA(SMALL($E75:$K75,5)),0,SMALL($E75:$K75,5))))","v":""},{"$f":"IF($C73=\"\",\"\",IF(X$4>$L$2,0,IF(ISNA(SMALL($E75:$K75,6)),0,SMALL($E75:$K75,6))))","v":""},{"$f":"IF($C73=\"\",\"\",IF(Y$4>$L$2,0,IF(ISNA(SMALL($E75:$K75,7)),0,SMALL($E75:$K75,7))))","v":""}]
[null,null,null,"2. pokus"]
[null,null,null,"čas",{"$f":"IF(OR($C73=\"\",E73=\"\",E74=\"\"),\"\",IF(OR(AND(E73=\"NP\",E74=\"NP\"),AND(E73=\"DNF\",E74=\"DNF\")),E73,IF(AND(E73=\"NP\",E74=\"DNF\"),E73,IF(AND(E73=\"DNF\",E74=\"NP\"),E74,MIN(E73,E74)))))","v":""},"","","","","",""]
[null,{"$f":"Start!C28","v":22},{"$f":"IF(Start!D28=\"\",\"\",Start!D28)","v":""},"1. pokus",null,null,null,null,null,null,null,{"$f":"IF(C76=\"\",\"\",COUNT(E78:K78))","v":""},{"$f":"IF(C76=\"\",\"\",IF(AND(L76=0,COUNTIF(E78:K78,\"NP\")=0),\"DNF\",IF(L76<L$2,\"NP\",SUM(S76:Y78))))","v":""},null,{"$f":"IF(C76=\"\",\"\",IF(OR(M76=\"NP\",M76=\"DNF\"),M76,RANK(M76,M$5:M$85,1)))","v":""},null,{"$f":"IF(D76=\"\",\"\",IF(OR(O76=\"NP\",O76=\"DNF\"),IF(O76=\"NP\",MAX(O$5:O$85)+COUNTIF((O$5:O$85),MAX(O$5:O$85)),MAX(O$5:O$85)+COUNTIF((O$5:O$85),MAX(O$5:O$85))+COUNTIF((O$5:O$85),\"NP\")),O76))","v":""},null,{"$f":"IF($C76=\"\",\"\",IF(S$4>$L$2,0,IF(ISNA(SMALL($E78:$K78,1)),0,SMALL($E78:$K78,1))))","v":""},{"$f":"IF($C76=\"\",\"\",IF(T$4>$L$2,0,IF(ISNA(SMALL($E78:$K78,2)),0,SMALL($E78:$K78,2))))","v":""},{"$f":"IF($C76=\"\",\"\",IF(U$4>$L$2,0,IF(ISNA(SMALL($E78:$K78,3)),0,SMALL($E78:$K78,3))))","v":""},{"$f":"IF($C76=\"\",\"\",IF(V$4>$L$2,0,IF(ISNA(SMALL($E78:$K78,4)),0,SMALL($E78:$K78,4))))","v":""},{"$f":"IF($C76=\"\",\"\",IF(W$4>$L$2,0,IF(ISNA(SMALL($E78:$K78,5)),0,SMALL($E78:$K78,5))))","v":""},{"$f":"IF($C76=\"\",\"\",IF(X$4>$L$2,0,IF(ISNA(SMALL($E78:$K78,6)),0,SMALL($E78:$K78,6))))","v":""},{"$f":"IF($C76=\"\",\"\",IF(Y$4>$L$2,0,IF(ISNA(SMALL($E78:$K78,7)),0,SMALL($E78:$K78,7))))","v":""}]
[null,null,null,"2. pokus"]
[null,null,null,"čas",{"$f":"IF(OR($C76=\"\",E76=\"\",E77=\"\"),\"\",IF(OR(AND(E76=\"NP\",E77=\"NP\"),AND(E76=\"DNF\",E77=\"DNF\")),E76,IF(AND(E76=\"NP\",E77=\"DNF\"),E76,IF(AND(E76=\"DNF\",E77=\"NP\"),E77,MIN(E76,E77)))))","v":""},"","","","","",""]
[null,{"$f":"Start!C29","v":23},{"$f":"IF(Start!D29=\"\",\"\",Start!D29)","v":""},"1. pokus",null,null,null,null,null,null,null,{"$f":"IF(C79=\"\",\"\",COUNT(E81:K81))","v":""},{"$f":"IF(C79=\"\",\"\",IF(AND(L79=0,COUNTIF(E81:K81,\"NP\")=0),\"DNF\",IF(L79<L$2,\"NP\",SUM(S79:Y81))))","v":""},null,{"$f":"IF(C79=\"\",\"\",IF(OR(M79=\"NP\",M79=\"DNF\"),M79,RANK(M79,M$5:M$85,1)))","v":""},null,{"$f":"IF(D79=\"\",\"\",IF(OR(O79=\"NP\",O79=\"DNF\"),IF(O79=\"NP\",MAX(O$5:O$85)+COUNTIF((O$5:O$85),MAX(O$5:O$85)),MAX(O$5:O$85)+COUNTIF((O$5:O$85),MAX(O$5:O$85))+COUNTIF((O$5:O$85),\"NP\")),O79))","v":""},null,{"$f":"IF($C79=\"\",\"\",IF(S$4>$L$2,0,IF(ISNA(SMALL($E81:$K81,1)),0,SMALL($E81:$K81,1))))","v":""},{"$f":"IF($C79=\"\",\"\",IF(T$4>$L$2,0,IF(ISNA(SMALL($E81:$K81,2)),0,SMALL($E81:$K81,2))))","v":""},{"$f":"IF($C79=\"\",\"\",IF(U$4>$L$2,0,IF(ISNA(SMALL($E81:$K81,3)),0,SMALL($E81:$K81,3))))","v":""},{"$f":"IF($C79=\"\",\"\",IF(V$4>$L$2,0,IF(ISNA(SMALL($E81:$K81,4)),0,SMALL($E81:$K81,4))))","v":""},{"$f":"IF($C79=\"\",\"\",IF(W$4>$L$2,0,IF(ISNA(SMALL($E81:$K81,5)),0,SMALL($E81:$K81,5))))","v":""},{"$f":"IF($C79=\"\",\"\",IF(X$4>$L$2,0,IF(ISNA(SMALL($E81:$K81,6)),0,SMALL($E81:$K81,6))))","v":""},{"$f":"IF($C79=\"\",\"\",IF(Y$4>$L$2,0,IF(ISNA(SMALL($E81:$K81,7)),0,SMALL($E81:$K81,7))))","v":""}]
[null,null,null,"2. pokus"]
[null,null,null,"čas",{"$f":"IF(OR($C79=\"\",E79=\"\",E80=\"\"),\"\",IF(OR(AND(E79=\"NP\",E80=\"NP\"),AND(E79=\"DNF\",E80=\"DNF\")),E79,IF(AND(E79=\"NP\",E80=\"DNF\"),E79,IF(AND(E79=\"DNF\",E80=\"NP\"),E80,MIN(E79,E80)))))","v":""},"","","","","",""]
[null,{"$f":"Start!C30","v":24},{"$f":"IF(Start!D30=\"\",\"\",Start!D30)","v":""},"1. pokus",null,null,null,null,null,null,null,{"$f":"IF(C82=\"\",\"\",COUNT(E84:K84))","v":""},{"$f":"IF(C82=\"\",\"\",IF(AND(L82=0,COUNTIF(E84:K84,\"NP\")=0),\"DNF\",IF(L82<L$2,\"NP\",SUM(S82:Y84))))","v":""},null,{"$f":"IF(C82=\"\",\"\",IF(OR(M82=\"NP\",M82=\"DNF\"),M82,RANK(M82,M$5:M$85,1)))","v":""},null,{"$f":"IF(D82=\"\",\"\",IF(OR(O82=\"NP\",O82=\"DNF\"),IF(O82=\"NP\",MAX(O$5:O$85)+COUNTIF((O$5:O$85),MAX(O$5:O$85)),MAX(O$5:O$85)+COUNTIF((O$5:O$85),MAX(O$5:O$85))+COUNTIF((O$5:O$85),\"NP\")),O82))","v":""},null,{"$f":"IF($C82=\"\",\"\",IF(S$4>$L$2,0,IF(ISNA(SMALL($E84:$K84,1)),0,SMALL($E84:$K84,1))))","v":""},{"$f":"IF($C82=\"\",\"\",IF(T$4>$L$2,0,IF(ISNA(SMALL($E84:$K84,2)),0,SMALL($E84:$K84,2))))","v":""},{"$f":"IF($C82=\"\",\"\",IF(U$4>$L$2,0,IF(ISNA(SMALL($E84:$K84,3)),0,SMALL($E84:$K84,3))))","v":""},{"$f":"IF($C82=\"\",\"\",IF(V$4>$L$2,0,IF(ISNA(SMALL($E84:$K84,4)),0,SMALL($E84:$K84,4))))","v":""},{"$f":"IF($C82=\"\",\"\",IF(W$4>$L$2,0,IF(ISNA(SMALL($E84:$K84,5)),0,SMALL($E84:$K84,5))))","v":""},{"$f":"IF($C82=\"\",\"\",IF(X$4>$L$2,0,IF(ISNA(SMALL($E84:$K84,6)),0,SMALL($E84:$K84,6))))","v":""},{"$f":"IF($C82=\"\",\"\",IF(Y$4>$L$2,0,IF(ISNA(SMALL($E84:$K84,7)),0,SMALL($E84:$K84,7))))","v":""}]
[null,null,null,"2. pokus"]
[null,null,null,"čas",{"$f":"IF(OR($C82=\"\",E82=\"\",E83=\"\"),\"\",IF(OR(AND(E82=\"NP\",E83=\"NP\"),AND(E82=\"DNF\",E83=\"DNF\")),E82,IF(AND(E82=\"NP\",E83=\"DNF\"),E82,IF(AND(E82=\"DNF\",E83=\"NP\"),E83,MIN(E82,E83)))))","v":""},"","","","","",""]
[null,{"$f":"Start!C31","v":25},{"$f":"IF(Start!D31=\"\",\"\",Start!D31)","v":""},"1. pokus",null,null,null,null,null,null,null,{"$f":"IF(C85=\"\",\"\",COUNT(E87:K87))","v":""},{"$f":"IF(C85=\"\",\"\",IF(AND(L85=0,COUNTIF(E87:K87,\"NP\")=0),\"DNF\",IF(L85<L$2,\"NP\",SUM(S85:Y87))))","v":""},null,{"$f":"IF(C85=\"\",\"\",IF(OR(M85=\"NP\",M85=\"DNF\"),M85,RANK(M85,M$5:M$85,1)))","v":""},null,{"$f":"IF(D85=\"\",\"\",IF(OR(O85=\"NP\",O85=\"DNF\"),IF(O85=\"NP\",MAX(O$5:O$85)+COUNTIF((O$5:O$85),MAX(O$5:O$85)),MAX(O$5:O$85)+COUNTIF((O$5:O$85),MAX(O$5:O$85))+COUNTIF((O$5:O$85),\"NP\")),O85))","v":""},null,{"$f":"IF($C85=\"\",\"\",IF(S$4>$L$2,0,IF(ISNA(SMALL($E87:$K87,1)),0,SMALL($E87:$K87,1))))","v":""},{"$f":"IF($C85=\"\",\"\",IF(T$4>$L$2,0,IF(ISNA(SMALL($E87:$K87,2)),0,SMALL($E87:$K87,2))))","v":""},{"$f":"IF($C85=\"\",\"\",IF(U$4>$L$2,0,IF(ISNA(SMALL($E87:$K87,3)),0,SMALL($E87:$K87,3))))","v":""},{"$f":"IF($C85=\"\",\"\",IF(V$4>$L$2,0,IF(ISNA(SMALL($E87:$K87,4)),0,SMALL($E87:$K87,4))))","v":""},{"$f":"IF($C85=\"\",\"\",IF(W$4>$L$2,0,IF(ISNA(SMALL($E87:$K87,5)),0,SMALL($E87:$K87,5))))","v":""},{"$f":"IF($C85=\"\",\"\",IF(X$4>$L$2,0,IF(ISNA(SMALL($E87:$K87,6)),0,SMALL($E87:$K87,6))))","v":""},{"$f":"IF($C85=\"\",\"\",IF(Y$4>$L$2,0,IF(ISNA(SMALL($E87:$K87,7)),0,SMALL($E87:$K87,7))))","v":""}]
[null,null,null,"2. pokus"]
[null,null,null,"čas",{"$f":"IF(OR($C85=\"\",E85=\"\",E86=\"\"),\"\",IF(OR(AND(E85=\"NP\",E86=\"NP\"),AND(E85=\"DNF\",E86=\"DNF\")),E85,IF(AND(E85=\"NP\",E86=\"DNF\"),E85,IF(AND(E85=\"DNF\",E86=\"NP\"),E86,MIN(E85,E86)))))","v":""},"","","","","",""]

{"sheet":"TEST","index":17,"n_rows":29,"n_cols":8,"rows_kept":29,"cut":false,"hidden":false,"merged":[[0,1,0,7]]}
[null,"TEST"]
[]
[null,null,{"$f":"Start!D5","v":"dorostenky"}]
[null,"st.č.","SDH","Tr.b.",null,"Poř.",null,"Poř."]
[null,{"$f":"Start!C7","v":1},{"$f":"IF(Start!D7=\"\",\"\",Start!D7)","v":"Kamenec"},0,null,{"$f":"IF(C5=\"\",\"\",IF(D5=\"\",\"DNF\",IF(OR(D5=\"NP\",D5=\"DNF\"),D5,RANK(D5,D$5:D$28,1))))","v":1},null,{"$f":"IF(C5=\"\",\"\",IF(OR(F5=\"NP\",F5=\"DNF\"),IF(F5=\"NP\",MAX(F$5:F$29)+COUNTIF((F$5:F$29),MAX(F$5:F$29)),MAX(F$5:F$29)+COUNTIF((F$5:F$29),MAX(F$5:F$29))+COUNTIF((F$5:F$29),\"NP\")),F5))","v":1}]
[null,{"$f":"Start!C8","v":2},{"$f":"IF(Start!D8=\"\",\"\",Start!D8)","v":"Lukavice"},1,null,5,null,5]
[null,{"$f":"Start!C9","v":3},{"$f":"IF(Start!D9=\"\",\"\",Start!D9)","v":"Lubná"},0,null,1,null,1]
[null,{"$f":"Start!C10","v":4},{"$f":"IF(Start!D10=\"\",\"\",Start!D10)","v":"Skuteč"},0,null,1,null,1]
[null,{"$f":"Start!C11","v":5},{"$f":"IF(Start!D11=\"\",\"\",Start!D11)","v":"Bystřec"},3,null,6,null,6]
[null,{"$f":"Start!C12","v":6},{"$f":"IF(Start!D12=\"\",\"\",Start!D12)","v":"Letohrad Kunčice"},0,null,1,null,1]
[null,{"$f":"Start!C13","v":7},{"$f":"IF(Start!D13=\"\",\"\",Start!D13)","v":""},{"$f":"IF(C11=\"\",\"\",0)","v":""},null,"",null,""]
[null,{"$f":"Start!C14","v":8},{"$f":"IF(Start!D14=\"\",\"\",Start!D14)","v":""},"",null,"",null,""]
[null,{"$f":"Start!C15","v":9},{"$f":"IF(Start!D15=\"\",\"\",Start!D15)","v":""},"",null,"",null,""]
[null,{"$f":"Start!C16","v":10},{"$f":"IF(Start!D16=\"\",\"\",Start!D16)","v":""},"",null,"",null,""]
[null,{"$f":"Start!C17","v":11},{"$f":"IF(Start!D17=\"\",\"\",Start!D17)","v":""},"",null,"",null,""]
[null,{"$f":"Start!C18","v":12},{"$f":"IF(Start!D18=\"\",\"\",Start!D18)","v":""},"",null,"",null,""]
[null,{"$f":"Start!C19","v":13},{"$f":"IF(Start!D19=\"\",\"\",Start!D19)","v":""},"",null,"",null,""]
[null,{"$f":"Start!C20","v":14},{"$f":"IF(Start!D20=\"\",\"\",Start!D20)","v":""},"",null,"",null,""]
[null,{"$f":"Start!C21","v":15},{"$f":"IF(Start!D21=\"\",\"\",Start!D21)","v":""},"",null,"",null,""]
[null,{"$f":"Start!C22","v":16},{"$f":"IF(Start!D22=\"\",\"\",Start!D22)","v":""},"",null,"",null,""]
[null,{"$f":"Start!C23","v":17},{"$f":"IF(Start!D23=\"\",\"\",Start!D23)","v":""},"",null,"",null,""]
[null,{"$f":"Start!C24","v":18},{"$f":"IF(Start!D24=\"\",\"\",Start!D24)","v":""},{"$f":"IF(C22=\"\",\"\",0)","v":""},null,"",null,""]
[null,{"$f":"Start!C25","v":19},{"$f":"IF(Start!D25=\"\",\"\",Start!D25)","v":""},"",null,"",null,""]
[null,{"$f":"Start!C26","v":20},{"$f":"IF(Start!D26=\"\",\"\",Start!D26)","v":""},"",null,"",null,""]
[null,{"$f":"Start!C27","v":21},{"$f":"IF(Start!D27=\"\",\"\",Start!D27)","v":""},"",null,"",null,""]
[null,{"$f":"Start!C28","v":22},{"$f":"IF(Start!D28=\"\",\"\",Start!D28)","v":""},"",null,"",null,""]
[null,{"$f":"Start!C29","v":23},{"$f":"IF(Start!D29=\"\",\"\",Start!D29)","v":""},"",null,"",null,""]
[null,{"$f":"Start!C30","v":24},{"$f":"IF(Start!D30=\"\",\"\",Start!D30)","v":""},"",null,"",null,""]
[null,{"$f":"Start!C31","v":25},{"$f":"IF(Start!D31=\"\",\"\",Start!D31)","v":""},"",null,"",null,""]

{"sheet":"PÚ","index":18,"n_rows":29,"n_cols":16,"rows_kept":29,"cut":false,"hidden":false,"merged":[[0,1,0,15],[2,3,2,6],[2,7,2,10]]}
[null,"Požární útok"]
[]
[null,null,{"$f":"Start!$D$5","v":"dorostenky"},"I.p.",null,null,null,"II.p."]
[null,"st.č.","SDH",1,2,3,"čas",1,2,3,"čas","C.čas",null,"Poř.",null,"Poř."]
[null,{"$f":"Start!C7","v":1},{"$f":"IF(Start!D7=\"\",\"\",Start!D7)","v":"Kamenec"},40.130000000000003,null,null,{"$f":"IF($C5=\"\",\"\",IF(OR($D5=\"DNF\",$E5=\"DNF\",$F5=\"DNF\",AND($D5=\"\",$E5=\"\",$F5=\"\")),\"DNF\",IF(OR($D5=\"NP\",$E5=\"NP\",$F5=\"NP\"),\"NP\",IF(ISERROR(MEDIAN($D5:$F5)),\"DNF\",IF(OR($D5=\"X\",$E5=\"X\",$F5=\"X\",$D5=\"\",$E5=\"\",$F5=\"\",$D5=\"x\",$E5=\"x\",$F5=\"x\"),MAX($D5:$F5),MEDIAN($D5:$F5))))))","v":40.130000000000003},38.229999999999997,null,null,{"$f":"IF($C5=\"\",\"\",IF(OR($H5=\"DNF\",$I5=\"DNF\",$J5=\"DNF\",AND($H5=\"\",$I5=\"\",$J5=\"\")),\"DNF\",IF(OR($H5=\"NP\",$I5=\"NP\",$J5=\"NP\"),\"NP\",IF(ISERROR(MEDIAN($H5:$J5)),\"DNF\",IF(OR($H5=\"X\",$I5=\"X\",$J5=\"X\",$H5=\"\",$I5=\"\",$J5=\"\",$H5=\"x\",$I5=\"x\",$J5=\"x\"),MAX($H5:$J5),MEDIAN($H5:$J5))))))","v":38.229999999999997},{"$f":"IF(C5=\"\",\"\",IF(OR(AND(G5=\"NP\",K5=\"NP\"),AND(G5=\"DNF\",K5=\"DNF\")),G5,IF(AND(G5=\"NP\",K5=\"DNF\"),G5,IF(AND(G5=\"DNF\",K5=\"NP\"),K5,MIN(G5,K5)))))","v":38.229999999999997},null,{"$f":"IF(C5=\"\",\"\",IF(OR(L5=\"NP\",L5=\"DNF\"),L5,RANK(L5,L$5:L$29,1)))","v":2},null,{"$f":"IF(C5=\"\",\"\",IF(OR(N5=\"NP\",N5=\"DNF\"),IF(N5=\"NP\",MAX(N$5:N$28)+COUNTIF((N$5:N$28),MAX(N$5:N$28)),MAX(N$5:N$28)+COUNTIF((N$5:N$28),MAX(N$5:N$28))+COUNTIF((N$5:N$28),\"NP\")),N5))","v":2}]
[null,{"$f":"Start!C8","v":2},{"$f":"IF(Start!D8=\"\",\"\",Start!D8)","v":"Lukavice"},"NP",null,null,{"$f":"IF($C6=\"\",\"\",IF(OR($D6=\"DNF\",$E6=\"DNF\",$F6=\"DNF\",AND($D6=\"\",$E6=\"\",$F6=\"\")),\"DNF\",IF(OR($D6=\"NP\",$E6=\"NP\",$F6=\"NP\"),\"NP\",IF(ISERROR(MEDIAN($D6:$F6)),\"DNF\",IF(OR($D6=\"X\",$E6=\"X\",$F6=\"X\",$D6=\"\",$E6=\"\",$F6=\"\",$D6=\"x\",$E6=\"x\",$F6=\"x\"),MAX($D6:$F6),MEDIAN($D6:$F6))))))","v":"NP"},62.53,null,null,{"$f":"IF($C6=\"\",\"\",IF(OR($H6=\"DNF\",$I6=\"DNF\",$J6=\"DNF\",AND($H6=\"\",$I6=\"\",$J6=\"\")),\"DNF\",IF(OR($H6=\"NP\",$I6=\"NP\",$J6=\"NP\"),\"NP\",IF(ISERROR(MEDIAN($H6:$J6)),\"DNF\",IF(OR($H6=\"X\",$I6=\"X\",$J6=\"X\",$H6=\"\",$I6=\"\",$J6=\"\",$H6=\"x\",$I6=\"x\",$J6=\"x\"),MAX($H6:$J6),MEDIAN($H6:$J6))))))","v":62.53},{"$f":"IF(C6=\"\",\"\",IF(OR(AND(G6=\"NP\",K6=\"NP\"),AND(G6=\"DNF\",K6=\"DNF\")),G6,IF(AND(G6=\"NP\",K6=\"DNF\"),G6,IF(AND(G6=\"DNF\",K6=\"NP\"),K6,MIN(G6,K6)))))","v":62.53},null,5,null,5]
[null,{"$f":"Start!C9","v":3},{"$f":"IF(Start!D9=\"\",\"\",Start!D9)","v":"Lubná"},34.39,null,null,34.39,50.33,null,null,50.33,34.39,null,1,null,1]
[null,{"$f":"Start!C10","v":4},{"$f":"IF(Start!D10=\"\",\"\",Start!D10)","v":"Skuteč"},41.35,null,null,41.35,42.14,null,null,42.14,41.35,null,4,null,4]
[null,{"$f":"Start!C11","v":5},{"$f":"IF(Start!D11=\"\",\"\",Start!D11)","v":"Bystřec"},73.44,null,null,73.44,"DNF",null,null,"DNF",73.44,null,6,null,6]
[null,{"$f":"Start!C12","v":6},{"$f":"IF(Start!D12=\"\",\"\",Start!D12)","v":"Letohrad Kunčice"},39.6,null,null,39.6,40.07,null,null,40.07,39.6,null,3,null,3]
[null,{"$f":"Start!C13","v":7},{"$f":"IF(Start!D13=\"\",\"\",Start!D13)","v":""},null,null,null,"",null,null,null,"","",null,"",null,""]
[null,{"$f":"Start!C14","v":8},{"$f":"IF(Start!D14=\"\",\"\",Start!D14)","v":""},null,null,null,"",null,null,null,"","",null,"",null,""]
[null,{"$f":"Start!C15","v":9},{"$f":"IF(Start!D15=\"\",\"\",Start!D15)","v":""},null,null,null,"",null,null,null,"","",null,"",null,""]
[null,{"$f":"Start!C16","v":10},{"$f":"IF(Start!D16=\"\",\"\",Start!D16)","v":""},null,null,null,"",null,null,null,"","",null,"",null,""]
[null,{"$f":"Start!C17","v":11},{"$f":"IF(Start!D17=\"\",\"\",Start!D17)","v":""},null,null,null,"",null,null,null,"","",null,"",null,""]
[null,{"$f":"Start!C18","v":12},{"$f":"IF(Start!D18=\"\",\"\",Start!D18)","v":""},null,null,null,"",null,null,null,"","",null,"",null,""]
[null,{"$f":"Start!C19","v":13},{"$f":"IF(Start!D19=\"\",\"\",Start!D19)","v":""},null,null,null,"",null,null,null,"","",null,"",null,""]
[null,{"$f":"Start!C20","v":14},{"$f":"IF(Start!D20=\"\",\"\",Start!D20)","v":""},null,null,null,"",null,null,null,"","",null,"",null,""]
[null,{"$f":"Start!C21","v":15},{"$f":"IF(Start!D21=\"\",\"\",Start!D21)","v":""},null,null,null,"",null,null,null,"","",null,"",null,""]
[null,{"$f":"Start!C22","v":16},{"$f":"IF(Start!D22=\"\",\"\",Start!D22)","v":""},null,null,null,"",null,null,null,"","",null,"",null,""]
[null,{"$f":"Start!C23","v":17},{"$f":"IF(Start!D23=\"\",\"\",Start!D23)","v":""},null,null,null,"",null,null,null,"","",null,"",null,""]
[null,{"$f":"Start!C24","v":18},{"$f":"IF(Start!D24=\"\",\"\",Start!D24)","v":""},null,null,null,"",null,null,null,"","",null,"",null,""]
[null,{"$f":"Start!C25","v":19},{"$f":"IF(Start!D25=\"\",\"\",Start!D25)","v":""},null,null,null,"",null,null,null,"","",null,"",null,""]
[null,{"$f":"Start!C26","v":20},{"$f":"IF(Start!D26=\"\",\"\",Start!D26)","v":""},null,null,null,"",null,null,null,"","",null,"",null,""]
[null,{"$f":"Start!C27","v":21},{"$f":"IF(Start!D27=\"\",\"\",Start!D27)","v":""},null,null,null,"",null,null,null,"","",null,"",null,""]
[null,{"$f":"Start!C28","v":22},{"$f":"IF(Start!D28=\"\",\"\",Start!D28)","v":""},null,null,null,"",null,null,null,"","",null,"",null,""]
[null,{"$f":"Start!C29","v":23},{"$f":"IF(Start!D29=\"\",\"\",Start!D29)","v":""},null,null,null,"",null,null,null,"","",null,"",null,""]
[null,{"$f":"Start!C30","v":24},{"$f":"IF(Start!D30=\"\",\"\",Start!D30)","v":""},null,null,null,"",null,null,null,"","",null,"",null,""]
[null,{"$f":"Start!C31","v":25},{"$f":"IF(Start!D31=\"\",\"\",Start!D31)","v":""},null,null,null,"",null,null,null,"",{"$f":"IF(C29=\"\",\"\",IF(OR(AND(G29=\"NP\",K29=\"NP\"),AND(G29=\"DNF\",K29=\"DNF\")),G29,IF(AND(G29=\"NP\",K29=\"DNF\"),G29,IF(AND(G29=\"DNF\",K29=\"NP\"),K29,MIN(G29,K29)))))","v":""},null,"",null,""]

{"sheet":"Výsledky","index":19,"n_rows":32,"n_cols":20,"rows_kept":32,"cut":false,"hidden":false,"merged":[[0,1,0,19],[2,2,2,17],[3,2,3,17]]}
[null,"Celkové výsledky"]
[]
[null,null,{"$f":"Start!$B$2","v":"Krajské kolo dorostu"}]
[null,null,{"$f":"Start!$B$3","v":"18.06.2022 Pardubice"}]
[]
[null,null,{"$f":"Start!$D$5","v":"dorostenky"},null,null,null,null,null,6]
[null," startovní číslo"," SDH"," ZPV"," PÚ"," Štafeta 4x100m"," Běh na 100m s přek."," Test",null," Celkový součet",null," Celokvé pořadí "," SDH"," ZPV"," PÚ"," Štafeta 4x100m"," Běh na 100m s přek."," Test ",null," Celkový součet"]
[null,{"$f":"Start!C7","v":1},{"$f":"IF(Start!D7=\"\",\"\",Start!D7)","v":"Kamenec"},{"$f":"IF($C8=\"\",\"\",IF('V.l.ZPV'!$C$6=\"\",\"0\",IF(ISNA(MATCH($C8,ZPVOblN,0)),COUNTIF(ZPVOblT,\".\")+1,LOOKUP($C8,ZPVOblN,ZPVOblD))))","v":"0"},{"$f":"IF(C8=\"\",\"\",PÚ!P5)","v":2},{"$f":"IF(C8=\"\",\"\",'4x100m'!P5)","v":3},{"$f":"IF(C8=\"\",\"\",'PJ-C'!Q5)","v":4},{"$f":"IF(C8=\"\",\"\",TEST!H5)","v":1},null,{"$f":"IF(C8=\"\",\"\",SUM(D8:I8))","v":10},null,1,"Lubná","0",1,2,3,1,null,7]
[null,{"$f":"Start!C8","v":2},{"$f":"IF(Start!D8=\"\",\"\",Start!D8)","v":"Lukavice"},{"$f":"IF($C9=\"\",\"\",IF('V.l.ZPV'!$C$6=\"\",\"0\",IF(ISNA(MATCH($C9,ZPVOblN,0)),COUNTIF(ZPVOblT,\".\")+1,LOOKUP($C9,ZPVOblN,ZPVOblD))))","v":"0"},{"$f":"IF(C9=\"\",\"\",PÚ!P6)","v":5},{"$f":"IF(C9=\"\",\"\",'4x100m'!P6)","v":6},{"$f":"IF(C9=\"\",\"\",'PJ-C'!Q8)","v":5},{"$f":"IF(C9=\"\",\"\",TEST!H6)","v":5},null,{"$f":"IF(C9=\"\",\"\",SUM(D9:I9))","v":21},null,2,"Skuteč","0",4,1,1,1,null,7]
[null,{"$f":"Start!C9","v":3},{"$f":"IF(Start!D9=\"\",\"\",Start!D9)","v":"Lubná"},{"$f":"IF($C10=\"\",\"\",IF('V.l.ZPV'!$C$6=\"\",\"0\",IF(ISNA(MATCH($C10,ZPVOblN,0)),COUNTIF(ZPVOblT,\".\")+1,LOOKUP($C10,ZPVOblN,ZPVOblD))))","v":"0"},{"$f":"IF(C10=\"\",\"\",PÚ!P7)","v":1},{"$f":"IF(C10=\"\",\"\",'4x100m'!P7)","v":2},{"$f":"IF(C10=\"\",\"\",'PJ-C'!Q11)","v":3},{"$f":"IF(C10=\"\",\"\",TEST!H7)","v":1},null,7,null,3,"Kamenec","0",2,3,4,1,null,10]
[null,{"$f":"Start!C10","v":4},{"$f":"IF(Start!D10=\"\",\"\",Start!D10)","v":"Skuteč"},{"$f":"IF($C11=\"\",\"\",IF('V.l.ZPV'!$C$6=\"\",\"0\",IF(ISNA(MATCH($C11,ZPVOblN,0)),COUNTIF(ZPVOblT,\".\")+1,LOOKUP($C11,ZPVOblN,ZPVOblD))))","v":"0"},{"$f":"IF(C11=\"\",\"\",PÚ!P8)","v":4},{"$f":"IF(C11=\"\",\"\",'4x100m'!P8)","v":1},{"$f":"IF(C11=\"\",\"\",'PJ-C'!Q14)","v":1},{"$f":"IF(C11=\"\",\"\",TEST!H8)","v":1},null,7,null,4,"Letohrad Kunčice","0",3,4,2,1,null,10]
[null,{"$f":"Start!C11","v":5},{"$f":"IF(Start!D11=\"\",\"\",Start!D11)","v":"Bystřec"},{"$f":"IF($C12=\"\",\"\",IF('V.l.ZPV'!$C$6=\"\",\"0\",IF(ISNA(MATCH($C12,ZPVOblN,0)),COUNTIF(ZPVOblT,\".\")+1,LOOKUP($C12,ZPVOblN,ZPVOblD))))","v":"0"},{"$f":"IF(C12=\"\",\"\",PÚ!P9)","v":6},{"$f":"IF(C12=\"\",\"\",'4x100m'!P9)","v":5},{"$f":"IF(C12=\"\",\"\",'PJ-C'!Q17)","v":6},{"$f":"IF(C12=\"\",\"\",TEST!H9)","v":6},null,23,null,5,"Lukavice","0",5,6,5,5,null,21]
[null,{"$f":"Start!C12","v":6},{"$f":"IF(Start!D12=\"\",\"\",Start!D12)","v":"Letohrad Kunčice"},{"$f":"IF($C13=\"\",\"\",IF('V.l.ZPV'!$C$6=\"\",\"0\",IF(ISNA(MATCH($C13,ZPVOblN,0)),COUNTIF(ZPVOblT,\".\")+1,LOOKUP($C13,ZPVOblN,ZPVOblD))))","v":"0"},{"$f":"IF(C13=\"\",\"\",PÚ!P10)","v":3},{"$f":"IF(C13=\"\",\"\",'4x100m'!P10)","v":4},{"$f":"IF(C13=\"\",\"\",'PJ-C'!Q20)","v":2},{"$f":"IF(C13=\"\",\"\",TEST!H10)","v":1},null,10,null,6,"Bystřec","0",6,5,6,6,null,23]
[null,{"$f":"Start!C13","v":7},{"$f":"IF(Start!D13=\"\",\"\",Start!D13)","v":""},{"$f":"IF($C14=\"\",\"\",IF('V.l.ZPV'!$C$6=\"\",\"0\",IF(ISNA(MATCH($C14,ZPVOblN,0)),COUNTIF(ZPVOblT,\".\")+1,LOOKUP($C14,ZPVOblN,ZPVOblD))))","v":""},{"$f":"IF(C14=\"\",\"\",PÚ!P11)","v":""},{"$f":"IF(C14=\"\",\"\",'4x100m'!P11)","v":""},{"$f":"IF(C14=\"\",\"\",'PJ-C'!Q23)","v":""},{"$f":"IF(C14=\"\",\"\",TEST!H11)","v":""},null,"",null,7,"","","","","","",null,""]
[null,{"$f":"Start!C14","v":8},{"$f":"IF(Start!D14=\"\",\"\",Start!D14)","v":""},{"$f":"IF($C15=\"\",\"\",IF('V.l.ZPV'!$C$6=\"\",\"0\",IF(ISNA(MATCH($C15,ZPVOblN,0)),COUNTIF(ZPVOblT,\".\")+1,LOOKUP($C15,ZPVOblN,ZPVOblD))))","v":""},{"$f":"IF(C15=\"\",\"\",PÚ!P12)","v":""},{"$f":"IF(C15=\"\",\"\",'4x100m'!P12)","v":""},{"$f":"IF(C15=\"\",\"\",'PJ-C'!Q26)","v":""},{"$f":"IF(C15=\"\",\"\",TEST!H12)","v":""},null,"",null,8,"","","","","","",null,""]
[null,{"$f":"Start!C15","v":9},{"$f":"IF(Start!D15=\"\",\"\",Start!D15)","v":""},{"$f":"IF($C16=\"\",\"\",IF('V.l.ZPV'!$C$6=\"\",\"0\",IF(ISNA(MATCH($C16,ZPVOblN,0)),COUNTIF(ZPVOblT,\".\")+1,LOOKUP($C16,ZPVOblN,ZPVOblD))))","v":""},{"$f":"IF(C16=\"\",\"\",PÚ!P13)","v":""},{"$f":"IF(C16=\"\",\"\",'4x100m'!P13)","v":""},{"$f":"IF(C16=\"\",\"\",'PJ-C'!Q29)","v":""},{"$f":"IF(C16=\"\",\"\",TEST!H13)","v":""},null,"",null,9,"","","","","","",null,""]
[null,{"$f":"Start!C16","v":10},{"$f":"IF(Start!D16=\"\",\"\",Start!D16)","v":""},{"$f":"IF($C17=\"\",\"\",IF('V.l.ZPV'!$C$6=\"\",\"0\",IF(ISNA(MATCH($C17,ZPVOblN,0)),COUNTIF(ZPVOblT,\".\")+1,LOOKUP($C17,ZPVOblN,ZPVOblD))))","v":""},{"$f":"IF(C17=\"\",\"\",PÚ!P14)","v":""},{"$f":"IF(C17=\"\",\"\",'4x100m'!P14)","v":""},{"$f":"IF(C17=\"\",\"\",'PJ-C'!Q32)","v":""},{"$f":"IF(C17=\"\",\"\",TEST!H14)","v":""},null,"",null,10,"","","","","","",null,""]
[null,{"$f":"Start!C17","v":11},{"$f":"IF(Start!D17=\"\",\"\",Start!D17)","v":""},{"$f":"IF($C18=\"\",\"\",IF('V.l.ZPV'!$C$6=\"\",\"0\",IF(ISNA(MATCH($C18,ZPVOblN,0)),COUNTIF(ZPVOblT,\".\")+1,LOOKUP($C18,ZPVOblN,ZPVOblD))))","v":""},{"$f":"IF(C18=\"\",\"\",PÚ!P15)","v":""},{"$f":"IF(C18=\"\",\"\",'4x100m'!P15)","v":""},{"$f":"IF(C18=\"\",\"\",'PJ-C'!Q39)","v":""},{"$f":"IF(C18=\"\",\"\",TEST!H15)","v":""},null,"",null,11,"","","","","","",null,""]
[null,{"$f":"Start!C18","v":12},{"$f":"IF(Start!D18=\"\",\"\",Start!D18)","v":""},{"$f":"IF($C19=\"\",\"\",IF('V.l.ZPV'!$C$6=\"\",\"0\",IF(ISNA(MATCH($C19,ZPVOblN,0)),COUNTIF(ZPVOblT,\".\")+1,LOOKUP($C19,ZPVOblN,ZPVOblD))))","v":""},{"$f":"IF(C19=\"\",\"\",PÚ!P16)","v":""},{"$f":"IF(C19=\"\",\"\",'4x100m'!P16)","v":""},{"$f":"IF(C19=\"\",\"\",'PJ-C'!Q42)","v":""},{"$f":"IF(C19=\"\",\"\",TEST!H16)","v":""},null,"",null,12,"","","","","","",null,""]
[null,{"$f":"Start!C19","v":13},{"$f":"IF(Start!D19=\"\",\"\",Start!D19)","v":""},{"$f":"IF($C20=\"\",\"\",IF('V.l.ZPV'!$C$6=\"\",\"0\",IF(ISNA(MATCH($C20,ZPVOblN,0)),COUNTIF(ZPVOblT,\".\")+1,LOOKUP($C20,ZPVOblN,ZPVOblD))))","v":""},{"$f":"IF(C20=\"\",\"\",PÚ!P17)","v":""},{"$f":"IF(C20=\"\",\"\",'4x100m'!P17)","v":""},{"$f":"IF(C20=\"\",\"\",'PJ-C'!Q45)","v":""},{"$f":"IF(C20=\"\",\"\",TEST!H17)","v":""},null,"",null,13,"","","","","","",null,""]
[null,{"$f":"Start!C20","v":14},{"$f":"IF(Start!D20=\"\",\"\",Start!D20)","v":""},{"$f":"IF($C21=\"\",\"\",IF('V.l.ZPV'!$C$6=\"\",\"0\",IF(ISNA(MATCH($C21,ZPVOblN,0)),COUNTIF(ZPVOblT,\".\")+1,LOOKUP($C21,ZPVOblN,ZPVOblD))))","v":""},{"$f":"IF(C21=\"\",\"\",PÚ!P18)","v":""},{"$f":"IF(C21=\"\",\"\",'4x100m'!P18)","v":""},{"$f":"IF(C21=\"\",\"\",'PJ-C'!Q48)","v":""},{"$f":"IF(C21=\"\",\"\",TEST!H18)","v":""},null,"",null,14,"","","","","","",null,""]
[null,{"$f":"Start!C21","v":15},{"$f":"IF(Start!D21=\"\",\"\",Start!D21)","v":""},{"$f":"IF($C22=\"\",\"\",IF('V.l.ZPV'!$C$6=\"\",\"0\",IF(ISNA(MATCH($C22,ZPVOblN,0)),COUNTIF(ZPVOblT,\".\")+1,LOOKUP($C22,ZPVOblN,ZPVOblD))))","v":""},{"$f":"IF(C22=\"\",\"\",PÚ!P19)","v":""},{"$f":"IF(C22=\"\",\"\",'4x100m'!P19)","v":""},{"$f":"IF(C22=\"\",\"\",'PJ-C'!Q51)","v":""},{"$f":"IF(C22=\"\",\"\",TEST!H19)","v":""},null,"",null,15,"","","","","","",null,""]
[null,{"$f":"Start!C22","v":16},{"$f":"IF(Start!D22=\"\",\"\",Start!D22)","v":""},{"$f":"IF($C23=\"\",\"\",IF('V.l.ZPV'!$C$6=\"\",\"0\",IF(ISNA(MATCH($C23,ZPVOblN,0)),COUNTIF(ZPVOblT,\".\")+1,LOOKUP($C23,ZPVOblN,ZPVOblD))))","v":""},{"$f":"IF(C23=\"\",\"\",PÚ!P20)","v":""},{"$f":"IF(C23=\"\",\"\",'4x100m'!P20)","v":""},{"$f":"IF(C23=\"\",\"\",'PJ-C'!Q54)","v":""},{"$f":"IF(C23=\"\",\"\",TEST!H20)","v":""},null,"",null,16,"","","","","","",null,""]
[null,{"$f":"Start!C23","v":17},{"$f":"IF(Start!D23=\"\",\"\",Start!D23)","v":""},{"$f":"IF($C24=\"\",\"\",IF('V.l.ZPV'!$C$6=\"\",\"0\",IF(ISNA(MATCH($C24,ZPVOblN,0)),COUNTIF(ZPVOblT,\".\")+1,LOOKUP($C24,ZPVOblN,ZPVOblD))))","v":""},{"$f":"IF(C24=\"\",\"\",PÚ!P21)","v":""},{"$f":"IF(C24=\"\",\"\",'4x100m'!P21)","v":""},{"$f":"IF(C24=\"\",\"\",'PJ-C'!Q57)","v":""},{"$f":"IF(C24=\"\",\"\",TEST!H21)","v":""},null,"",null,17,"","","","","","",null,""]
[null,{"$f":"Start!C24","v":18},{"$f":"IF(Start!D24=\"\",\"\",Start!D24)","v":""},{"$f":"IF($C25=\"\",\"\",IF('V.l.ZPV'!$C$6=\"\",\"0\",IF(ISNA(MATCH($C25,ZPVOblN,0)),COUNTIF(ZPVOblT,\".\")+1,LOOKUP($C25,ZPVOblN,ZPVOblD))))","v":""},{"$f":"IF(C25=\"\",\"\",PÚ!P22)","v":""},{"$f":"IF(C25=\"\",\"\",'4x100m'!P22)","v":""},{"$f":"IF(C25=\"\",\"\",'PJ-C'!Q60)","v":""},{"$f":"IF(C25=\"\",\"\",TEST!H22)","v":""},null,"",null,18,"","","","","","",null,""]
[null,{"$f":"Start!C25","v":19},{"$f":"IF(Start!D25=\"\",\"\",Start!D25)","v":""},{"$f":"IF($C26=\"\",\"\",IF('V.l.ZPV'!$C$6=\"\",\"0\",IF(ISNA(MATCH($C26,ZPVOblN,0)),COUNTIF(ZPVOblT,\".\")+1,LOOKUP($C26,ZPVOblN,ZPVOblD))))","v":""},{"$f":"IF(C26=\"\",\"\",PÚ!P23)","v":""},{"$f":"IF(C26=\"\",\"\",'4x100m'!P23)","v":""},{"$f":"IF(C26=\"\",\"\",'PJ-C'!Q63)","v":""},{"$f":"IF(C26=\"\",\"\",TEST!H23)","v":""},null,"",null,19,"","","","","","",null,""]
[null,{"$f":"Start!C26","v":20},{"$f":"IF(Start!D26=\"\",\"\",Start!D26)","v":""},{"$f":"IF($C27=\"\",\"\",IF('V.l.ZPV'!$C$6=\"\",\"0\",IF(ISNA(MATCH($C27,ZPVOblN,0)),COUNTIF(ZPVOblT,\".\")+1,LOOKUP($C27,ZPVOblN,ZPVOblD))))","v":""},{"$f":"IF(C27=\"\",\"\",PÚ!P24)","v":""},{"$f":"IF(C27=\"\",\"\",'4x100m'!P24)","v":""},{"$f":"IF(C27=\"\",\"\",'PJ-C'!Q66)","v":""},{"$f":"IF(C27=\"\",\"\",TEST!H24)","v":""},null,"",null,20,"","","","","","",null,""]
[null,{"$f":"Start!C27","v":21},{"$f":"IF(Start!D27=\"\",\"\",Start!D27)","v":""},{"$f":"IF($C28=\"\",\"\",IF('V.l.ZPV'!$C$6=\"\",\"0\",IF(ISNA(MATCH($C28,ZPVOblN,0)),COUNTIF(ZPVOblT,\".\")+1,LOOKUP($C28,ZPVOblN,ZPVOblD))))","v":""},{"$f":"IF(C28=\"\",\"\",PÚ!P25)","v":""},{"$f":"IF(C28=\"\",\"\",'4x100m'!P25)","v":""},{"$f":"IF(C28=\"\",\"\",'PJ-C'!Q73)","v":""},{"$f":"IF(C28=\"\",\"\",TEST!H25)","v":""},null,{"$f":"IF(C28=\"\",\"\",SUM(D28:I28))","v":""},null,21,"","","","","","",null,""]
[null,{"$f":"Start!C28","v":22},{"$f":"IF(Start!D28=\"\",\"\",Start!D28)","v":""},{"$f":"IF($C29=\"\",\"\",IF('V.l.ZPV'!$C$6=\"\",\"0\",IF(ISNA(MATCH($C29,ZPVOblN,0)),COUNTIF(ZPVOblT,\".\")+1,LOOKUP($C29,ZPVOblN,ZPVOblD))))","v":""},{"$f":"IF(C29=\"\",\"\",PÚ!P26)","v":""},{"$f":"IF(C29=\"\",\"\",'4x100m'!P26)","v":""},{"$f":"IF(C29=\"\",\"\",'PJ-C'!Q76)","v":""},{"$f":"IF(C29=\"\",\"\",TEST!H26)","v":""},null,{"$f":"IF(C29=\"\",\"\",SUM(D29:I29))","v":""},null,22,"","","","","","",null,""]
[null,{"$f":"Start!C29","v":23},{"$f":"IF(Start!D29=\"\",\"\",Start!D29)","v":""},{"$f":"IF($C30=\"\",\"\",IF('V.l.ZPV'!$C$6=\"\",\"0\",IF(ISNA(MATCH($C30,ZPVOblN,0)),COUNTIF(ZPVOblT,\".\")+1,LOOKUP($C30,ZPVOblN,ZPVOblD))))","v":""},{"$f":"IF(C30=\"\",\"\",PÚ!P27)","v":""},{"$f":"IF(C30=\"\",\"\",'4x100m'!P27)","v":""},{"$f":"IF(C30=\"\",\"\",'PJ-C'!Q79)","v":""},{"$f":"IF(C30=\"\",\"\",TEST!H27)","v":""},null,{"$f":"IF(C30=\"\",\"\",SUM(D30:I30))","v":""},null,23,"","","","","","",null,""]
[null,{"$f":"Start!C30","v":24},{"$f":"IF(Start!D30=\"\",\"\",Start!D30)","v":""},{"$f":"IF($C31=\"\",\"\",IF('V.l.ZPV'!$C$6=\"\",\"0\",IF(ISNA(MATCH($C31,ZPVOblN,0)),COUNTIF(ZPVOblT,\".\")+1,LOOKUP($C31,ZPVOblN,ZPVOblD))))","v":""},{"$f":"IF(C31=\"\",\"\",PÚ!P28)","v":""},{"$f":"IF(C31=\"\",\"\",'4x100m'!P28)","v":""},{"$f":"IF(C31=\"\",\"\",'PJ-C'!Q82)","v":""},{"$f":"IF(C31=\"\",\"\",TEST!H28)","v":""},null,{"$f":"IF(C31=\"\",\"\",SUM(D31:I31))","v":""},null,24,"","","","","","",null,""]
[null,{"$f":"Start!C31","v":25},{"$f":"IF(Start!D31=\"\",\"\",Start!D31)","v":""},{"$f":"IF($C32=\"\",\"\",IF('V.l.ZPV'!$C$6=\"\",\"0\",IF(ISNA(MATCH($C32,ZPVOblN,0)),COUNTIF(ZPVOblT,\".\")+1,LOOKUP($C32,ZPVOblN,ZPVOblD))))","v":""},{"$f":"IF(C32=\"\",\"\",PÚ!P29)","v":""},{"$f":"IF(C32=\"\",\"\",'4x100m'!P29)","v":""},{"$f":"IF(C32=\"\",\"\",'PJ-C'!Q85)","v":""},{"$f":"IF(C32=\"\",\"\",TEST!H29)","v":""},null,{"$f":"IF(C32=\"\",\"\",SUM(D32:I32))","v":""},null,25,"","","","","","",null,""]

{"sheet":"Tisk-v1","index":20,"n_rows":63,"n_cols":18,"rows_kept":63,"cut":false,"hidden":false,"merged":[[0,1,0,17],[3,2,3,6],[3,11,3,15],[32,1,32,17],[5,1,30,1],[5,10,30,10],[2,2,2,16],[34,2,34,16],[37,1,62,1],[37,10,62,10],[35,2,35,6],[35,11,35,15]]}
[null,"Tisková sestava"]
[]
[null,null,{"$f":"Start!$B$2","v":"Krajské kolo dorostu"}]
[null,null,{"$f":"\"Kategorie: \"&Start!$D$5","v":"Kategorie: dorostenky"},null,null,null,null,null,null,null,null,{"$f":"Start!$B$3","v":"18.06.2022 Pardubice"}]
[]
[null,"Požární útok","st.č.","SDH","1.pokus","2.pokus","čas",null,"Poř.",null,"Štafeta 4x100 m","st.č.","SDH","1.pokus","2.pokus","čas",null,"Poř."]
[null,null,{"$f":"Start!C7","v":1},{"$f":"IF(Start!D7=\"\",\"\",Start!D7)","v":"Kamenec"},{"$f":"IF(D7=\"\",\"\",PÚ!G5)","v":40.130000000000003},{"$f":"IF(D7=\"\",\"\",PÚ!K5)","v":38.229999999999997},{"$f":"IF(D7=\"\",\"\",PÚ!L5)","v":38.229999999999997},null,{"$f":"IF(D7=\"\",\"\",PÚ!P5)","v":2},null,null,{"$f":"Start!C7","v":1},{"$f":"IF(Start!D7=\"\",\"\",Start!D7)","v":"Kamenec"},{"$f":"IF(M7=\"\",\"\",'4x100m'!G5)","v":74.3},{"$f":"IF(M7=\"\",\"\",'4x100m'!K5)","v":72.63},{"$f":"IF(M7=\"\",\"\",'4x100m'!L5)","v":72.63},null,{"$f":"IF(M7=\"\",\"\",'4x100m'!P5)","v":3}]
[null,null,{"$f":"Start!C8","v":2},{"$f":"IF(Start!D8=\"\",\"\",Start!D8)","v":"Lukavice"},{"$f":"IF(D8=\"\",\"\",PÚ!G6)","v":"NP"},{"$f":"IF(D8=\"\",\"\",PÚ!K6)","v":62.53},{"$f":"IF(D8=\"\",\"\",PÚ!L6)","v":62.53},null,{"$f":"IF(D8=\"\",\"\",PÚ!P6)","v":5},null,null,{"$f":"Start!C8","v":2},{"$f":"IF(Start!D8=\"\",\"\",Start!D8)","v":"Lukavice"},{"$f":"IF(M8=\"\",\"\",'4x100m'!G6)","v":81.400000000000006},{"$f":"IF(M8=\"\",\"\",'4x100m'!K6)","v":"NP"},{"$f":"IF(M8=\"\",\"\",'4x100m'!L6)","v":81.400000000000006},null,{"$f":"IF(M8=\"\",\"\",'4x100m'!P6)","v":6}]
[null,null,{"$f":"Start!C9","v":3},{"$f":"IF(Start!D9=\"\",\"\",Start!D9)","v":"Lubná"},{"$f":"IF(D9=\"\",\"\",PÚ!G7)","v":34.39},{"$f":"IF(D9=\"\",\"\",PÚ!K7)","v":50.33},{"$f":"IF(D9=\"\",\"\",PÚ!L7)","v":34.39},null,{"$f":"IF(D9=\"\",\"\",PÚ!P7)","v":1},null,null,{"$f":"Start!C9","v":3},{"$f":"IF(Start!D9=\"\",\"\",Start!D9)","v":"Lubná"},{"$f":"IF(M9=\"\",\"\",'4x100m'!G7)","v":69.41},{"$f":"IF(M9=\"\",\"\",'4x100m'!K7)","v":"NP"},{"$f":"IF(M9=\"\",\"\",'4x100m'!L7)","v":69.41},null,{"$f":"IF(M9=\"\",\"\",'4x100m'!P7)","v":2}]
[null,null,{"$f":"Start!C10","v":4},{"$f":"IF(Start!D10=\"\",\"\",Start!D10)","v":"Skuteč"},{"$f":"IF(D10=\"\",\"\",PÚ!G8)","v":41.35},{"$f":"IF(D10=\"\",\"\",PÚ!K8)","v":42.14},{"$f":"IF(D10=\"\",\"\",PÚ!L8)","v":41.35},null,{"$f":"IF(D10=\"\",\"\",PÚ!P8)","v":4},null,null,{"$f":"Start!C10","v":4},{"$f":"IF(Start!D10=\"\",\"\",Start!D10)","v":"Skuteč"},{"$f":"IF(M10=\"\",\"\",'4x100m'!G8)","v":67.17},{"$f":"IF(M10=\"\",\"\",'4x100m'!K8)","v":68.83},{"$f":"IF(M10=\"\",\"\",'4x100m'!L8)","v":67.17},null,{"$f":"IF(M10=\"\",\"\",'4x100m'!P8)","v":1}]
[null,null,{"$f":"Start!C11","v":5},{"$f":"IF(Start!D11=\"\",\"\",Start!D11)","v":"Bystřec"},{"$f":"IF(D11=\"\",\"\",PÚ!G9)","v":73.44},{"$f":"IF(D11=\"\",\"\",PÚ!K9)","v":"DNF"},{"$f":"IF(D11=\"\",\"\",PÚ!L9)","v":73.44},null,{"$f":"IF(D11=\"\",\"\",PÚ!P9)","v":6},null,null,{"$f":"Start!C11","v":5},{"$f":"IF(Start!D11=\"\",\"\",Start!D11)","v":"Bystřec"},{"$f":"IF(M11=\"\",\"\",'4x100m'!G9)","v":81.05},{"$f":"IF(M11=\"\",\"\",'4x100m'!K9)","v":82.65},{"$f":"IF(M11=\"\",\"\",'4x100m'!L9)","v":81.05},null,{"$f":"IF(M11=\"\",\"\",'4x100m'!P9)","v":5}]
[null,null,{"$f":"Start!C12","v":6},{"$f":"IF(Start!D12=\"\",\"\",Start!D12)","v":"Letohrad Kunčice"},{"$f":"IF(D12=\"\",\"\",PÚ!G10)","v":39.6},{"$f":"IF(D12=\"\",\"\",PÚ!K10)","v":40.07},{"$f":"IF(D12=\"\",\"\",PÚ!L10)","v":39.6},null,{"$f":"IF(D12=\"\",\"\",PÚ!P10)","v":3},null,null,{"$f":"Start!C12","v":6},{"$f":"IF(Start!D12=\"\",\"\",Start!D12)","v":"Letohrad Kunčice"},{"$f":"IF(M12=\"\",\"\",'4x100m'!G10)","v":73.150000000000006},{"$f":"IF(M12=\"\",\"\",'4x100m'!K10)","v":73.28},{"$f":"IF(M12=\"\",\"\",'4x100m'!L10)","v":73.150000000000006},null,{"$f":"IF(M12=\"\",\"\",'4x100m'!P10)","v":4}]
[null,null,{"$f":"Start!C13","v":7},{"$f":"IF(Start!D13=\"\",\"\",Start!D13)","v":""},{"$f":"IF(D13=\"\",\"\",PÚ!G11)","v":""},{"$f":"IF(D13=\"\",\"\",PÚ!K11)","v":""},{"$f":"IF(D13=\"\",\"\",PÚ!L11)","v":""},null,{"$f":"IF(D13=\"\",\"\",PÚ!P11)","v":""},null,null,{"$f":"Start!C13","v":7},{"$f":"IF(Start!D13=\"\",\"\",Start!D13)","v":""},{"$f":"IF(M13=\"\",\"\",'4x100m'!G11)","v":""},{"$f":"IF(M13=\"\",\"\",'4x100m'!K11)","v":""},{"$f":"IF(M13=\"\",\"\",'4x100m'!L11)","v":""},null,{"$f":"IF(M13=\"\",\"\",'4x100m'!P11)","v":""}]
[null,null,{"$f":"Start!C14","v":8},{"$f":"IF(Start!D14=\"\",\"\",Start!D14)","v":""},{"$f":"IF(D14=\"\",\"\",PÚ!G12)","v":""},{"$f":"IF(D14=\"\",\"\",PÚ!K12)","v":""},{"$f":"IF(D14=\"\",\"\",PÚ!L12)","v":""},null,{"$f":"IF(D14=\"\",\"\",PÚ!P12)","v":""},null,null,{"$f":"Start!C14","v":8},{"$f":"IF(Start!D14=\"\",\"\",Start!D14)","v":""},{"$f":"IF(M14=\"\",\"\",'4x100m'!G12)","v":""},{"$f":"IF(M14=\"\",\"\",'4x100m'!K12)","v":""},{"$f":"IF(M14=\"\",\"\",'4x100m'!L12)","v":""},null,{"$f":"IF(M14=\"\",\"\",'4x100m'!P12)","v":""}]
[null,null,{"$f":"Start!C15","v":9},{"$f":"IF(Start!D15=\"\",\"\",Start!D15)","v":""},{"$f":"IF(D15=\"\",\"\",PÚ!G13)","v":""},{"$f":"IF(D15=\"\",\"\",PÚ!K13)","v":""},{"$f":"IF(D15=\"\",\"\",PÚ!L13)","v":""},null,{"$f":"IF(D15=\"\",\"\",PÚ!P13)","v":""},null,null,{"$f":"Start!C15","v":9},{"$f":"IF(Start!D15=\"\",\"\",Start!D15)","v":""},{"$f":"IF(M15=\"\",\"\",'4x100m'!G13)","v":""},{"$f":"IF(M15=\"\",\"\",'4x100m'!K13)","v":""},{"$f":"IF(M15=\"\",\"\",'4x100m'!L13)","v":""},null,{"$f":"IF(M15=\"\",\"\",'4x100m'!P13)","v":""}]
[null,null,{"$f":"Start!C16","v":10},{"$f":"IF(Start!D16=\"\",\"\",Start!D16)","v":""},{"$f":"IF(D16=\"\",\"\",PÚ!G14)","v":""},{"$f":"IF(D16=\"\",\"\",PÚ!K14)","v":""},{"$f":"IF(D16=\"\",\"\",PÚ!L14)","v":""},null,{"$f":"IF(D16=\"\",\"\",PÚ!P14)","v":""},null,null,{"$f":"Start!C16","v":10},{"$f":"IF(Start!D16=\"\",\"\",Start!D16)","v":""},{"$f":"IF(M16=\"\",\"\",'4x100m'!G14)","v":""},{"$f":"IF(M16=\"\",\"\",'4x100m'!K14)","v":""},{"$f":"IF(M16=\"\",\"\",'4x100m'!L14)","v":""},null,{"$f":"IF(M16=\"\",\"\",'4x100m'!P14)","v":""}]
[null,null,{"$f":"Start!C17","v":11},{"$f":"IF(Start!D17=\"\",\"\",Start!D17)","v":""},{"$f":"IF(D17=\"\",\"\",PÚ!G15)","v":""},{"$f":"IF(D17=\"\",\"\",PÚ!K15)","v":""},{"$f":"IF(D17=\"\",\"\",PÚ!L15)","v":""},null,{"$f":"IF(D17=\"\",\"\",PÚ!P15)","v":""},null,null,{"$f":"Start!C17","v":11},{"$f":"IF(Start!D17=\"\",\"\",Start!D17)","v":""},{"$f":"IF(M17=\"\",\"\",'4x100m'!G15)","v":""},{"$f":"IF(M17=\"\",\"\",'4x100m'!K15)","v":""},{"$f":"IF(M17=\"\",\"\",'4x100m'!L15)","v":""},null,{"$f":"IF(M17=\"\",\"\",'4x100m'!P15)","v":""}]
[null,null,{"$f":"Start!C18","v":12},{"$f":"IF(Start!D18=\"\",\"\",Start!D18)","v":""},{"$f":"IF(D18=\"\",\"\",PÚ!G16)","v":""},{"$f":"IF(D18=\"\",\"\",PÚ!K16)","v":""},{"$f":"IF(D18=\"\",\"\",PÚ!L16)","v":""},null,{"$f":"IF(D18=\"\",\"\",PÚ!P16)","v":""},null,null,{"$f":"Start!C18","v":12},{"$f":"IF(Start!D18=\"\",\"\",Start!D18)","v":""},{"$f":"IF(M18=\"\",\"\",'4x100m'!G16)","v":""},{"$f":"IF(M18=\"\",\"\",'4x100m'!K16)","v":""},{"$f":"IF(M18=\"\",\"\",'4x100m'!L16)","v":""},null,{"$f":"IF(M18=\"\",\"\",'4x100m'!P16)","v":""}]
[null,null,{"$f":"Start!C19","v":13},{"$f":"IF(Start!D19=\"\",\"\",Start!D19)","v":""},{"$f":"IF(D19=\"\",\"\",PÚ!G17)","v":""},{"$f":"IF(D19=\"\",\"\",PÚ!K17)","v":""},{"$f":"IF(D19=\"\",\"\",PÚ!L17)","v":""},null,{"$f":"IF(D19=\"\",\"\",PÚ!P17)","v":""},null,null,{"$f":"Start!C19","v":13},{"$f":"IF(Start!D19=\"\",\"\",Start!D19)","v":""},{"$f":"IF(M19=\"\",\"\",'4x100m'!G17)","v":""},{"$f":"IF(M19=\"\",\"\",'4x100m'!K17)","v":""},{"$f":"IF(M19=\"\",\"\",'4x100m'!L17)","v":""},null,{"$f":"IF(M19=\"\",\"\",'4x100m'!P17)","v":""}]
[null,null,{"$f":"Start!C20","v":14},{"$f":"IF(Start!D20=\"\",\"\",Start!D20)","v":""},{"$f":"IF(D20=\"\",\"\",PÚ!G18)","v":""},{"$f":"IF(D20=\"\",\"\",PÚ!K18)","v":""},{"$f":"IF(D20=\"\",\"\",PÚ!L18)","v":""},null,{"$f":"IF(D20=\"\",\"\",PÚ!P18)","v":""},null,null,{"$f":"Start!C20","v":14},{"$f":"IF(Start!D20=\"\",\"\",Start!D20)","v":""},{"$f":"IF(M20=\"\",\"\",'4x100m'!G18)","v":""},{"$f":"IF(M20=\"\",\"\",'4x100m'!K18)","v":""},{"$f":"IF(M20=\"\",\"\",'4x100m'!L18)","v":""},null,{"$f":"IF(M20=\"\",\"\",'4x100m'!P18)","v":""}]
[null,null,{"$f":"Start!C21","v":15},{"$f":"IF(Start!D21=\"\",\"\",Start!D21)","v":""},{"$f":"IF(D21=\"\",\"\",PÚ!G19)","v":""},{"$f":"IF(D21=\"\",\"\",PÚ!K19)","v":""},{"$f":"IF(D21=\"\",\"\",PÚ!L19)","v":""},null,{"$f":"IF(D21=\"\",\"\",PÚ!P19)","v":""},null,null,{"$f":"Start!C21","v":15},{"$f":"IF(Start!D21=\"\",\"\",Start!D21)","v":""},{"$f":"IF(M21=\"\",\"\",'4x100m'!G19)","v":""},{"$f":"IF(M21=\"\",\"\",'4x100m'!K19)","v":""},{"$f":"IF(M21=\"\",\"\",'4x100m'!L19)","v":""},null,{"$f":"IF(M21=\"\",\"\",'4x100m'!P19)","v":""}]
[null,null,{"$f":"Start!C22","v":16},{"$f":"IF(Start!D22=\"\",\"\",Start!D22)","v":""},{"$f":"IF(D22=\"\",\"\",PÚ!G20)","v":""},{"$f":"IF(D22=\"\",\"\",PÚ!K20)","v":""},{"$f":"IF(D22=\"\",\"\",PÚ!L20)","v":""},null,{"$f":"IF(D22=\"\",\"\",PÚ!P20)","v":""},null,null,{"$f":"Start!C22","v":16},{"$f":"IF(Start!D22=\"\",\"\",Start!D22)","v":""},{"$f":"IF(M22=\"\",\"\",'4x100m'!G20)","v":""},{"$f":"IF(M22=\"\",\"\",'4x100m'!K20)","v":""},{"$f":"IF(M22=\"\",\"\",'4x100m'!L20)","v":""},null,{"$f":"IF(M22=\"\",\"\",'4x100m'!P20)","v":""}]
[null,null,{"$f":"Start!C23","v":17},{"$f":"IF(Start!D23=\"\",\"\",Start!D23)","v":""},{"$f":"IF(D23=\"\",\"\",PÚ!G21)","v":""},{"$f":"IF(D23=\"\",\"\",PÚ!K21)","v":""},{"$f":"IF(D23=\"\",\"\",PÚ!L21)","v":""},null,{"$f":"IF(D23=\"\",\"\",PÚ!P21)","v":""},null,null,{"$f":"Start!C23","v":17},{"$f":"IF(Start!D23=\"\",\"\",Start!D23)","v":""},{"$f":"IF(M23=\"\",\"\",'4x100m'!G21)","v":""},{"$f":"IF(M23=\"\",\"\",'4x100m'!K21)","v":""},{"$f":"IF(M23=\"\",\"\",'4x100m'!L21)","v":""},null,{"$f":"IF(M23=\"\",\"\",'4x100m'!P21)","v":""}]
[null,null,{"$f":"Start!C24","v":18},{"$f":"IF(Start!D24=\"\",\"\",Start!D24)","v":""},{"$f":"IF(D24=\"\",\"\",PÚ!G22)","v":""},{"$f":"IF(D24=\"\",\"\",PÚ!K22)","v":""},{"$f":"IF(D24=\"\",\"\",PÚ!L22)","v":""},null,{"$f":"IF(D24=\"\",\"\",PÚ!P22)","v":""},null,null,{"$f":"Start!C24","v":18},{"$f":"IF(Start!D24=\"\",\"\",Start!D24)","v":""},{"$f":"IF(M24=\"\",\"\",'4x100m'!G22)","v":""},{"$f":"IF(M24=\"\",\"\",'4x100m'!K22)","v":""},{"$f":"IF(M24=\"\",\"\",'4x100m'!L22)","v":""},null,{"$f":"IF(M24=\"\",\"\",'4x100m'!P22)","v":""}]
[null,null,{"$f":"Start!C25","v":19},{"$f":"IF(Start!D25=\"\",\"\",Start!D25)","v":""},{"$f":"IF(D25=\"\",\"\",PÚ!G23)","v":""},{"$f":"IF(D25=\"\",\"\",PÚ!K23)","v":""},{"$f":"IF(D25=\"\",\"\",PÚ!L23)","v":""},null,{"$f":"IF(D25=\"\",\"\",PÚ!P23)","v":""},null,null,{"$f":"Start!C25","v":19},{"$f":"IF(Start!D25=\"\",\"\",Start!D25)","v":""},{"$f":"IF(M25=\"\",\"\",'4x100m'!G23)","v":""},{"$f":"IF(M25=\"\",\"\",'4x100m'!K23)","v":""},{"$f":"IF(M25=\"\",\"\",'4x100m'!L23)","v":""},null,{"$f":"IF(M25=\"\",\"\",'4x100m'!P23)","v":""}]
[null,null,{"$f":"Start!C26","v":20},{"$f":"IF(Start!D26=\"\",\"\",Start!D26)","v":""},{"$f":"IF(D26=\"\",\"\",PÚ!G24)","v":""},{"$f":"IF(D26=\"\",\"\",PÚ!K24)","v":""},{"$f":"IF(D26=\"\",\"\",PÚ!L24)","v":""},null,{"$f":"IF(D26=\"\",\"\",PÚ!P24)","v":""},null,null,{"$f":"Start!C26","v":20},{"$f":"IF(Start!D26=\"\",\"\",Start!D26)","v":""},{"$f":"IF(M26=\"\",\"\",'4x100m'!G24)","v":""},{"$f":"IF(M26=\"\",\"\",'4x100m'!K24)","v":""},{"$f":"IF(M26=\"\",\"\",'4x100m'!L24)","v":""},null,{"$f":"IF(M26=\"\",\"\",'4x100m'!P24)","v":""}]
[null,null,{"$f":"Start!C27","v":21},{"$f":"IF(Start!D27=\"\",\"\",Start!D27)","v":""},{"$f":"IF(D27=\"\",\"\",PÚ!G25)","v":""},{"$f":"IF(D27=\"\",\"\",PÚ!K25)","v":""},{"$f":"IF(D27=\"\",\"\",PÚ!L25)","v":""},null,{"$f":"IF(D27=\"\",\"\",PÚ!P25)","v":""},null,null,{"$f":"Start!C27","v":21},{"$f":"IF(Start!D27=\"\",\"\",Start!D27)","v":""},{"$f":"IF(M27=\"\",\"\",'4x100m'!G25)","v":""},{"$f":"IF(M27=\"\",\"\",'4x100m'!K25)","v":""},{"$f":"IF(M27=\"\",\"\",'4x100m'!L25)","v":""},null,{"$f":"IF(M27=\"\",\"\",'4x100m'!P25)","v":""}]
[null,null,{"$f":"Start!C28","v":22},{"$f":"IF(Start!D28=\"\",\"\",Start!D28)","v":""},{"$f":"IF(D28=\"\",\"\",PÚ!G26)","v":""},{"$f":"IF(D28=\"\",\"\",PÚ!K26)","v":""},{"$f":"IF(D28=\"\",\"\",PÚ!L26)","v":""},null,{"$f":"IF(D28=\"\",\"\",PÚ!P26)","v":""},null,null,{"$f":"Start!C28","v":22},{"$f":"IF(Start!D28=\"\",\"\",Start!D28)","v":""},{"$f":"IF(M28=\"\",\"\",'4x100m'!G26)","v":""},{"$f":"IF(M28=\"\",\"\",'4x100m'!K26)","v":""},{"$f":"IF(M28=\"\",\"\",'4x100m'!L26)","v":""},null,{"$f":"IF(M28=\"\",\"\",'4x100m'!P26)","v":""}]
[null,null,{"$f":"Start!C29","v":23},{"$f":"IF(Start!D29=\"\",\"\",Start!D29)","v":""},{"$f":"IF(D29=\"\",\"\",PÚ!G27)","v":""},{"$f":"IF(D29=\"\",\"\",PÚ!K27)","v":""},{"$f":"IF(D29=\"\",\"\",PÚ!L27)","v":""},null,{"$f":"IF(D29=\"\",\"\",PÚ!P27)","v":""},null,null,{"$f":"Start!C29","v":23},{"$f":"IF(Start!D29=\"\",\"\",Start!D29)","v":""},{"$f":"IF(M29=\"\",\"\",'4x100m'!G27)","v":""},{"$f":"IF(M29=\"\",\"\",'4x100m'!K27)","v":""},{"$f":"IF(M29=\"\",\"\",'4x100m'!L27)","v":""},null,{"$f":"IF(M29=\"\",\"\",'4x100m'!P27)","v":""}]
[null,null,{"$f":"Start!C30","v":24},{"$f":"IF(Start!D30=\"\",\"\",Start!D30)","v":""},{"$f":"IF(D30=\"\",\"\",PÚ!G28)","v":""},{"$f":"IF(D30=\"\",\"\",PÚ!K28)","v":""},{"$f":"IF(D30=\"\",\"\",PÚ!L28)","v":""},null,{"$f":"IF(D30=\"\",\"\",PÚ!P28)","v":""},null,null,{"$f":"Start!C30","v":24},{"$f":"IF(Start!D30=\"\",\"\",Start!D30)","v":""},{"$f":"IF(M30=\"\",\"\",'4x100m'!G28)","v":""},{"$f":"IF(M30=\"\",\"\",'4x100m'!K28)","v":""},{"$f":"IF(M30=\"\",\"\",'4x100m'!L28)","v":""},null,{"$f":"IF(M30=\"\",\"\",'4x100m'!P28)","v":""}]
[null,null,{"$f":"Start!C31","v":25},{"$f":"IF(Start!D31=\"\",\"\",Start!D31)","v":""},{"$f":"IF(D31=\"\",\"\",PÚ!G29)","v":""},{"$f":"IF(D31=\"\",\"\",PÚ!K29)","v":""},{"$f":"IF(D31=\"\",\"\",PÚ!L29)","v":""},null,{"$f":"IF(D31=\"\",\"\",PÚ!P29)","v":""},null,null,{"$f":"Start!C31","v":25},{"$f":"IF(Start!D31=\"\",\"\",Start!D31)","v":""},{"$f":"IF(M31=\"\",\"\",'4x100m'!G29)","v":""},{"$f":"IF(M31=\"\",\"\",'4x100m'!K29)","v":""},{"$f":"IF(M31=\"\",\"\",'4x100m'!L29)","v":""},null,{"$f":"IF(M31=\"\",\"\",'4x100m'!P29)","v":""}]
[]
[null,{"$f":"B1","v":"Tisková sestava"}]
[]
[null,null,{"$f":"Start!$B$2","v":"Krajské kolo dorostu"}]
[null,null,{"$f":"C4","v":"Kategorie: dorostenky"},null,null,null,null,null,null,null,null,{"$f":"L4","v":"18.06.2022 Pardubice"}]
[]
[null,"Běh na 100m s překážkami - Družstva","st.č.","SDH",null,null,"čas",null,"Poř.",null,"Test","st.č.","SDH",null,null,"Tr.b.",null,"Poř."]
[null,null,{"$f":"Start!C7","v":1},{"$f":"IF(Start!D7=\"\",\"\",Start!D7)","v":"Kamenec"},null,null,{"$f":"IF(D39=\"\",\"\",'PJ-C'!M5)","v":107.2},null,{"$f":"IF($D39=\"\",\"\",'PJ-C'!Q5)","v":4},null,null,{"$f":"Start!C7","v":1},{"$f":"IF(Start!D7=\"\",\"\",Start!D7)","v":"Kamenec"},null,null,{"$f":"IF(M39=\"\",\"\",TEST!D5)","v":0},null,{"$f":"IF(M39=\"\",\"\",TEST!H5)","v":1}]
[null,null,{"$f":"Start!C8","v":2},{"$f":"IF(Start!D8=\"\",\"\",Start!D8)","v":"Lukavice"},null,null,{"$f":"IF(D40=\"\",\"\",'PJ-C'!M8)","v":115.31},null,{"$f":"IF($D40=\"\",\"\",'PJ-C'!Q8)","v":5},null,null,{"$f":"Start!C8","v":2},{"$f":"IF(Start!D8=\"\",\"\",Start!D8)","v":"Lukavice"},null,null,{"$f":"IF(M40=\"\",\"\",TEST!D6)","v":1},null,{"$f":"IF(M40=\"\",\"\",TEST!H6)","v":5}]
[null,null,{"$f":"Start!C9","v":3},{"$f":"IF(Start!D9=\"\",\"\",Start!D9)","v":"Lubná"},null,null,{"$f":"IF(D41=\"\",\"\",'PJ-C'!M11)","v":105.67},null,{"$f":"IF($D41=\"\",\"\",'PJ-C'!Q11)","v":3},null,null,{"$f":"Start!C9","v":3},{"$f":"IF(Start!D9=\"\",\"\",Start!D9)","v":"Lubná"},null,null,{"$f":"IF(M41=\"\",\"\",TEST!D7)","v":0},null,{"$f":"IF(M41=\"\",\"\",TEST!H7)","v":1}]
[null,null,{"$f":"Start!C10","v":4},{"$f":"IF(Start!D10=\"\",\"\",Start!D10)","v":"Skuteč"},null,null,{"$f":"IF(D42=\"\",\"\",'PJ-C'!M14)","v":96.289999999999992},null,{"$f":"IF($D42=\"\",\"\",'PJ-C'!Q14)","v":1},null,null,{"$f":"Start!C10","v":4},{"$f":"IF(Start!D10=\"\",\"\",Start!D10)","v":"Skuteč"},null,null,{"$f":"IF(M42=\"\",\"\",TEST!D8)","v":0},null,{"$f":"IF(M42=\"\",\"\",TEST!H8)","v":1}]
[null,null,{"$f":"Start!C11","v":5},{"$f":"IF(Start!D11=\"\",\"\",Start!D11)","v":"Bystřec"},null,null,{"$f":"IF(D43=\"\",\"\",'PJ-C'!M17)","v":115.66},null,{"$f":"IF($D43=\"\",\"\",'PJ-C'!Q17)","v":6},null,null,{"$f":"Start!C11","v":5},{"$f":"IF(Start!D11=\"\",\"\",Start!D11)","v":"Bystřec"},null,null,{"$f":"IF(M43=\"\",\"\",TEST!D9)","v":3},null,{"$f":"IF(M43=\"\",\"\",TEST!H9)","v":6}]
[null,null,{"$f":"Start!C12","v":6},{"$f":"IF(Start!D12=\"\",\"\",Start!D12)","v":"Letohrad Kunčice"},null,null,{"$f":"IF(D44=\"\",\"\",'PJ-C'!M20)","v":104.83},null,{"$f":"IF($D44=\"\",\"\",'PJ-C'!Q20)","v":2},null,null,{"$f":"Start!C12","v":6},{"$f":"IF(Start!D12=\"\",\"\",Start!D12)","v":"Letohrad Kunčice"},null,null,{"$f":"IF(M44=\"\",\"\",TEST!D10)","v":0},null,{"$f":"IF(M44=\"\",\"\",TEST!H10)","v":1}]
[null,null,{"$f":"Start!C13","v":7},{"$f":"IF(Start!D13=\"\",\"\",Start!D13)","v":""},null,null,{"$f":"IF(D45=\"\",\"\",'PJ-C'!M23)","v":""},null,{"$f":"IF($D45=\"\",\"\",'PJ-C'!Q23)","v":""},null,null,{"$f":"Start!C13","v":7},{"$f":"IF(Start!D13=\"\",\"\",Start!D13)","v":""},null,null,{"$f":"IF(M45=\"\",\"\",TEST!D11)","v":""},null,{"$f":"IF(M45=\"\",\"\",TEST!H11)","v":""}]
[null,null,{"$f":"Start!C14","v":8},{"$f":"IF(Start!D14=\"\",\"\",Start!D14)","v":""},null,null,{"$f":"IF(D46=\"\",\"\",'PJ-C'!M26)","v":""},null,{"$f":"IF($D46=\"\",\"\",'PJ-C'!Q26)","v":""},null,null,{"$f":"Start!C14","v":8},{"$f":"IF(Start!D14=\"\",\"\",Start!D14)","v":""},null,null,{"$f":"IF(M46=\"\",\"\",TEST!D12)","v":""},null,{"$f":"IF(M46=\"\",\"\",TEST!H12)","v":""}]
[null,null,{"$f":"Start!C15","v":9},{"$f":"IF(Start!D15=\"\",\"\",Start!D15)","v":""},null,null,{"$f":"IF(D47=\"\",\"\",'PJ-C'!M29)","v":""},null,{"$f":"IF($D47=\"\",\"\",'PJ-C'!Q29)","v":""},null,null,{"$f":"Start!C15","v":9},{"$f":"IF(Start!D15=\"\",\"\",Start!D15)","v":""},null,null,{"$f":"IF(M47=\"\",\"\",TEST!D13)","v":""},null,{"$f":"IF(M47=\"\",\"\",TEST!H13)","v":""}]
[null,null,{"$f":"Start!C16","v":10},{"$f":"IF(Start!D16=\"\",\"\",Start!D16)","v":""},null,null,{"$f":"IF(D48=\"\",\"\",'PJ-C'!M32)","v":""},null,{"$f":"IF($D48=\"\",\"\",'PJ-C'!Q32)","v":""},null,null,{"$f":"Start!C16","v":10},{"$f":"IF(Start!D16=\"\",\"\",Start!D16)","v":""},null,null,{"$f":"IF(M48=\"\",\"\",TEST!D14)","v":""},null,{"$f":"IF(M48=\"\",\"\",TEST!H14)","v":""}]
[null,null,{"$f":"Start!C17","v":11},{"$f":"IF(Start!D17=\"\",\"\",Start!D17)","v":""},null,null,{"$f":"IF(D49=\"\",\"\",'PJ-C'!M39)","v":""},null,{"$f":"IF($D49=\"\",\"\",'PJ-C'!Q39)","v":""},null,null,{"$f":"Start!C17","v":11},{"$f":"IF(Start!D17=\"\",\"\",Start!D17)","v":""},null,null,{"$f":"IF(M49=\"\",\"\",TEST!D15)","v":""},null,{"$f":"IF(M49=\"\",\"\",TEST!H15)","v":""}]
[null,null,{"$f":"Start!C18","v":12},{"$f":"IF(Start!D18=\"\",\"\",Start!D18)","v":""},null,null,{"$f":"IF(D50=\"\",\"\",'PJ-C'!M42)","v":""},null,{"$f":"IF($D50=\"\",\"\",'PJ-C'!Q42)","v":""},null,null,{"$f":"Start!C18","v":12},{"$f":"IF(Start!D18=\"\",\"\",Start!D18)","v":""},null,null,{"$f":"IF(M50=\"\",\"\",TEST!D16)","v":""},null,{"$f":"IF(M50=\"\",\"\",TEST!H16)","v":""}]
[null,null,{"$f":"Start!C19","v":13},{"$f":"IF(Start!D19=\"\",\"\",Start!D19)","v":""},null,null,{"$f":"IF(D51=\"\",\"\",'PJ-C'!M45)","v":""},null,{"$f":"IF($D51=\"\",\"\",'PJ-C'!Q45)","v":""},null,null,{"$f":"Start!C19","v":13},{"$f":"IF(Start!D19=\"\",\"\",Start!D19)","v":""},null,null,{"$f":"IF(M51=\"\",\"\",TEST!D17)","v":""},null,{"$f":"IF(M51=\"\",\"\",TEST!H17)","v":""}]
[null,null,{"$f":"Start!C20","v":14},{"$f":"IF(Start!D20=\"\",\"\",Start!D20)","v":""},null,null,{"$f":"IF(D52=\"\",\"\",'PJ-C'!M48)","v":""},null,{"$f":"IF($D52=\"\",\"\",'PJ-C'!Q48)","v":""},null,null,{"$f":"Start!C20","v":14},{"$f":"IF(Start!D20=\"\",\"\",Start!D20)","v":""},null,null,{"$f":"IF(M52=\"\",\"\",TEST!D18)","v":""},null,{"$f":"IF(M52=\"\",\"\",TEST!H18)","v":""}]
[null,null,{"$f":"Start!C21","v":15},{"$f":"IF(Start!D21=\"\",\"\",Start!D21)","v":""},null,null,{"$f":"IF(D53=\"\",\"\",'PJ-C'!M51)","v":""},null,{"$f":"IF($D53=\"\",\"\",'PJ-C'!Q51)","v":""},null,null,{"$f":"Start!C21","v":15},{"$f":"IF(Start!D21=\"\",\"\",Start!D21)","v":""},null,null,{"$f":"IF(M53=\"\",\"\",TEST!D19)","v":""},null,{"$f":"IF(M53=\"\",\"\",TEST!H19)","v":""}]
[null,null,{"$f":"Start!C22","v":16},{"$f":"IF(Start!D22=\"\",\"\",Start!D22)","v":""},null,null,{"$f":"IF(D54=\"\",\"\",'PJ-C'!M54)","v":""},null,{"$f":"IF($D54=\"\",\"\",'PJ-C'!Q54)","v":""},null,null,{"$f":"Start!C22","v":16},{"$f":"IF(Start!D22=\"\",\"\",Start!D22)","v":""},null,null,{"$f":"IF(M54=\"\",\"\",TEST!D20)","v":""},null,{"$f":"IF(M54=\"\",\"\",TEST!H20)","v":""}]
[null,null,{"$f":"Start!C23","v":17},{"$f":"IF(Start!D23=\"\",\"\",Start!D23)","v":""},null,null,{"$f":"IF(D55=\"\",\"\",'PJ-C'!M57)","v":""},null,{"$f":"IF($D55=\"\",\"\",'PJ-C'!Q57)","v":""},null,null,{"$f":"Start!C23","v":17},{"$f":"IF(Start!D23=\"\",\"\",Start!D23)","v":""},null,null,{"$f":"IF(M55=\"\",\"\",TEST!D21)","v":""},null,{"$f":"IF(M55=\"\",\"\",TEST!H21)","v":""}]
[null,null,{"$f":"Start!C24","v":18},{"$f":"IF(Start!D24=\"\",\"\",Start!D24)","v":""},null,null,{"$f":"IF(D56=\"\",\"\",'PJ-C'!M60)","v":""},null,{"$f":"IF($D56=\"\",\"\",'PJ-C'!Q60)","v":""},null,null,{"$f":"Start!C24","v":18},{"$f":"IF(Start!D24=\"\",\"\",Start!D24)","v":""},null,null,{"$f":"IF(M56=\"\",\"\",TEST!D22)","v":""},null,{"$f":"IF(M56=\"\",\"\",TEST!H22)","v":""}]
[null,null,{"$f":"Start!C25","v":19},{"$f":"IF(Start!D25=\"\",\"\",Start!D25)","v":""},null,null,{"$f":"IF(D57=\"\",\"\",'PJ-C'!M63)","v":""},null,{"$f":"IF($D57=\"\",\"\",'PJ-C'!Q63)","v":""},null,null,{"$f":"Start!C25","v":19},{"$f":"IF(Start!D25=\"\",\"\",Start!D25)","v":""},null,null,{"$f":"IF(M57=\"\",\"\",TEST!D23)","v":""},null,{"$f":"IF(M57=\"\",\"\",TEST!H23)","v":""}]
[null,null,{"$f":"Start!C26","v":20},{"$f":"IF(Start!D26=\"\",\"\",Start!D26)","v":""},null,null,{"$f":"IF(D58=\"\",\"\",'PJ-C'!M66)","v":""},null,{"$f":"IF($D58=\"\",\"\",'PJ-C'!Q66)","v":""},null,null,{"$f":"Start!C26","v":20},{"$f":"IF(Start!D26=\"\",\"\",Start!D26)","v":""},null,null,{"$f":"IF(M58=\"\",\"\",TEST!D24)","v":""},null,{"$f":"IF(M58=\"\",\"\",TEST!H24)","v":""}]
[null,null,{"$f":"Start!C27","v":21},{"$f":"IF(Start!D27=\"\",\"\",Start!D27)","v":""},null,null,{"$f":"IF(D59=\"\",\"\",'PJ-C'!M73)","v":""},null,{"$f":"IF($D59=\"\",\"\",'PJ-C'!Q73)","v":""},null,null,{"$f":"Start!C27","v":21},{"$f":"IF(Start!D27=\"\",\"\",Start!D27)","v":""},null,null,{"$f":"IF(M59=\"\",\"\",TEST!D25)","v":""},null,{"$f":"IF(M59=\"\",\"\",TEST!H25)","v":""}]
[null,null,{"$f":"Start!C28","v":22},{"$f":"IF(Start!D28=\"\",\"\",Start!D28)","v":""},null,null,{"$f":"IF(D60=\"\",\"\",'PJ-C'!M76)","v":""},null,{"$f":"IF($D60=\"\",\"\",'PJ-C'!Q76)","v":""},null,null,{"$f":"Start!C28","v":22},{"$f":"IF(Start!D28=\"\",\"\",Start!D28)","v":""},null,null,{"$f":"IF(M60=\"\",\"\",TEST!D26)","v":""},null,{"$f":"IF(M60=\"\",\"\",TEST!H26)","v":""}]
[null,null,{"$f":"Start!C29","v":23},{"$f":"IF(Start!D29=\"\",\"\",Start!D29)","v":""},null,null,{"$f":"IF(D61=\"\",\"\",'PJ-C'!M79)","v":""},null,{"$f":"IF($D61=\"\",\"\",'PJ-C'!Q79)","v":""},null,null,{"$f":"Start!C29","v":23},{"$f":"IF(Start!D29=\"\",\"\",Start!D29)","v":""},null,null,{"$f":"IF(M61=\"\",\"\",TEST!D27)","v":""},null,{"$f":"IF(M61=\"\",\"\",TEST!H27)","v":""}]
[null,null,{"$f":"Start!C30","v":24},{"$f":"IF(Start!D30=\"\",\"\",Start!D30)","v":""},null,null,{"$f":"IF(D62=\"\",\"\",'PJ-C'!M82)","v":""},null,{"$f":"IF($D62=\"\",\"\",'PJ-C'!Q82)","v":""},null,null,{"$f":"Start!C30","v":24},{"$f":"IF(Start!D30=\"\",\"\",Start!D30)","v":""},null,null,{"$f":"IF(M62=\"\",\"\",TEST!D28)","v":""},null,{"$f":"IF(M62=\"\",\"\",TEST!H28)","v":""}]
[null,null,{"$f":"Start!C31","v":25},{"$f":"IF(Start!D31=\"\",\"\",Start!D31)","v":""},null,null,{"$f":"IF(D63=\"\",\"\",'PJ-C'!M85)","v":""},null,{"$f":"IF($D63=\"\",\"\",'PJ-C'!Q85)","v":""},null,null,{"$f":"Start!C31","v":25},{"$f":"IF(Start!D31=\"\",\"\",Start!D31)","v":""},null,null,{"$f":"IF(M63=\"\",\"\",TEST!D29)","v":""},null,{"$f":"IF(M63=\"\",\"\",TEST!H29)","v":""}]

{"sheet":"Tisk-v2","index":21,"n_rows":58,"n_cols":17,"rows_kept":58,"cut":false,"hidden":false,"merged":[[34,15,35,15],[32,15,33,15],[30,15,31,15],[28,15,29,15],[24,15,25,15],[22,15,23,15],[44,15,45,15],[42,15,43,15],[40,15,41,15],[52,15,53,15],[56,14,57,14],[50,15,51,15],[48,15,49,15],[50,14,51,14],[38,15,39,15],[54,13,55,13],[56,13,57,13],[56,15,57,15],[54,15,55,15],[54,14,55,14],[46,13,47,13],[48,13,49,13],[50,13,51,13],[52,13,53,13],[46,15,47,15],[36,13,37,13],[38,13,39,13],[40,13,41,13],[42,13,43,13],[0,1,0,16],[8,13,9,13],[6,13,7,13],[6,15,7,15],[8,15,9,15],[8,8,9,8],[36,15,37,15],[2,2,2,6],[2,8,2,14],[18,15,19,15],[16,15,17,15],[14,15,15,15],[12,15,13,15],[26,15,27,15],[28,13,29,13],[30,13,31,13],[32,13,33,13],[34,13,35,13],[34,11,35,11],[34,12,35,12],[6,4,7,4],[4,5,4,6],[4,7,4,8],[5,5,5,6],[14,16,15,16],[16,16,17,16],[16,10,17,10],[16,14,17,14],[14,14,15,14],[8,14,9,14],[10,15,11,15],[6,9,7,9],[12,13,13,13],[14,13,15,13],[16,13,17,13],[4,9,4,10],[4,11,4,12],[5,9,5,10],[5,11,5,12],[14,8,15,8],[8,9,9,9],[10,9,11,9],[12,9,13,9],[14,9,15,9],[18,16,19,16],[20,16,21,16],[5,16,7,16],[8,16,9,16],[10,16,11,16],[12,16,13,16],[20,15,21,15],[5,14,7,14],[10,14,11,14],[12,14,13,14],[36,0,37,0],[36,1,37,1],[36,2,37,2],[36,3,37,3],[36,4,37,4],[36,6,37,6],[36,8,37,8],[34,10,35,10],[36,9,37,9],[34,4,35,4],[34,6,35,6],[34,8,35,8],[32,10,33,10],[34,0,35,0],[34,1,35,1],[34,2,35,2],[34,3,35,3],[34,14,35,14],[32,11,33,11],[32,0,33,0],[32,1,33,1],[32,2,33,2],[32,3,33,3],[32,4,33,4],[32,6,33,6],[32,8,33,8],[32,12,33,12],[32,14,33,14],[30,0,31,0],[30,1,31,1],[30,2,31,2],[30,3,31,3],[30,4,31,4],[30,6,31,6],[30,8,31,8],[30,11,31,11],[30,14,31,14],[28,0,29,0],[28,1,29,1],[28,2,29,2],[28,3,29,3],[28,4,29,4],[28,6,29,6],[28,8,29,8],[28,9,29,9],[28,10,29,10],[26,0,27,0],[26,1,27,1],[26,2,27,2],[26,3,27,3],[26,4,27,4],[26,6,27,6],[26,8,27,8],[26,9,27,9],[26,10,27,10],[24,0,25,0],[24,1,25,1],[24,2,25,2],[24,3,25,3],[24,4,25,4],[24,6,25,6],[24,8,25,8],[24,9,25,9],[24,10,25,10],[20,8,21,8],[20,9,21,9],[20,10,21,10],[20,14,21,14],[22,0,23,0],[22,1,23,1],[22,2,23,2],[22,3,23,3],[22,4,23,4],[22,6,23,6],[22,8,23,8],[22,9,23,9],[22,10,23,10],[22,14,23,14],[20,13,21,13],[22,13,23,13],[20,12,21,12],[22,12,23,12],[38,8,39,8],[16,4,17,4],[8,6,9,6],[10,0,11,0],[10,1,11,1],[10,2,11,2],[8,0,9,0],[8,1,9,1],[8,2,9,2],[8,3,9,3],[10,3,11,3],[18,8,19,8],[16,0,17,0],[16,1,17,1],[16,2,17,2],[16,3,17,3],[16,8,17,8],[18,0,19,0],[18,1,19,1],[18,2,19,2],[18,3,19,3],[18,4,19,4],[18,6,19,6],[20,0,21,0],[40,6,41,6],[40,4,41,4],[42,6,43,6],[42,4,43,4],[40,3,41,3],[42,3,43,3],[12,6,13,6],[14,0,15,0],[14,1,15,1],[14,2,15,2],[14,6,15,6],[12,0,13,0],[12,1,13,1],[14,4,15,4],[12,2,13,2],[12,3,13,3],[38,6,39,6],[38,4,39,4],[12,4,13,4],[20,1,21,1],[20,2,21,2],[20,3,21,3],[20,4,21,4],[20,6,21,6],[38,0,39,0],[38,1,39,1],[38,2,39,2],[40,0,41,0],[40,1,41,1],[40,2,41,2],[42,0,43,0],[42,1,43,1],[42,2,43,2],[46,0,47,0],[46,1,47,1],[46,2,47,2],[46,6,47,6],[46,3,47,3],[46,4,47,4],[44,0,45,0],[44,1,45,1],[44,2,45,2],[44,6,45,6],[44,4,45,4],[44,3,45,3],[48,4,49,4],[50,8,51,8],[52,8,53,8],[48,0,49,0],[48,1,49,1],[48,2,49,2],[48,6,49,6],[48,3,49,3],[50,0,51,0],[50,1,51,1],[50,2,51,2],[50,6,51,6],[50,4,51,4],[50,3,51,3],[52,0,53,0],[52,1,53,1],[52,2,53,2],[52,6,53,6],[52,4,53,4],[52,3,53,3],[56,0,57,0],[56,1,57,1],[56,2,57,2],[56,6,57,6],[56,4,57,4],[56,3,57,3],[54,0,55,0],[54,1,55,1],[54,2,55,2],[54,6,55,6],[54,4,55,4],[54,3,55,3],[38,10,39,10],[30,10,31,10],[36,10,37,10],[40,10,41,10],[46,10,47,10],[48,10,49,10],[50,10,51,10],[22,16,23,16],[24,16,25,16],[26,16,27,16],[28,16,29,16],[26,12,27,12],[38,14,39,14],[48,14,49,14],[44,14,45,14],[46,14,47,14],[40,14,41,14],[42,14,43,14],[24,14,25,14],[26,14,27,14],[28,14,29,14],[36,11,37,11],[36,12,37,12],[36,14,37,14],[44,8,45,8],[40,8,41,8],[42,8,43,8],[42,10,43,10],[44,9,45,9],[44,10,45,10],[42,9,43,9],[56,8,57,8],[56,10,57,10],[46,8,47,8],[54,8,55,8],[48,8,49,8],[46,9,47,9],[48,9,49,9],[54,10,55,10],[52,10,53,10],[54,9,55,9],[56,9,57,9],[26,13,27,13],[12,12,13,12],[14,12,15,12],[12,11,13,11],[14,11,15,11],[24,11,25,11],[18,13,19,13],[20,11,21,11],[22,11,23,11],[26,11,27,11],[14,10,15,10],[10,10,11,10],[12,10,13,10],[10,13,11,13],[10,12,11,12],[10,11,11,11],[18,11,19,11],[24,12,25,12],[24,13,25,13],[56,12,57,12],[52,11,53,11],[54,11,55,11],[52,14,53,14],[28,12,29,12],[30,12,31,12],[5,1,7,1],[5,2,7,2],[6,12,7,12],[8,12,9,12],[8,11,9,11],[6,10,7,10],[8,10,9,10],[8,4,9,4],[6,6,7,6],[6,8,7,8],[5,7,5,8],[5,3,7,3],[12,8,13,8],[10,6,11,6],[10,8,11,8],[10,4,11,4],[18,9,19,9],[16,9,17,9],[56,11,57,11],[30,16,31,16],[32,16,33,16],[34,16,35,16],[36,16,37,16],[38,16,39,16],[40,16,41,16],[42,16,43,16],[52,12,53,12],[54,12,55,12],[38,12,39,12],[48,12,49,12],[50,12,51,12],[44,13,45,13],[38,11,39,11],[40,12,41,12],[42,12,43,12],[44,12,45,12],[56,16,57,16],[46,11,47,11],[44,16,45,16],[46,16,47,16],[46,12,47,12],[44,11,45,11],[48,16,49,16],[50,16,51,16],[52,16,53,16],[54,16,55,16],[50,11,51,11],[48,11,49,11],[42,11,43,11],[16,11,17,11],[14,3,15,3],[38,3,39,3],[38,9,39,9],[40,9,41,9],[30,9,31,9],[32,9,33,9],[34,9,35,9],[16,6,17,6],[52,9,53,9],[50,9,51,9],[40,11,41,11],[28,11,29,11],[18,10,19,10],[18,14,19,14],[16,12,17,12],[18,12,19,12]]}
[null,"Celkové výsledky"]
[]
[null,null,{"$f":"Start!$B$2","v":"Krajské kolo dorostu"},null,null,null,null,null,{"$f":"Start!$B$3","v":"18.06.2022 Pardubice"}]
[]
[null,null,{"$f":"Start!$D$5","v":"dorostenky"}]
[null," startovní číslo"," SDH",{"$f":"Start!$E$6","v":"OKRES"}," ZPV"," PÚ",null," Štafeta 4x100m",null,"Test",null,"Běh na 100m s přek.",null,null," Celkový součet bodů",null,"Celkové pořadí"]
[null,null,null,null,"P.","1.pokus","P.","1.pokus","P.","Tr.Bodů","P.","Součet","P."]
[null,null,null,null,null,"2.pokus",null,"2.pokus",null,null,null,"Družstva"]
[null,{"$f":"Start!$C7","v":1},{"$f":"IF(Start!$D7=\"\",\"\",Start!$D7)","v":"Kamenec"},{"$f":"IF(Start!$E7=\"\",\"\",Start!$E7)","v":"SY"},{"$f":"IF($C9=\"\",\"\",IF('V.l.ZPV'!$C$6=\"\",\"0\",IF(ISNA(MATCH($C9,ZPVOblN,0)),COUNTIF(ZPVOblT,\".\")+1,LOOKUP($C9,ZPVOblN,ZPVOblD))))","v":"0"},{"$f":"IF($C$9=\"\",\"\",PÚ!$G$5)","v":40.130000000000003},{"$f":"IF($C9=\"\",\"\",PÚ!$P$5)","v":2},{"$f":"IF($C$9=\"\",\"\",'4x100m'!$G$5)","v":74.3},{"$f":"IF($C9=\"\",\"\",'4x100m'!$P$5)","v":3},{"$f":"IF($C9=\"\",\"\",TEST!$D$5)","v":0},{"$f":"IF($C9=\"\",\"\",TEST!$H$5)","v":1},{"$f":"IF($C9=\"\",\"\",'PJ-C'!$M$5)","v":107.2},{"$f":"IF($C9=\"\",\"\",'PJ-C'!$Q$5)","v":4},null,{"$f":"IF($C$9=\"\",\"\",SUM(E9,G9,I9,K9,M9))","v":10},null,{"$f":"IF($C9=\"\",\"\",MATCH($C9,Výsledky!$M$8:$M$32,0))","v":3}]
[null,null,null,null,null,{"$f":"IF($C$9=\"\",\"\",PÚ!$K$5)","v":38.229999999999997},null,{"$f":"IF($C$9=\"\",\"\",'4x100m'!$K$5)","v":72.63}]
[null,{"$f":"Start!$C8","v":2},{"$f":"IF(Start!$D8=\"\",\"\",Start!$D8)","v":"Lukavice"},{"$f":"IF(Start!$E8=\"\",\"\",Start!$E8)","v":"CR"},{"$f":"IF($C11=\"\",\"\",IF('V.l.ZPV'!$C$6=\"\",\"0\",IF(ISNA(MATCH($C11,ZPVOblN,0)),COUNTIF(ZPVOblT,\".\")+1,LOOKUP($C11,ZPVOblN,ZPVOblD))))","v":"0"},{"$f":"IF($C$9=\"\",\"\",PÚ!$G$6)","v":"NP"},{"$f":"IF($C11=\"\",\"\",PÚ!$P$6)","v":5},{"$f":"IF($C$9=\"\",\"\",'4x100m'!$G$6)","v":81.400000000000006},{"$f":"IF($C11=\"\",\"\",'4x100m'!$P$6)","v":6},{"$f":"IF($C11=\"\",\"\",TEST!$D$6)","v":1},{"$f":"IF($C11=\"\",\"\",TEST!$H$6)","v":5},{"$f":"IF($C11=\"\",\"\",'PJ-C'!$M$8)","v":115.31},{"$f":"IF($C11=\"\",\"\",'PJ-C'!$Q$8)","v":5},null,{"$f":"IF($C$9=\"\",\"\",SUM(E11,G11,I11,K11,M11))","v":21},null,{"$f":"IF($C11=\"\",\"\",MATCH($C11,Výsledky!$M$8:$M$32,0))","v":5}]
[null,null,null,null,null,{"$f":"IF($C$9=\"\",\"\",PÚ!$K$6)","v":62.53},null,{"$f":"IF($C$9=\"\",\"\",'4x100m'!$K$6)","v":"NP"}]
[null,{"$f":"Start!$C9","v":3},{"$f":"IF(Start!$D9=\"\",\"\",Start!$D9)","v":"Lubná"},{"$f":"IF(Start!$E9=\"\",\"\",Start!$E9)","v":"SY"},{"$f":"IF($C13=\"\",\"\",IF('V.l.ZPV'!$C$6=\"\",\"0\",IF(ISNA(MATCH($C13,ZPVOblN,0)),COUNTIF(ZPVOblT,\".\")+1,LOOKUP($C13,ZPVOblN,ZPVOblD))))","v":"0"},{"$f":"IF($C$9=\"\",\"\",PÚ!$G$7)","v":34.39},{"$f":"IF($C13=\"\",\"\",PÚ!$P$7)","v":1},{"$f":"IF($C$9=\"\",\"\",'4x100m'!$G$7)","v":69.41},{"$f":"IF($C13=\"\",\"\",'4x100m'!$P$7)","v":2},{"$f":"IF($C13=\"\",\"\",TEST!$D$7)","v":0},{"$f":"IF($C13=\"\",\"\",TEST!$H$7)","v":1},{"$f":"IF($C13=\"\",\"\",'PJ-C'!$M$11)","v":105.67},{"$f":"IF($C13=\"\",\"\",'PJ-C'!$Q$11)","v":3},null,{"$f":"IF($C$9=\"\",\"\",SUM(E13,G13,I13,K13,M13))","v":7},null,{"$f":"IF($C13=\"\",\"\",MATCH($C13,Výsledky!$M$8:$M$32,0))","v":1}]
[null,null,null,null,null,{"$f":"IF($C$9=\"\",\"\",PÚ!$K$7)","v":50.33},null,{"$f":"IF($C$9=\"\",\"\",'4x100m'!$K$7)","v":"NP"}]
[null,{"$f":"Start!$C10","v":4},{"$f":"IF(Start!$D10=\"\",\"\",Start!$D10)","v":"Skuteč"},{"$f":"IF(Start!$E10=\"\",\"\",Start!$E10)","v":"CR"},{"$f":"IF($C15=\"\",\"\",IF('V.l.ZPV'!$C$6=\"\",\"0\",IF(ISNA(MATCH($C15,ZPVOblN,0)),COUNTIF(ZPVOblT,\".\")+1,LOOKUP($C15,ZPVOblN,ZPVOblD))))","v":"0"},{"$f":"IF($C$9=\"\",\"\",PÚ!$G$8)","v":41.35},{"$f":"IF($C15=\"\",\"\",PÚ!$P$8)","v":4},{"$f":"IF($C$9=\"\",\"\",'4x100m'!$G$8)","v":67.17},{"$f":"IF($C15=\"\",\"\",'4x100m'!$P$8)","v":1},{"$f":"IF($C15=\"\",\"\",TEST!$D$8)","v":0},{"$f":"IF($C15=\"\",\"\",TEST!$H$8)","v":1},{"$f":"IF($C15=\"\",\"\",'PJ-C'!$M$14)","v":96.289999999999992},{"$f":"IF($C15=\"\",\"\",'PJ-C'!$Q$14)","v":1},null,{"$f":"IF($C$9=\"\",\"\",SUM(E15,G15,I15,K15,M15))","v":7},null,{"$f":"IF($C15=\"\",\"\",MATCH($C15,Výsledky!$M$8:$M$32,0))","v":2}]
[null,null,null,null,null,{"$f":"IF($C$9=\"\",\"\",PÚ!$K$8)","v":42.14},null,{"$f":"IF($C$9=\"\",\"\",'4x100m'!$K$8)","v":68.83}]
[null,{"$f":"Start!$C11","v":5},{"$f":"IF(Start!$D11=\"\",\"\",Start!$D11)","v":"Bystřec"},{"$f":"IF(Start!$E11=\"\",\"\",Start!$E11)","v":"UO"},{"$f":"IF($C17=\"\",\"\",IF('V.l.ZPV'!$C$6=\"\",\"0\",IF(ISNA(MATCH($C17,ZPVOblN,0)),COUNTIF(ZPVOblT,\".\")+1,LOOKUP($C17,ZPVOblN,ZPVOblD))))","v":"0"},{"$f":"IF($C$9=\"\",\"\",PÚ!$G$9)","v":73.44},{"$f":"IF($C17=\"\",\"\",PÚ!$P$9)","v":6},{"$f":"IF($C$9=\"\",\"\",'4x100m'!$G$9)","v":81.05},{"$f":"IF($C17=\"\",\"\",'4x100m'!$P$9)","v":5},{"$f":"IF($C17=\"\",\"\",TEST!$D$9)","v":3},{"$f":"IF($C17=\"\",\"\",TEST!$H$9)","v":6},{"$f":"IF($C17=\"\",\"\",'PJ-C'!$M$17)","v":115.66},{"$f":"IF($C17=\"\",\"\",'PJ-C'!$Q$17)","v":6},null,{"$f":"IF($C$9=\"\",\"\",SUM(E17,G17,I17,K17,M17))","v":23},null,{"$f":"IF($C17=\"\",\"\",MATCH($C17,Výsledky!$M$8:$M$32,0))","v":6}]
[null,null,null,null,null,{"$f":"IF($C$9=\"\",\"\",PÚ!$K$9)","v":"DNF"},null,{"$f":"IF($C$9=\"\",\"\",'4x100m'!$K$9)","v":82.65}]
[null,{"$f":"Start!$C12","v":6},{"$f":"IF(Start!$D12=\"\",\"\",Start!$D12)","v":"Letohrad Kunčice"},{"$f":"IF(Start!$E12=\"\",\"\",Start!$E12)","v":"UO"},{"$f":"IF($C19=\"\",\"\",IF('V.l.ZPV'!$C$6=\"\",\"0\",IF(ISNA(MATCH($C19,ZPVOblN,0)),COUNTIF(ZPVOblT,\".\")+1,LOOKUP($C19,ZPVOblN,ZPVOblD))))","v":"0"},{"$f":"IF($C$9=\"\",\"\",PÚ!$G$10)","v":39.6},{"$f":"IF($C19=\"\",\"\",PÚ!$P$10)","v":3},{"$f":"IF($C$9=\"\",\"\",'4x100m'!$G$10)","v":73.150000000000006},{"$f":"IF($C19=\"\",\"\",'4x100m'!$P$10)","v":4},{"$f":"IF($C19=\"\",\"\",TEST!$D$10)","v":0},{"$f":"IF($C19=\"\",\"\",TEST!$H$10)","v":1},{"$f":"IF($C19=\"\",\"\",'PJ-C'!$M$20)","v":104.83},{"$f":"IF($C19=\"\",\"\",'PJ-C'!$Q$20)","v":2},null,{"$f":"IF($C$9=\"\",\"\",SUM(E19,G19,I19,K19,M19))","v":10},null,{"$f":"IF($C19=\"\",\"\",MATCH($C19,Výsledky!$M$8:$M$32,0))","v":4}]
[null,null,null,null,null,{"$f":"IF($C$9=\"\",\"\",PÚ!$K$10)","v":40.07},null,{"$f":"IF($C$9=\"\",\"\",'4x100m'!$K$10)","v":73.28}]
[null,{"$f":"Start!$C13","v":7},{"$f":"IF(Start!$D13=\"\",\"\",Start!$D13)","v":""},{"$f":"IF(Start!$E13=\"\",\"\",Start!$E13)","v":""},{"$f":"IF($C21=\"\",\"\",IF('V.l.ZPV'!$C$6=\"\",\"0\",IF(ISNA(MATCH($C21,ZPVOblN,0)),COUNTIF(ZPVOblT,\".\")+1,LOOKUP($C21,ZPVOblN,ZPVOblD))))","v":""},{"$f":"IF($C$9=\"\",\"\",PÚ!$G$11)","v":""},{"$f":"IF($C21=\"\",\"\",PÚ!$P$11)","v":""},{"$f":"IF($C$9=\"\",\"\",'4x100m'!$G$11)","v":""},{"$f":"IF($C21=\"\",\"\",'4x100m'!$P$11)","v":""},{"$f":"IF($C21=\"\",\"\",TEST!$D$11)","v":""},{"$f":"IF($C21=\"\",\"\",TEST!$H$11)","v":""},{"$f":"IF($C21=\"\",\"\",'PJ-C'!$M$23)","v":""},{"$f":"IF($C21=\"\",\"\",'PJ-C'!$Q$23)","v":""},null,{"$f":"IF($C$9=\"\",\"\",SUM(E21,G21,I21,K21,M21))","v":0},null,{"$f":"IF($C21=\"\",\"\",MATCH($C21,Výsledky!$M$8:$M$32,0))","v":""}]
[null,null,null,null,null,{"$f":"IF($C$9=\"\",\"\",PÚ!$K$11)","v":""},null,{"$f":"IF($C$9=\"\",\"\",'4x100m'!$K$11)","v":""}]
[null,{"$f":"Start!$C14","v":8},{"$f":"IF(Start!$D14=\"\",\"\",Start!$D14)","v":""},{"$f":"IF(Start!$E14=\"\",\"\",Start!$E14)","v":""},{"$f":"IF($C23=\"\",\"\",IF('V.l.ZPV'!$C$6=\"\",\"0\",IF(ISNA(MATCH($C23,ZPVOblN,0)),COUNTIF(ZPVOblT,\".\")+1,LOOKUP($C23,ZPVOblN,ZPVOblD))))","v":""},{"$f":"IF($C$9=\"\",\"\",PÚ!$G$12)","v":""},{"$f":"IF($C23=\"\",\"\",PÚ!$P$12)","v":""},{"$f":"IF($C$9=\"\",\"\",'4x100m'!$G$12)","v":""},{"$f":"IF($C23=\"\",\"\",'4x100m'!$P$12)","v":""},{"$f":"IF($C23=\"\",\"\",TEST!$D$12)","v":""},{"$f":"IF($C23=\"\",\"\",TEST!$H$12)","v":""},{"$f":"IF($C23=\"\",\"\",'PJ-C'!$M$26)","v":""},{"$f":"IF($C23=\"\",\"\",'PJ-C'!$Q$26)","v":""},null,{"$f":"IF($C$9=\"\",\"\",SUM(E23,G23,I23,K23,M23))","v":0},null,{"$f":"IF($C23=\"\",\"\",MATCH($C23,Výsledky!$M$8:$M$32,0))","v":""}]
[null,null,null,null,null,{"$f":"IF($C$9=\"\",\"\",PÚ!$K$12)","v":""},null,{"$f":"IF($C$9=\"\",\"\",'4x100m'!$K$12)","v":""}]
[null,{"$f":"Start!$C15","v":9},{"$f":"IF(Start!$D15=\"\",\"\",Start!$D15)","v":""},{"$f":"IF(Start!$E15=\"\",\"\",Start!$E15)","v":""},{"$f":"IF($C25=\"\",\"\",IF('V.l.ZPV'!$C$6=\"\",\"0\",IF(ISNA(MATCH($C25,ZPVOblN,0)),COUNTIF(ZPVOblT,\".\")+1,LOOKUP($C25,ZPVOblN,ZPVOblD))))","v":""},{"$f":"IF($C$9=\"\",\"\",PÚ!$G$13)","v":""},{"$f":"IF($C25=\"\",\"\",PÚ!$P$13)","v":""},{"$f":"IF($C$9=\"\",\"\",'4x100m'!$G$13)","v":""},{"$f":"IF($C25=\"\",\"\",'4x100m'!$P$13)","v":""},{"$f":"IF($C25=\"\",\"\",TEST!$D$13)","v":""},{"$f":"IF($C25=\"\",\"\",TEST!$H$13)","v":""},{"$f":"IF($C25=\"\",\"\",'PJ-C'!$M$29)","v":""},{"$f":"IF($C25=\"\",\"\",'PJ-C'!$Q$29)","v":""},null,{"$f":"IF($C$9=\"\",\"\",SUM(E25,G25,I25,K25,M25))","v":0},null,{"$f":"IF($C25=\"\",\"\",MATCH($C25,Výsledky!$M$8:$M$32,0))","v":""}]
[null,null,null,null,null,{"$f":"IF($C$9=\"\",\"\",PÚ!$K$13)","v":""},null,{"$f":"IF($C$9=\"\",\"\",'4x100m'!$K$13)","v":""}]
[null,{"$f":"Start!$C16","v":10},{"$f":"IF(Start!$D16=\"\",\"\",Start!$D16)","v":""},{"$f":"IF(Start!$E16=\"\",\"\",Start!$E16)","v":""},{"$f":"IF($C27=\"\",\"\",IF('V.l.ZPV'!$C$6=\"\",\"0\",IF(ISNA(MATCH($C27,ZPVOblN,0)),COUNTIF(ZPVOblT,\".\")+1,LOOKUP($C27,ZPVOblN,ZPVOblD))))","v":""},{"$f":"IF($C$9=\"\",\"\",PÚ!$G$14)","v":""},{"$f":"IF($C27=\"\",\"\",PÚ!$P$14)","v":""},{"$f":"IF($C$9=\"\",\"\",'4x100m'!$G$14)","v":""},{"$f":"IF($C27=\"\",\"\",'4x100m'!$P$14)","v":""},{"$f":"IF($C27=\"\",\"\",TEST!$D$14)","v":""},{"$f":"IF($C27=\"\",\"\",TEST!$H$14)","v":""},{"$f":"IF($C27=\"\",\"\",'PJ-C'!$M$32)","v":""},{"$f":"IF($C27=\"\",\"\",'PJ-C'!$Q$32)","v":""},null,{"$f":"IF($C$9=\"\",\"\",SUM(E27,G27,I27,K27,M27))","v":0},null,{"$f":"IF($C27=\"\",\"\",MATCH($C27,Výsledky!$M$8:$M$32,0))","v":""}]
[null,null,null,null,null,{"$f":"IF($C$9=\"\",\"\",PÚ!$K$14)","v":""},null,{"$f":"IF($C$9=\"\",\"\",'4x100m'!$K$14)","v":""}]
[null,{"$f":"Start!$C17","v":11},{"$f":"IF(Start!$D17=\"\",\"\",Start!$D17)","v":""},{"$f":"IF(Start!$E17=\"\",\"\",Start!$E17)","v":""},{"$f":"IF($C29=\"\",\"\",IF('V.l.ZPV'!$C$6=\"\",\"0\",IF(ISNA(MATCH($C29,ZPVOblN,0)),COUNTIF(ZPVOblT,\".\")+1,LOOKUP($C29,ZPVOblN,ZPVOblD))))","v":""},{"$f":"IF($C$9=\"\",\"\",PÚ!$G$15)","v":""},{"$f":"IF($C29=\"\",\"\",PÚ!$P$15)","v":""},{"$f":"IF($C$9=\"\",\"\",'4x100m'!$G$15)","v":""},{"$f":"IF($C29=\"\",\"\",'4x100m'!$P$15)","v":""},{"$f":"IF($C29=\"\",\"\",TEST!$D$15)","v":""},{"$f":"IF($C29=\"\",\"\",TEST!$H$15)","v":""},{"$f":"IF($C29=\"\",\"\",'PJ-C'!$M$39)","v":""},{"$f":"IF($C29=\"\",\"\",'PJ-C'!$Q$39)","v":""},null,{"$f":"IF($C$9=\"\",\"\",SUM(E29,G29,I29,K29,M29))","v":0},null,{"$f":"IF($C29=\"\",\"\",MATCH($C29,Výsledky!$M$8:$M$32,0))","v":""}]
[null,null,null,null,null,{"$f":"IF($C$9=\"\",\"\",PÚ!$K$15)","v":""},null,{"$f":"IF($C$9=\"\",\"\",'4x100m'!$K$15)","v":""}]
[null,{"$f":"Start!$C18","v":12},{"$f":"IF(Start!$D18=\"\",\"\",Start!$D18)","v":""},{"$f":"IF(Start!$E18=\"\",\"\",Start!$E18)","v":""},{"$f":"IF($C31=\"\",\"\",IF('V.l.ZPV'!$C$6=\"\",\"0\",IF(ISNA(MATCH($C31,ZPVOblN,0)),COUNTIF(ZPVOblT,\".\")+1,LOOKUP($C31,ZPVOblN,ZPVOblD))))","v":""},{"$f":"IF($C$9=\"\",\"\",PÚ!$G$16)","v":""},{"$f":"IF($C31=\"\",\"\",PÚ!$P$16)","v":""},{"$f":"IF($C$9=\"\",\"\",'4x100m'!$G$16)","v":""},{"$f":"IF($C31=\"\",\"\",'4x100m'!$P$16)","v":""},{"$f":"IF($C31=\"\",\"\",TEST!$D$16)","v":""},{"$f":"IF($C31=\"\",\"\",TEST!$H$16)","v":""},{"$f":"IF($C31=\"\",\"\",'PJ-C'!$M$42)","v":""},{"$f":"IF($C31=\"\",\"\",'PJ-C'!$Q$42)","v":""},null,{"$f":"IF($C$9=\"\",\"\",SUM(E31,G31,I31,K31,M31))","v":0},null,{"$f":"IF($C31=\"\",\"\",MATCH($C31,Výsledky!$M$8:$M$32,0))","v":""}]
[null,null,null,null,null,{"$f":"IF($C$9=\"\",\"\",PÚ!$K$16)","v":""},null,{"$f":"IF($C$9=\"\",\"\",'4x100m'!$K$16)","v":""}]
[null,{"$f":"Start!$C19","v":13},{"$f":"IF(Start!$D19=\"\",\"\",Start!$D19)","v":""},{"$f":"IF(Start!$E19=\"\",\"\",Start!$E19)","v":""},{"$f":"IF($C33=\"\",\"\",IF('V.l.ZPV'!$C$6=\"\",\"0\",IF(ISNA(MATCH($C33,ZPVOblN,0)),COUNTIF(ZPVOblT,\".\")+1,LOOKUP($C33,ZPVOblN,ZPVOblD))))","v":""},{"$f":"IF($C$9=\"\",\"\",PÚ!$G$17)","v":""},{"$f":"IF($C33=\"\",\"\",PÚ!$P$17)","v":""},{"$f":"IF($C$9=\"\",\"\",'4x100m'!$G$17)","v":""},{"$f":"IF($C33=\"\",\"\",'4x100m'!$P$17)","v":""},{"$f":"IF($C33=\"\",\"\",TEST!$D$17)","v":""},{"$f":"IF($C33=\"\",\"\",TEST!$H$17)","v":""},{"$f":"IF($C33=\"\",\"\",'PJ-C'!$M$45)","v":""},{"$f":"IF($C33=\"\",\"\",'PJ-C'!$Q$45)","v":""},null,{"$f":"IF($C$9=\"\",\"\",SUM(E33,G33,I33,K33,M33))","v":0},null,{"$f":"IF($C33=\"\",\"\",MATCH($C33,Výsledky!$M$8:$M$32,0))","v":""}]
[null,null,null,null,null,{"$f":"IF($C$9=\"\",\"\",PÚ!$K$17)","v":""},null,{"$f":"IF($C$9=\"\",\"\",'4x100m'!$K$17)","v":""}]
[null,{"$f":"Start!$C20","v":14},{"$f":"IF(Start!$D20=\"\",\"\",Start!$D20)","v":""},{"$f":"IF(Start!$E20=\"\",\"\",Start!$E20)","v":""},{"$f":"IF($C35=\"\",\"\",IF('V.l.ZPV'!$C$6=\"\",\"0\",IF(ISNA(MATCH($C35,ZPVOblN,0)),COUNTIF(ZPVOblT,\".\")+1,LOOKUP($C35,ZPVOblN,ZPVOblD))))","v":""},{"$f":"IF($C$9=\"\",\"\",PÚ!$G$18)","v":""},{"$f":"IF($C35=\"\",\"\",PÚ!$P$18)","v":""},{"$f":"IF($C$9=\"\",\"\",'4x100m'!$G$18)","v":""},{"$f":"IF($C35=\"\",\"\",'4x100m'!$P$18)","v":""},{"$f":"IF($C35=\"\",\"\",TEST!$D$18)","v":""},{"$f":"IF($C35=\"\",\"\",TEST!$H$18)","v":""},{"$f":"IF($C35=\"\",\"\",'PJ-C'!$M$48)","v":""},{"$f":"IF($C35=\"\",\"\",'PJ-C'!$Q$48)","v":""},null,{"$f":"IF($C$9=\"\",\"\",SUM(E35,G35,I35,K35,M35))","v":0},null,{"$f":"IF($C35=\"\",\"\",MATCH($C35,Výsledky!$M$8:$M$32,0))","v":""}]
[null,null,null,null,null,{"$f":"IF($C$9=\"\",\"\",PÚ!$K$18)","v":""},null,{"$f":"IF($C$9=\"\",\"\",'4x100m'!$K$18)","v":""}]
[null,{"$f":"Start!$C21","v":15},{"$f":"IF(Start!$D21=\"\",\"\",Start!$D21)","v":""},{"$f":"IF(Start!$E21=\"\",\"\",Start!$E21)","v":""},{"$f":"IF($C37=\"\",\"\",IF('V.l.ZPV'!$C$6=\"\",\"0\",IF(ISNA(MATCH($C37,ZPVOblN,0)),COUNTIF(ZPVOblT,\".\")+1,LOOKUP($C37,ZPVOblN,ZPVOblD))))","v":""},{"$f":"IF($C$9=\"\",\"\",PÚ!$G$19)","v":""},{"$f":"IF($C37=\"\",\"\",PÚ!$P$19)","v":""},{"$f":"IF($C$9=\"\",\"\",'4x100m'!$G$19)","v":""},{"$f":"IF($C37=\"\",\"\",'4x100m'!$P$19)","v":""},{"$f":"IF($C37=\"\",\"\",TEST!$D$19)","v":""},{"$f":"IF($C37=\"\",\"\",TEST!$H$19)","v":""},{"$f":"IF($C37=\"\",\"\",'PJ-C'!$M$51)","v":""},{"$f":"IF($C37=\"\",\"\",'PJ-C'!$Q$51)","v":""},null,{"$f":"IF($C$9=\"\",\"\",SUM(E37,G37,I37,K37,M37))","v":0},null,{"$f":"IF($C37=\"\",\"\",MATCH($C37,Výsledky!$M$8:$M$32,0))","v":""}]
[null,null,null,null,null,{"$f":"IF($C$9=\"\",\"\",PÚ!$K$19)","v":""},null,{"$f":"IF($C$9=\"\",\"\",'4x100m'!$K$19)","v":""}]
[null,{"$f":"Start!$C22","v":16},{"$f":"IF(Start!$D22=\"\",\"\",Start!$D22)","v":""},{"$f":"IF(Start!$E22=\"\",\"\",Start!$E22)","v":""},{"$f":"IF($C39=\"\",\"\",IF('V.l.ZPV'!$C$6=\"\",\"0\",IF(ISNA(MATCH($C39,ZPVOblN,0)),COUNTIF(ZPVOblT,\".\")+1,LOOKUP($C39,ZPVOblN,ZPVOblD))))","v":""},{"$f":"IF($C$9=\"\",\"\",PÚ!$G$20)","v":""},{"$f":"IF($C39=\"\",\"\",PÚ!$P$20)","v":""},{"$f":"IF($C$9=\"\",\"\",'4x100m'!$G$20)","v":""},{"$f":"IF($C39=\"\",\"\",'4x100m'!$P$20)","v":""},{"$f":"IF($C39=\"\",\"\",TEST!$D$20)","v":""},{"$f":"IF($C39=\"\",\"\",TEST!$H$20)","v":""},{"$f":"IF($C39=\"\",\"\",'PJ-C'!$M$54)","v":""},{"$f":"IF($C39=\"\",\"\",'PJ-C'!$Q$54)","v":""},null,{"$f":"IF($C$9=\"\",\"\",SUM(E39,G39,I39,K39,M39))","v":0},null,{"$f":"IF($C39=\"\",\"\",MATCH($C39,Výsledky!$M$8:$M$32,0))","v":""}]
[null,null,null,null,null,{"$f":"IF($C$9=\"\",\"\",PÚ!$K$20)","v":""},null,{"$f":"IF($C$9=\"\",\"\",'4x100m'!$K$20)","v":""}]
[null,{"$f":"Start!$C23","v":17},{"$f":"IF(Start!$D23=\"\",\"\",Start!$D23)","v":""},{"$f":"IF(Start!$E23=\"\",\"\",Start!$E23)","v":""},{"$f":"IF($C41=\"\",\"\",IF('V.l.ZPV'!$C$6=\"\",\"0\",IF(ISNA(MATCH($C41,ZPVOblN,0)),COUNTIF(ZPVOblT,\".\")+1,LOOKUP($C41,ZPVOblN,ZPVOblD))))","v":""},{"$f":"IF($C$9=\"\",\"\",PÚ!$G$21)","v":""},{"$f":"IF($C41=\"\",\"\",PÚ!$P$21)","v":""},{"$f":"IF($C$9=\"\",\"\",'4x100m'!$G$21)","v":""},{"$f":"IF($C41=\"\",\"\",'4x100m'!$P$21)","v":""},{"$f":"IF($C41=\"\",\"\",TEST!$D$21)","v":""},{"$f":"IF($C41=\"\",\"\",TEST!$H$21)","v":""},{"$f":"IF($C41=\"\",\"\",'PJ-C'!$M$57)","v":""},{"$f":"IF($C41=\"\",\"\",'PJ-C'!$Q$57)","v":""},null,{"$f":"IF($C$9=\"\",\"\",SUM(E41,G41,I41,K41,M41))","v":0},null,{"$f":"IF($C41=\"\",\"\",MATCH($C41,Výsledky!$M$8:$M$32,0))","v":""}]
[null,null,null,null,null,{"$f":"IF($C$9=\"\",\"\",PÚ!$K$21)","v":""},null,{"$f":"IF($C$9=\"\",\"\",'4x100m'!$K$21)","v":""}]
[null,{"$f":"Start!$C24","v":18},{"$f":"IF(Start!$D24=\"\",\"\",Start!$D24)","v":""},{"$f":"IF(Start!$E24=\"\",\"\",Start!$E24)","v":""},{"$f":"IF($C43=\"\",\"\",IF('V.l.ZPV'!$C$6=\"\",\"0\",IF(ISNA(MATCH($C43,ZPVOblN,0)),COUNTIF(ZPVOblT,\".\")+1,LOOKUP($C43,ZPVOblN,ZPVOblD))))","v":""},{"$f":"IF($C$9=\"\",\"\",PÚ!$G$22)","v":""},{"$f":"IF($C43=\"\",\"\",PÚ!$P$22)","v":""},{"$f":"IF($C$9=\"\",\"\",'4x100m'!$G$22)","v":""},{"$f":"IF($C43=\"\",\"\",'4x100m'!$P$22)","v":""},{"$f":"IF($C43=\"\",\"\",TEST!$D$22)","v":""},{"$f":"IF($C43=\"\",\"\",TEST!$H$22)","v":""},{"$f":"IF($C43=\"\",\"\",'PJ-C'!$M$60)","v":""},{"$f":"IF($C43=\"\",\"\",'PJ-C'!$Q$60)","v":""},null,{"$f":"IF($C$9=\"\",\"\",SUM(E43,G43,I43,K43,M43))","v":0},null,{"$f":"IF($C43=\"\",\"\",MATCH($C43,Výsledky!$M$8:$M$32,0))","v":""}]
[null,null,null,null,null,{"$f":"IF($C$9=\"\",\"\",PÚ!$K$22)","v":""},null,{"$f":"IF($C$9=\"\",\"\",'4x100m'!$K$22)","v":""}]
[null,{"$f":"Start!$C25","v":19},{"$f":"IF(Start!$D25=\"\",\"\",Start!$D25)","v":""},{"$f":"IF(Start!$E25=\"\",\"\",Start!$E25)","v":""},{"$f":"IF($C45=\"\",\"\",IF('V.l.ZPV'!$C$6=\"\",\"0\",IF(ISNA(MATCH($C45,ZPVOblN,0)),COUNTIF(ZPVOblT,\".\")+1,LOOKUP($C45,ZPVOblN,ZPVOblD))))","v":""},{"$f":"IF($C$9=\"\",\"\",PÚ!$G$23)","v":""},{"$f":"IF($C45=\"\",\"\",PÚ!$P$23)","v":""},{"$f":"IF($C$9=\"\",\"\",'4x100m'!$G$23)","v":""},{"$f":"IF($C45=\"\",\"\",'4x100m'!$P$23)","v":""},{"$f":"IF($C45=\"\",\"\",TEST!$D$23)","v":""},{"$f":"IF($C45=\"\",\"\",TEST!$H$23)","v":""},{"$f":"IF($C45=\"\",\"\",'PJ-C'!$M$63)","v":""},{"$f":"IF($C45=\"\",\"\",'PJ-C'!$Q$63)","v":""},null,{"$f":"IF($C$9=\"\",\"\",SUM(E45,G45,I45,K45,M45))","v":0},null,{"$f":"IF($C45=\"\",\"\",MATCH($C45,Výsledky!$M$8:$M$32,0))","v":""}]
[null,null,null,null,null,{"$f":"IF($C$9=\"\",\"\",PÚ!$K$23)","v":""},null,{"$f":"IF($C$9=\"\",\"\",'4x100m'!$K$23)","v":""}]
[null,{"$f":"Start!$C26","v":20},{"$f":"IF(Start!$D26=\"\",\"\",Start!$D26)","v":""},{"$f":"IF(Start!$E26=\"\",\"\",Start!$E26)","v":""},{"$f":"IF($C47=\"\",\"\",IF('V.l.ZPV'!$C$6=\"\",\"0\",IF(ISNA(MATCH($C47,ZPVOblN,0)),COUNTIF(ZPVOblT,\".\")+1,LOOKUP($C47,ZPVOblN,ZPVOblD))))","v":""},{"$f":"IF($C$9=\"\",\"\",PÚ!$G$24)","v":""},{"$f":"IF($C47=\"\",\"\",PÚ!$P$24)","v":""},{"$f":"IF($C$9=\"\",\"\",'4x100m'!$G$24)","v":""},{"$f":"IF($C47=\"\",\"\",'4x100m'!$P$24)","v":""},{"$f":"IF($C47=\"\",\"\",TEST!$D$24)","v":""},{"$f":"IF($C47=\"\",\"\",TEST!$H$24)","v":""},{"$f":"IF($C47=\"\",\"\",'PJ-C'!$M$66)","v":""},{"$f":"IF($C47=\"\",\"\",'PJ-C'!$Q$66)","v":""},null,{"$f":"IF($C$9=\"\",\"\",SUM(E47,G47,I47,K47,M47))","v":0},null,{"$f":"IF($C47=\"\",\"\",MATCH($C47,Výsledky!$M$8:$M$32,0))","v":""}]
[null,null,null,null,null,{"$f":"IF($C$9=\"\",\"\",PÚ!$K$24)","v":""},null,{"$f":"IF($C$9=\"\",\"\",'4x100m'!$K$24)","v":""}]
[null,{"$f":"Start!$C27","v":21},{"$f":"IF(Start!$D27=\"\",\"\",Start!$D27)","v":""},{"$f":"IF(Start!$E27=\"\",\"\",Start!$E27)","v":""},{"$f":"IF($C49=\"\",\"\",IF('V.l.ZPV'!$C$6=\"\",\"0\",IF(ISNA(MATCH($C49,ZPVOblN,0)),COUNTIF(ZPVOblT,\".\")+1,LOOKUP($C49,ZPVOblN,ZPVOblD))))","v":""},{"$f":"IF($C$9=\"\",\"\",PÚ!$G$25)","v":""},{"$f":"IF($C49=\"\",\"\",PÚ!$P$25)","v":""},{"$f":"IF($C$9=\"\",\"\",'4x100m'!$G$25)","v":""},{"$f":"IF($C49=\"\",\"\",'4x100m'!$P$25)","v":""},{"$f":"IF($C49=\"\",\"\",TEST!$D$25)","v":""},{"$f":"IF($C49=\"\",\"\",TEST!$H$25)","v":""},{"$f":"IF($C49=\"\",\"\",'PJ-C'!$M$73)","v":""},{"$f":"IF($C49=\"\",\"\",'PJ-C'!$Q$73)","v":""},null,{"$f":"IF($C$9=\"\",\"\",SUM(E49,G49,I49,K49,M49))","v":0},null,{"$f":"IF($C49=\"\",\"\",MATCH($C49,Výsledky!$M$8:$M$32,0))","v":""}]
[null,null,null,null,null,{"$f":"IF($C$9=\"\",\"\",PÚ!$K$25)","v":""},null,{"$f":"IF($C$9=\"\",\"\",'4x100m'!$K$25)","v":""}]
[null,{"$f":"Start!$C28","v":22},{"$f":"IF(Start!$D28=\"\",\"\",Start!$D28)","v":""},{"$f":"IF(Start!$E28=\"\",\"\",Start!$E28)","v":""},{"$f":"IF($C51=\"\",\"\",IF('V.l.ZPV'!$C$6=\"\",\"0\",IF(ISNA(MATCH($C51,ZPVOblN,0)),COUNTIF(ZPVOblT,\".\")+1,LOOKUP($C51,ZPVOblN,ZPVOblD))))","v":""},{"$f":"IF($C$9=\"\",\"\",PÚ!$G$26)","v":""},{"$f":"IF($C51=\"\",\"\",PÚ!$P$26)","v":""},{"$f":"IF($C$9=\"\",\"\",'4x100m'!$G$26)","v":""},{"$f":"IF($C51=\"\",\"\",'4x100m'!$P$26)","v":""},{"$f":"IF($C51=\"\",\"\",TEST!$D$26)","v":""},{"$f":"IF($C51=\"\",\"\",TEST!$H$26)","v":""},{"$f":"IF($C51=\"\",\"\",'PJ-C'!$M$76)","v":""},{"$f":"IF($C51=\"\",\"\",'PJ-C'!$Q$76)","v":""},null,{"$f":"IF($C$9=\"\",\"\",SUM(E51,G51,I51,K51,M51))","v":0},null,{"$f":"IF($C51=\"\",\"\",MATCH($C51,Výsledky!$M$8:$M$32,0))","v":""}]
[null,null,null,null,null,{"$f":"IF($C$9=\"\",\"\",PÚ!$K$26)","v":""},null,{"$f":"IF($C$9=\"\",\"\",'4x100m'!$K$26)","v":""}]
[null,{"$f":"Start!$C29","v":23},{"$f":"IF(Start!$D29=\"\",\"\",Start!$D29)","v":""},{"$f":"IF(Start!$E29=\"\",\"\",Start!$E29)","v":""},{"$f":"IF($C53=\"\",\"\",IF('V.l.ZPV'!$C$6=\"\",\"0\",IF(ISNA(MATCH($C53,ZPVOblN,0)),COUNTIF(ZPVOblT,\".\")+1,LOOKUP($C53,ZPVOblN,ZPVOblD))))","v":""},{"$f":"IF($C$9=\"\",\"\",PÚ!$G$27)","v":""},{"$f":"IF($C53=\"\",\"\",PÚ!$P$27)","v":""},{"$f":"IF($C$9=\"\",\"\",'4x100m'!$G$27)","v":""},{"$f":"IF($C53=\"\",\"\",'4x100m'!$P$27)","v":""},{"$f":"IF($C53=\"\",\"\",TEST!$D$27)","v":""},{"$f":"IF($C53=\"\",\"\",TEST!$H$27)","v":""},{"$f":"IF($C53=\"\",\"\",'PJ-C'!$M$79)","v":""},{"$f":"IF($C53=\"\",\"\",'PJ-C'!$Q$79)","v":""},null,{"$f":"IF($C$9=\"\",\"\",SUM(E53,G53,I53,K53,M53))","v":0},null,{"$f":"IF($C53=\"\",\"\",MATCH($C53,Výsledky!$M$8:$M$32,0))","v":""}]
[null,null,null,null,null,{"$f":"IF($C$9=\"\",\"\",PÚ!$K$27)","v":""},null,{"$f":"IF($C$9=\"\",\"\",'4x100m'!$K$27)","v":""}]
[null,{"$f":"Start!$C30","v":24},{"$f":"IF(Start!$D30=\"\",\"\",Start!$D30)","v":""},{"$f":"IF(Start!$E30=\"\",\"\",Start!$E30)","v":""},{"$f":"IF($C55=\"\",\"\",IF('V.l.ZPV'!$C$6=\"\",\"0\",IF(ISNA(MATCH($C55,ZPVOblN,0)),COUNTIF(ZPVOblT,\".\")+1,LOOKUP($C55,ZPVOblN,ZPVOblD))))","v":""},{"$f":"IF($C$9=\"\",\"\",PÚ!$G$28)","v":""},{"$f":"IF($C55=\"\",\"\",PÚ!$P$28)","v":""},{"$f":"IF($C$9=\"\",\"\",'4x100m'!$G$28)","v":""},{"$f":"IF($C55=\"\",\"\",'4x100m'!$P$28)","v":""},{"$f":"IF($C55=\"\",\"\",TEST!$D$28)","v":""},{"$f":"IF($C55=\"\",\"\",TEST!$H$28)","v":""},{"$f":"IF($C55=\"\",\"\",'PJ-C'!$M$82)","v":""},{"$f":"IF($C55=\"\",\"\",'PJ-C'!$Q$82)","v":""},null,{"$f":"IF($C$9=\"\",\"\",SUM(E55,G55,I55,K55,M55))","v":0},null,{"$f":"IF($C55=\"\",\"\",MATCH($C55,Výsledky!$M$8:$M$32,0))","v":""}]
[null,null,null,null,null,{"$f":"IF($C$9=\"\",\"\",PÚ!$K$28)","v":""},null,{"$f":"IF($C$9=\"\",\"\",'4x100m'!$K$28)","v":""}]
[null,{"$f":"Start!$C31","v":25},{"$f":"IF(Start!$D31=\"\",\"\",Start!$D31)","v":""},{"$f":"IF(Start!$E31=\"\",\"\",Start!$E31)","v":""},{"$f":"IF($C57=\"\",\"\",IF('V.l.ZPV'!$C$6=\"\",\"0\",IF(ISNA(MATCH($C57,ZPVOblN,0)),COUNTIF(ZPVOblT,\".\")+1,LOOKUP($C57,ZPVOblN,ZPVOblD))))","v":""},{"$f":"IF($C$9=\"\",\"\",PÚ!$G$29)","v":""},{"$f":"IF($C57=\"\",\"\",PÚ!$P$29)","v":""},{"$f":"IF($C$9=\"\",\"\",'4x100m'!$G$29)","v":""},{"$f":"IF($C57=\"\",\"\",'4x100m'!$P$29)","v":""},{"$f":"IF($C57=\"\",\"\",TEST!$D$29)","v":""},{"$f":"IF($C57=\"\",\"\",TEST!$H$29)","v":""},{"$f":"IF($C57=\"\",\"\",'PJ-C'!$M$85)","v":""},{"$f":"IF($C57=\"\",\"\",'PJ-C'!$Q$85)","v":""},null,{"$f":"IF($C$9=\"\",\"\",SUM(E57,G57,I57,K57,M57))","v":0},null,{"$f":"IF($C57=\"\",\"\",MATCH($C57,Výsledky!$M$8:$M$32,0))","v":""}]
[null,null,null,null,null,{"$f":"IF($C$9=\"\",\"\",PÚ!$K$29)","v":""},null,{"$f":"IF($C$9=\"\",\"\",'4x100m'!$K$29)","v":""}]

{"sheet":"Pozn.","index":22,"n_rows":1,"n_cols":2,"rows_kept":1,"cut":false,"hidden":false,"merged":[[0,1,0,9]]}
[null,"Poznámky:"]

{"sheet":"J","index":23,"n_rows":225,"n_cols":9,"rows_kept":225,"cut":false,"hidden":false,"merged":[]}
["Vraspírová Valerie","Kamenec",null,null,1,null,null,null,{"$f":"COUNTA(B1:B175)","v":42}]
["Štveráková Kristýna","Lukavice",null,null,2]
["Zachová Lenka","Lubná",null,null,3]
["Bubeníčková Denisa","Skuteč",null,null,4]
["Kumulová Eliška","Bystřec",null,null,5]
["Sýkorová Kateřina","Letohrad Kunčice",null,null,6]
["Cejpová Adéla","Kamenec",null,null,7]
["Marečková Pavla","Lukavice",null,null,8]
["Lorencová Veronika","Lubná",null,null,9]
["Jonášová Andrea","Skuteč",null,null,10]
["Vaníčková Tereza","Bystřec",null,null,11]
["Majvaldová Tereza","Letohrad Kunčice",null,null,12]
["Andrlíková Vendula","Kamenec",null,null,13]
["Bočková Sára","Lukavice",null,null,14]
["Zachová Aneta","Lubná",null,null,15]
["Novotná Leona","Skuteč",null,null,16]
["Černohorská Nikola ","Bystřec",null,null,17]
["Majvaldová Adela","Letohrad Kunčice",null,null,18]
["Cejpová Jana","Kamenec",null,null,19]
["Zavoralová Klára","Lukavice",null,null,20]
["Silová Michaela","Lubná",null,null,21]
["Slezáková Nela","Skuteč",null,null,22]
["Hrdinová Adéla","Bystřec",null,null,23]
["Krejsová Nikola","Letohrad Kunčice",null,null,24]
["Bartoníčková Karolína","Kamenec",null,null,25]
["Marečková Veronika","Lukavice",null,null,26]
["Faltysová Marketa","Lubná",null,null,27]
["Šulcová Soňa","Skuteč",null,null,28]
["Hrdinová Lucie","Bystřec",null,null,29]
["Sýkorová Veronika","Letohrad Kunčice",null,null,30]
["Andrlíková Anna","Kamenec",null,null,31]
["Hospodková Tereza","Lukavice",null,null,32]
["Brázdová Ilona","Lubná",null,null,33]
["Zavoralová Aneta","Skuteč",null,null,34]
["Pfeiferová Valerie","Bystřec",null,null,35]
["Strasmeierová Eliška","Letohrad Kunčice",null,null,36]
["Němcová Barbora","Kamenec",null,null,37]
["Nováková Markéta","Lukavice",null,null,38]
["Kusá Kateřina","Lubná",null,null,39]
["Zavoralová Karolína","Skuteč",null,null,40]
["Dolečková Kristýna","Bystřec",null,null,41]
["Dudková Martina","Letohrad Kunčice",null,null,42]
[null,null,null,null,43]
[null,null,null,null,44]
[null,null,null,null,45]
[null,null,null,null,46]
[null,null,null,null,47]
[null,null,null,null,48]
[null,null,null,null,49]
[null,null,null,null,50]
[null,null,null,null,51]
[null,null,null,null,52]
[null,null,null,null,53]
[null,null,null,null,54]
[null,null,null,null,55]
[null,null,null,null,56]
[null,null,null,null,57]
[null,null,null,null,58]
[null,null,null,null,59]
[null,null,null,null,60]
[null,null,null,null,61]
[null,null,null,null,62]
[null,null,null,null,63]
[null,null,null,null,64]
[null,null,null,null,65]
[null,null,null,null,66]
[null,null,null,null,67]
[null,null,null,null,68]
[null,null,null,null,69]
[null,null,null,null,70]
[null,null,null,null,71]
[null,null,null,null,72]
[null,null,null,null,73]
[null,null,null,null,74]
[null,null,null,null,75]
[null,null,null,null,76]
[null,null,null,null,77]
[null,null,null,null,78]
[null,null,null,null,79]
[null,null,null,null,80]
[null,null,null,null,81]
[null,null,null,null,82]
[null,null,null,null,83]
[null,null,null,null,84]
[null,null,null,null,85]
[null,null,null,null,86]
[null,null,null,null,87]
[null,null,null,null,88]
[null,null,null,null,89]
[null,null,null,null,90]
[null,null,null,null,91]
[null,null,null,null,92]
[null,null,null,null,93]
[null,null,null,null,94]
[null,null,null,null,95]
[null,null,null,null,96]
[null,null,null,null,97]
[null,null,null,null,98]
[null,null,null,null,99]
[null,null,null,null,100]
[null,null,null,null,101]
[null,null,null,null,102]
[null,null,null,null,103]
[null,null,null,null,104]
[null,null,null,null,105]
[null,null,null,null,106]
[null,null,null,null,107]
[null,null,null,null,108]
[null,null,null,null,109]
[null,null,null,null,110]
[null,null,null,null,111]
[null,null,null,null,112]
[null,null,null,null,113]
[null,null,null,null,114]
[null,null,null,null,115]
[null,null,null,null,116]
[null,null,null,null,117]
[null,null,null,null,118]
[null,null,null,null,119]
[null,null,null,null,120]
[null,null,null,null,121]
[null,null,null,null,122]
[null,null,null,null,123]
[null,null,null,null,124]
[null,null,null,null,125]
[null,null,null,null,126]
[null,null,null,null,127]
[null,null,null,null,128]
[null,null,null,null,129]
[null,null,null,null,130]
[null,null,null,null,131]
[null,null,null,null,132]
[null,null,null,null,133]
[null,null,null,null,134]
[null,null,null,null,135]
[null,null,null,null,136]
[null,null,null,null,137]
[null,null,null,null,138]
[null,null,null,null,139]
[null,null,null,null,140]
[null,null,null,null,141]
[null,null,null,null,142]
[null,null,null,null,143]
[null,null,null,null,144]
[null,null,null,null,145]
[null,null,null,null,146]
[null,null,null,null,147]
[null,null,null,null,148]
[null,null,null,null,149]
[null,null,null,null,150]
[null,null,null,null,151]
[null,null,null,null,152]
[null,null,null,null,153]
[null,null,null,null,154]
[null,null,null,null,155]
[null,null,null,null,156]
[null,null,null,null,157]
[null,null,null,null,158]
[null,null,null,null,159]
[null,null,null,null,160]
[null,null,null,null,161]
[null,null,null,null,162]
[null,null,null,null,163]
[null,null,null,null,164]
[null,null,null,null,165]
[null,null,null,null,166]
[null,null,null,null,167]
[null,null,null,null,168]
[null,null,null,null,169]
[null,null,null,null,170]
[null,null,null,null,171]
[null,null,null,null,172]
[null,null,null,null,173]
[null,null,null,null,174]
[null,null,null,null,175]
[null,null,null,null,176]
[null,null,null,null,177]
[null,null,null,null,178]
[null,null,null,null,179]
[null,null,null,null,180]
[null,null,null,null,181]
[null,null,null,null,182]
[null,null,null,null,183]
[null,null,null,null,184]
[null,null,null,null,185]
[null,null,null,null,186]
[null,null,null,null,187]
[null,null,null,null,188]
[null,null,null,null,189]
[null,null,null,null,190]
[null,null,null,null,191]
[null,null,null,null,192]
[null,null,null,null,193]
[null,null,null,null,194]
[null,null,null,null,195]
[null,null,null,null,196]
[null,null,null,null,197]
[null,null,null,null,198]
[null,null,null,null,199]
[null,null,null,null,200]
[null,null,null,null,201]
[null,null,null,null,202]
[null,null,null,null,203]
[null,null,null,null,204]
[null,null,null,null,205]
[null,null,null,null,206]
[null,null,null,null,207]
[null,null,null,null,208]
[null,null,null,null,209]
[null,null,null,null,210]
[null,null,null,null,211]
[null,null,null,null,212]
[null,null,null,null,213]
[null,null,null,null,214]
[null,null,null,null,215]
[null,null,null,null,216]
[null,null,null,null,217]
[null,null,null,null,218]
[null,null,null,null,219]
[null,null,null,null,220]
[null,null,null,null,221]
[null,null,null,null,222]
[null,null,null,null,223]
[null,null,null,null,224]
[null,null,null,null,225]